siren,nic,siret,statutDiffusionEtablissement,dateCreationEtablissement,trancheEffectifsEtablissement,anneeEffectifsEtablissement,activitePrincipaleRegistreMetiersEtablissement,dateDernierTraitementEtablissement,etablissementSiege,nombrePeriodesEtablissement,complementAdresseEtablissement,numeroVoieEtablissement,indiceRepetitionEtablissement,typeVoieEtablissement,libelleVoieEtablissement,codePostalEtablissement,libelleCommuneEtablissement,libelleCommuneEtrangerEtablissement,distributionSpecialeEtablissement,codeCommuneEtablissement,codeCedexEtablissement,libelleCedexEtablissement,codePaysEtrangerEtablissement,libellePaysEtrangerEtablissement,complementAdresse2Etablissement,numeroVoie2Etablissement,indiceRepetition2Etablissement,typeVoie2Etablissement,libelleVoie2Etablissement,codePostal2Etablissement,libelleCommune2Etablissement,libelleCommuneEtranger2Etablissement,distributionSpeciale2Etablissement,codeCommune2Etablissement,codeCedex2Etablissement,libelleCedex2Etablissement,codePaysEtranger2Etablissement,libellePaysEtranger2Etablissement,dateDebut,etatAdministratifEtablissement,enseigne1Etablissement,enseigne2Etablissement,enseigne3Etablissement,denominationUsuelleEtablissement,activitePrincipaleEtablissement,nomenclatureActivitePrincipaleEtablissement,caractereEmployeurEtablissement,longitude,latitude,geo_score,geo_type,geo_adresse,geo_id,geo_ligne,geo_l4,geo_l5
130012669,00185,13001266900185,O,2010-10-01,NN,,,2022-08-02T16:35:34,false,2,,24,,AV,VICTOR PILHES,09400,TARASCON-SUR-ARIEGE,,BP 70146,09306,,,,,,,,,,,,,,,,,,,2022-09-01,F,TRESORERIE DE TARASCON-SUR-ARIEGE,,,,84.11Z,NAFRev2,N,1.60517,42.848476,0.87,housenumber,24 Avenue Victor Pilhes 09400 Tarascon-sur-Ariège,09306_0195_00024,G,24 AVENUE VICTOR PILHES,
170902118,00125,17090211800125,O,1983-03-16,,,,2019-11-14T14:00:16,false,4,,24,,AV,VICTOR PILHES,09400,TARASCON-SUR-ARIEGE,,BP 46,09306,,,,,,,,,,,,,,,,,,,2010-10-01,F,TRESORERIE TARASCON-SUR-ARIEGE,,,,84.11Z,NAFRev2,N,1.60517,42.848476,0.87,housenumber,24 Avenue Victor Pilhes 09400 Tarascon-sur-Ariège,09306_0195_00024,G,24 AVENUE VICTOR PILHES,
170906614,00046,17090661400046,O,1985-02-18,NN,,,2019-11-14T14:00:16,false,3,,,,,QUARTIER STE QUITERIE,09400,TARASCON-SUR-ARIEGE,,,09306,,,,,,,,,,,,,,,,,,,1996-01-29,F,DDE SUBDIVISION DE TARASCON,,,,75.1E,NAF1993,N,1.604617,42.845865,0.48,street,Rue Sainte Quitterie 09400 Tarascon-sur-Ariège,09306_0170,G,RUE SAINTE QUITTERIE,
170906614,00178,17090661400178,O,1996-01-29,NN,,,2019-11-14T14:00:16,false,4,,,,RUE,DE LA REPUBLIQUE,09400,TARASCON-SUR-ARIEGE,,,09306,,,,,,,,,,,,,,,,,,,2009-01-01,F,DDE SUBDVISION DE TARASCON,,,,84.13Z,NAFRev2,N,1.60482,42.845437,0.86,street,Avenue de la République 09400 Tarascon-sur-Ariège,09306_0150,G,AVENUE DE LA REPUBLIQUE,
173102310,00062,17310231000062,O,1985-02-28,NN,,,2019-11-14T14:00:16,false,3,,10,B,RUE,PEYREVIDAL,09400,TARASCON-SUR-ARIEGE,,,09306,,,,,,,,,,,,,,,,,,,1995-12-31,F,DOUANES:SUBDIVISION TARASCON,,,,75.1A,NAF1993,N,1.60322,42.84774,0.76,housenumber,10bis Avenue Peyrevidal 09400 Tarascon-sur-Ariège,09306_0115_00010_bis,G,10BIS AVENUE PEYREVIDAL,
173102310,00310,17310231000310,O,1985-03-01,,,,2019-11-14T14:00:16,false,3,,10,B,RUE,PEYREVIDAL,09400,TARASCON-SUR-ARIEGE,,,09306,,,,,,,,,,,,,,,,,,,1995-12-31,F,DOUANES BRIGADE INTER TARASCON,,,,75.1A,NAF1993,N,1.60322,42.84774,0.76,housenumber,10bis Avenue Peyrevidal 09400 Tarascon-sur-Ariège,09306_0115_00010_bis,G,10BIS AVENUE PEYREVIDAL,
173102310,00971,17310231000971,O,1995-12-31,NN,,,2019-11-14T14:00:16,false,3,,19,,AV,DE SABART,09400,TARASCON-SUR-ARIEGE,,BP 47,09306,,,,,,,,,,,,,,,,,,,2008-01-01,A,SUBDIVISION DE TARASCON,,,,84.11Z,NAFRev2,N,1.602339,42.839959,0.84,housenumber,19 Avenue de Sabart 09400 Tarascon-sur-Ariège,09306_0155_00019,G,19 AVENUE DE SABART,
173102310,00989,17310231000989,O,1995-12-31,01,2020,,2022-08-29T09:03:52,false,3,,19,,AV,DE SABART,09400,TARASCON-SUR-ARIEGE,,BP 47,09306,,,,,,,,,,,,,,,,,,,2008-01-01,A,DOUANES:BRIGADE DE SURVEIL ET D'INTERVEN,,,,84.11Z,NAFRev2,N,1.602339,42.839959,0.84,housenumber,19 Avenue de Sabart 09400 Tarascon-sur-Ariège,09306_0155_00019,G,19 AVENUE DE SABART,
180046013,00595,18004601300595,O,1997-05-16,,,,2019-11-14T14:00:16,false,3,,,,,,09400,TARASCON-SUR-ARIEGE,,,09306,,,,,,,,,,,,,,,,,,,2008-01-01,A,GROTTES DE NIAUX,,,,91.03Z,NAFRev2,N,,,0,,,,,,
190905463,00013,19090546300013,O,1973-03-14,21,2020,,2022-08-29T09:04:17,true,6,,,,RUE,DE BERGA,09400,TARASCON-SUR-ARIEGE,,BP 40143,09306,,,,,,,,,,,,,,,,,,,2018-01-03,A,SITE DE TARASCON,,,,85.31Z,NAFRev2,O,1.602989,42.844781,0.95,street,Rue de Berga 09400 Tarascon-sur-Ariège,09306_0007,G,RUE DE BERGA,
200095156,00010,20009515600010,O,2021-02-01,,,,2021-02-02T06:53:35,true,1,,98,,AV,VICTOR PILHES,09400,TARASCON-SUR-ARIEGE,,,09306,,,,,,,,,,,,,,,,,,,2021-02-01,A,,,,,84.11Z,NAFRev2,O,1.601201,42.856041,0.87,housenumber,98 Avenue Victor Pilhes 09400 Tarascon-sur-Ariège,09306_0195_00098,G,98 AVENUE VICTOR PILHES,
200096782,00012,20009678200012,O,2022-01-01,,,,2021-12-13T16:37:51,true,1,,,,,SEDOUR LAFRAU HAUT,09400,TARASCON-SUR-ARIEGE,,,09306,,,,,,,,,,,,,,,,,,,2022-01-01,A,,,,,87.10A,NAFRev2,N,1.60819,42.850993,0.58,street,Lafrau Haute 09400 Tarascon-sur-Ariège,09306_B060,G,LAFRAU HAUTE,
200096782,00020,20009678200020,O,2022-01-01,,,,2021-12-13T16:43:17,false,1,,8,,QUA,DE L'AYROULE,09400,TARASCON-SUR-ARIEGE,,,09306,,,,,,,,,,,,,,,,,,,2022-01-01,A,SSIAD,,,,86.90D,NAFRev2,N,1.608385,42.842473,0.72,housenumber,8 Avenue de l’Ayroule 09400 Tarascon-sur-Ariège,09306_0003_00008,G,8 AVENUE DE L AYROULE,
210903068,00018,21090306800018,O,1983-03-01,21,2020,,2022-08-29T09:05:52,true,4,,30,,AV,VICTOR PILHES,09400,TARASCON-SUR-ARIEGE,,,09306,,,,,,,,,,,,,,,,,,,2008-01-01,A,MAIRIE,,,,84.11Z,NAFRev2,O,1.605104,42.848616,0.87,housenumber,30 Avenue Victor Pilhes 09400 Tarascon-sur-Ariège,09306_0195_00030,G,30 AVENUE VICTOR PILHES,
210903068,00042,21090306800042,O,1983-12-21,01,2020,,2022-08-29T09:05:52,false,4,,,,,HAMEAU DE BANAT,09400,TARASCON-SUR-ARIEGE,,,09306,,,,,,,,,,,,,,,,,,,2008-01-01,A,ECOLE MATERNELLE,,,,85.10Z,NAFRev2,N,1.568037,42.853609,0.44,street,Banat 09400 Tarascon-sur-Ariège,09306_ftvnnw,G,BANAT,
210903068,00059,21090306800059,O,1983-12-21,11,2020,,2022-10-04T17:18:44,false,5,,,,RUE,DES FONTANELLES,09400,TARASCON-SUR-ARIEGE,,,09306,,,,,,,,,,,,,,,,,,,2008-01-01,A,ECOLE ELEMENTAIRE LE PRADELET,,,,85.20Z,NAFRev2,N,1.607114,42.848668,0.95,street,Rue des Fontanelles 09400 Tarascon-sur-Ariège,09306_0061,G,RUE DES FONTANELLES,
210903068,00067,21090306800067,O,1983-12-21,02,2020,,2022-08-29T09:05:52,false,4,,,,RUE,FONTANELLES,09400,TARASCON-SUR-ARIEGE,,,09306,,,,,,,,,,,,,,,,,,,2008-01-01,A,ECOLE MATERNELLE LE PRADELET,,,,85.10Z,NAFRev2,N,1.607114,42.848668,0.89,street,Rue des Fontanelles 09400 Tarascon-sur-Ariège,09306_0061,G,RUE DES FONTANELLES,
210903068,00083,21090306800083,O,1983-12-21,NN,,,2019-11-14T14:00:16,false,4,,,,,SABART,09400,TARASCON-SUR-ARIEGE,,,09306,,,,,,,,,,,,,,,,,,,2003-09-01,F,ECOLE MATERNELLE PUBLIQUE,,,,80.1Z,NAFRev1,N,1.602422,42.840902,0.93,street,Avenue de Sabart 09400 Tarascon-sur-Ariège,09306_0155,G,AVENUE DE SABART,
210903068,00091,21090306800091,O,1995-12-25,NN,,,2020-07-22T08:14:10,false,2,MAIRIE,30,,AV,VICTOR PILHES,09400,TARASCON-SUR-ARIEGE,,,09306,,,,,,,,,,,,,,,,,,,2008-01-01,A,SCE EAU,,,,36.00Z,NAFRev2,N,1.605104,42.848616,0.87,housenumber,30 Avenue Victor Pilhes 09400 Tarascon-sur-Ariège,09306_0195_00030,G,30 AVENUE VICTOR PILHES,
210903068,00109,21090306800109,O,1995-12-25,NN,,,2019-11-14T14:00:16,false,3,MAIRIE,30,,AV,PILHES,09400,TARASCON-SUR-ARIEGE,,,09306,,,,,,,,,,,,,,,,,,,2008-01-01,A,SERVICE ORDURES MENAGERES,,,,38.11Z,NAFRev2,N,1.605104,42.848616,0.81,housenumber,30 Avenue Victor Pilhes 09400 Tarascon-sur-Ariège,09306_0195_00030,G,30 AVENUE VICTOR PILHES,
210903068,00117,21090306800117,O,1995-12-25,NN,,,2019-11-14T14:00:16,false,2,MAIRIE,30,,AV,VICTOR PILHES,09400,TARASCON-SUR-ARIEGE,,,09306,,,,,,,,,,,,,,,,,,,2008-01-01,A,SERVICE ASSAINISSEMENT,,,,37.00Z,NAFRev2,N,1.605104,42.848616,0.87,housenumber,30 Avenue Victor Pilhes 09400 Tarascon-sur-Ariège,09306_0195_00030,G,30 AVENUE VICTOR PILHES,
210903068,00125,21090306800125,O,1999-12-17,NN,,,2019-11-14T14:00:16,false,4,MAIRIE,,,AV,PILHES,09400,TARASCON-SUR-ARIEGE,,,09306,,,,,,,,,,,,,,,,,,,2012-12-25,F,REGIE DU CENTRE ACCUEIL ET D'HEBERGEMENT,,,,93.11Z,NAFRev2,N,1.603454,42.852848,0.76,street,Avenue Victor Pilhes 09400 Tarascon-sur-Ariège,09306_0195,G,AVENUE VICTOR PILHES,
210903068,00133,21090306800133,O,2001-07-05,NN,,,2019-11-14T14:00:16,false,4,MAIRIE,,,,,09400,TARASCON-SUR-ARIEGE,,,09306,,,,,,,,,,,,,,,,,,,2012-12-25,F,REGIE CULTURELLE MUNICIPALE,,,,84.13Z,NAFRev2,N,1.602523,42.851719,0.52,street,Rue du 8 Mai 09400 Tarascon-sur-Ariège,09306_0074,D,RUE DU 8 MAI,
210903068,00141,21090306800141,O,2002-11-12,,,,2019-11-14T14:00:16,false,5,,,,,,09400,TARASCON-SUR-ARIEGE,,,09306,,,,,,,,,,,,,,,,,,,2015-01-01,F,REGIE D'ELECTRICITE,,,,35.13Z,NAFRev2,O,,,0,,,,,,
210903068,00174,21090306800174,O,2014-01-01,,,,2019-11-14T14:00:16,false,1,CENTRE MULTIMEDIA ESPACE F. MITTERRAND,,,AV,PAUL JOUCLA,09400,TARASCON-SUR-ARIEGE,,,09306,,,,,,,,,,,,,,,,,,,2014-01-01,A,CINEMA,,,,59.11C,NAFRev2,N,1.604857,42.846863,0.82,street,Avenue Paul Joucla 09400 Tarascon-sur-Ariège,09306_0113,G,AVENUE PAUL JOUCLA,
220900013,00107,22090001300107,O,1985-01-07,NN,,,2019-11-14T14:00:16,false,3,,,,RUE,FRADELET,09400,TARASCON-SUR-ARIEGE,,,09306,,,,,,,,,,,,,,,,,,,2004-04-22,F,DISPENSAIRE POLYVALENT,,,,85.1C,NAFRev1,N,1.605612,42.849038,0.73,street,Rue du Pradélet 09400 Tarascon-sur-Ariège,09306_0126,G,RUE DU PRADELET,
220900013,00289,22090001300289,O,2004-04-22,12,2020,,2022-08-29T09:09:38,false,4,SCE EXPLOITATION SITES TOURIST ARIEGE,,,,LACOMBE,09400,TARASCON-SUR-ARIEGE,,,09306,,,,,,,,,,,,,,,,,,,2010-06-18,A,PARC DE LA PREHISTOIRE,,,,91.03Z,NAFRev2,O,1.584249,42.855145,0.95,street,Lacombe 09400 Tarascon-sur-Ariège,09306_xxkjkn,G,LACOMBE,
220900013,00339,22090001300339,O,2004-04-22,NN,,,2021-10-27T08:11:35,false,3,,,,RUE,JEAN MOULIN,09400,TARASCON-SUR-ARIEGE,,,09306,,,,,,,,,,,,,,,,,,,2008-01-01,A,CENTRE LOCAL DE TARASCON,,,,86.21Z,NAFRev2,O,1.60581,42.850075,0.96,street,Rue Jean Moulin 09400 Tarascon-sur-Ariège,09306_0081,G,RUE JEAN MOULIN,
220900013,00370,22090001300370,O,2007-01-01,NN,,,2021-10-27T08:11:35,false,2,,,,RUE,DE BERGA,09400,TARASCON-SUR-ARIEGE,,,09306,,,,,,,,,,,,,,,,,,,2008-01-01,A,DISTRICT EQUIPT FOIX HTE ARIEGE,,,,84.12Z,NAFRev2,N,1.602989,42.844781,0.95,street,Rue de Berga 09400 Tarascon-sur-Ariège,09306_0007,G,RUE DE BERGA,
240900126,00014,24090012600014,O,1983-03-01,NN,,,2019-11-14T14:00:16,true,3,,,,AV,VICTOR PILHES,09400,TARASCON-SUR-ARIEGE,,,09306,,,,,,,,,,,,,,,,,,,1996-12-25,F,,,,,75.1A,NAF1993,N,1.603454,42.852848,0.85,street,Avenue Victor Pilhes 09400 Tarascon-sur-Ariège,09306_0195,G,AVENUE VICTOR PILHES,
240900290,00018,24090029000018,O,,NN,,,2019-11-14T14:00:16,true,1,,,,,MAIRIE,09400,TARASCON-SUR-ARIEGE,,,09306,,,,,,,,,,,,,,,,,,,1995-05-16,F,,,,,75.1A,NAF1993,N,3.0709671,50.6304695,0.92,poi.townhall,Hôtel de Ville Lille,https://osm.org/way/40917078,G,,
240900431,00018,24090043100018,O,1994-07-21,11,2020,,2022-08-29T09:09:40,true,3,,19,,RUE,DE SABART,09400,TARASCON-SUR-ARIEGE,,BP 30133,09306,09401,TARASCON SUR ARIEGE CEDEX,,,,,,,,,,,,,,,,,2008-01-01,A,,,,,84.11Z,NAFRev2,O,1.602339,42.839959,0.8,housenumber,19 Avenue de Sabart 09400 Tarascon-sur-Ariège,09306_0155_00019,G,19 AVENUE DE SABART,
240900431,00026,24090043100026,O,1995-03-17,00,2020,,2022-08-29T09:09:40,false,3,,19,,RUE,DE SABART,09400,TARASCON-SUR-ARIEGE,,,09306,,,,,,,,,,,,,,,,,,,2008-01-01,A,REGIE GEST PLAN EAU BOMPAS MERCUS,,,,84.11Z,NAFRev2,N,1.602339,42.839959,0.8,housenumber,19 Avenue de Sabart 09400 Tarascon-sur-Ariège,09306_0155_00019,G,19 AVENUE DE SABART,
240900431,00034,24090043100034,O,1996-08-01,NN,,,2019-11-14T14:00:16,false,4,,,,AV,VICTOR PILHES,09400,TARASCON-SUR-ARIEGE,,,09306,,,,,,,,,,,,,,,,,,,2017-11-01,F,ATELIER RELAIS MAROQUINERIE,,,,68.20B,NAFRev2,N,1.603454,42.852848,0.85,street,Avenue Victor Pilhes 09400 Tarascon-sur-Ariège,09306_0195,G,AVENUE VICTOR PILHES,
240900431,00042,24090043100042,O,2004-01-01,NN,,,2019-11-14T14:00:16,false,3,,30,,AV,V PILHES,09400,TARASCON-SUR-ARIEGE,,,09306,,,,,,,,,,,,,,,,,,,2008-01-01,A,TRANSPORT A LA DEMANDE,,,,49.32Z,NAFRev2,N,1.605104,42.848616,0.72,housenumber,30 Avenue Victor Pilhes 09400 Tarascon-sur-Ariège,09306_0195_00030,G,30 AVENUE VICTOR PILHES,
240900431,00059,24090043100059,O,2005-12-25,,,,2019-11-14T14:00:16,false,3,,21,,AV,DE SABART,09400,TARASCON-SUR-ARIEGE,,,09306,,,,,,,,,,,,,,,,,,,2017-12-31,F,CENTRE LOCAL INFORMATION COORDINATION,,,,88.99B,NAFRev2,N,1.602686,42.839496,0.84,housenumber,21 Avenue de Sabart 09400 Tarascon-sur-Ariège,09306_0155_00021,G,21 AVENUE DE SABART,
250900420,00028,25090042000028,O,1986-07-01,NN,,,2019-11-14T14:00:16,true,4,,,,,QUARTIER ST ROCH,09400,TARASCON-SUR-ARIEGE,,,09306,,,,,,,,,,,,,,,,,,,2002-09-04,F,SICOM ORDURES MENAGERES TARASCON,,,,90.0B,NAF1993,O,1.598877,42.846734,0.51,street,Quartier des Arrigols 09400 Tarascon-sur-Ariège,09306_attox1,G,QUARTIER DES ARRIGOLS,
250900453,00037,25090045300037,O,1986-07-01,NN,,,2019-11-14T14:00:16,false,6,,,,,QUARTIER ST ROCH,09400,TARASCON-SUR-ARIEGE,,,09306,,,,,,,,,,,,,,,,,,,2011-05-12,F,,,,,36.00Z,NAFRev2,O,1.598877,42.846734,0.51,street,Quartier des Arrigols 09400 Tarascon-sur-Ariège,09306_attox1,G,QUARTIER DES ARRIGOLS,
250900453,00045,25090045300045,O,2005-01-01,NN,,,2021-02-02T03:43:27,false,4,,98,B,AV,VICTOR PILHES,09400,TARASCON-SUR-ARIEGE,,,09306,,,,,,,,,,,,,,,,,,,2021-02-01,F,SERVICE ASSAINISSEMENT COLLECTIF,,,,37.00Z,NAFRev2,O,1.601224,42.855958,0.79,housenumber,98bis Avenue Victor Pilhes 09400 Tarascon-sur-Ariège,09306_0195_00098_bis,G,98BIS AVENUE VICTOR PILHES,
250900453,00052,25090045300052,O,2011-05-12,03,2020,,2022-08-29T09:09:53,true,2,,98,B,AV,VICTOR PILHES,09400,TARASCON-SUR-ARIEGE,,,09306,,,,,,,,,,,,,,,,,,,2021-02-01,F,,,,,36.00Z,NAFRev2,O,1.601224,42.855958,0.79,housenumber,98bis Avenue Victor Pilhes 09400 Tarascon-sur-Ariège,09306_0195_00098_bis,G,98BIS AVENUE VICTOR PILHES,
250901659,00038,25090165900038,O,2005-09-01,,,,2019-11-14T14:00:16,false,2,,21,,AV,DE SABART,09400,TARASCON-SUR-ARIEGE,,BP 70128,09306,09401,TARASCON SUR ARIEGE CEDEX,,,,,,,,,,,,,,,,,2013-12-13,F,BUREAUX ADMINISTRATIFS,,,,84.13Z,NAFRev2,O,1.602686,42.839496,0.84,housenumber,21 Avenue de Sabart 09400 Tarascon-sur-Ariège,09306_0155_00021,G,21 AVENUE DE SABART,
250901857,00012,25090185700012,O,2003-10-13,NN,,,2019-11-14T14:00:16,true,5,,30,,AV,VICTOR PILHES,09400,TARASCON-SUR-ARIEGE,,,09306,,,,,,,,,,,,,,,,,,,2017-06-30,F,,,,,84.13Z,NAFRev2,O,1.605104,42.848616,0.87,housenumber,30 Avenue Victor Pilhes 09400 Tarascon-sur-Ariège,09306_0195_00030,G,30 AVENUE VICTOR PILHES,
260900105,00016,26090010500016,O,1983-03-01,00,2020,,2022-09-09T08:58:15,true,4,,,,LD,LA FRAU HAUT,09400,TARASCON-SUR-ARIEGE,,,09306,,,,,,,,,,,,,,,,,,,2008-01-01,A,HOPITAL LOCAL JULES ROUSSE,,,,86.10Z,NAFRev2,O,1.60819,42.850993,0.66,street,Lafrau Haute 09400 Tarascon-sur-Ariège,09306_B060,G,LAFRAU HAUTE,
260900105,00024,26090010500024,O,1985-09-24,22,2020,,2022-08-29T09:10:17,false,5,,,,LD,LA FRAU HAUT,09400,TARASCON-SUR-ARIEGE,,,09306,,,,,,,,,,,,,,,,,,,2022-01-01,F,EHPAD CH TARASCON SUR ARIEGE,,,,87.10A,NAFRev2,N,1.60819,42.850993,0.66,street,Lafrau Haute 09400 Tarascon-sur-Ariège,09306_B060,G,LAFRAU HAUTE,
260900105,00032,26090010500032,O,1997-01-01,,,,2019-11-14T14:00:16,false,3,,,,,LA FRAU HAUT,09400,TARASCON-SUR-ARIEGE,,,09306,,,,,,,,,,,,,,,,,,,2008-01-01,A,LOGEMENTS FOYER PERS AGEES,,,,87.30A,NAFRev2,N,1.60819,42.850993,0.66,street,Lafrau Haute 09400 Tarascon-sur-Ariège,09306_B060,G,LAFRAU HAUTE,
260900105,00040,26090010500040,O,1997-01-01,03,2020,,2022-08-29T09:10:17,false,6,,8,,QUAI,DE L'AYROULE,09400,TARASCON-SUR-ARIEGE,,,09306,,,,,,,,,,,,,,,,,,,2022-01-01,F,SSIAD DU CANTON DE TARASCON,,,,86.90D,NAFRev2,N,1.608385,42.842473,0.68,housenumber,8 Avenue de l’Ayroule 09400 Tarascon-sur-Ariège,09306_0003_00008,G,8 AVENUE DE L AYROULE,
260900105,00057,26090010500057,O,1983-01-01,,,,2019-11-14T14:00:16,false,3,,,,,LAFRAU HAUT,09400,TARASCON-SUR-ARIEGE,,,09306,,,,,,,,,,,,,,,,,,,2008-01-01,A,UNITE LONG SEJOUR,,,,86.10Z,NAFRev2,N,1.60819,42.850993,0.87,street,Lafrau Haute 09400 Tarascon-sur-Ariège,09306_B060,G,LAFRAU HAUTE,
260900105,00065,26090010500065,O,1993-01-01,,,,2019-11-14T14:00:16,false,3,,,,,LAFRAU HAUT,09400,TARASCON-SUR-ARIEGE,,,09306,,,,,,,,,,,,,,,,,,,2008-01-01,A,MAISON DE RETRAITE SPECIALISEE,,,,87.10A,NAFRev2,N,1.60819,42.850993,0.87,street,Lafrau Haute 09400 Tarascon-sur-Ariège,09306_B060,G,LAFRAU HAUTE,
260900105,00081,26090010500081,O,2016-05-09,,,,2021-02-23T10:34:54,false,1,,,,LD,LA FRAU HAUT,09400,TARASCON-SUR-ARIEGE,,,09306,,,,,,,,,,,,,,,,,,,2016-05-09,A,UNITE DE SOINS LONGUE DUREE,,,,86.10Z,NAFRev2,N,1.60819,42.850993,0.66,street,Lafrau Haute 09400 Tarascon-sur-Ariège,09306_B060,G,LAFRAU HAUTE,
260900162,00140,26090016200140,O,1997-07-24,,,,2019-11-14T14:00:16,false,5,,15,,RUE,FRANCOIS LAGUERRE,09400,TARASCON-SUR-ARIEGE,,,09306,,,,,,,,,,,,,,,,,,,2012-12-25,F,CTRE MEDICO PSYCHO TARASCON,,,,88.99B,NAFRev2,N,1.606966,42.846937,0.84,housenumber,15 Avenue François Laguerre 09400 Tarascon-sur-Ariège,09306_0065_00015,G,15 AVENUE FRANCOIS LAGUERRE,
260900170,00010,26090017000010,O,,,,,2019-11-14T14:00:16,true,1,,,,,QUARTIER LAFRAU,09400,TARASCON-SUR-ARIEGE,,,09306,,,,,,,,,,,,,,,,,,,,F,,,,,85.04,NAP,N,1.598877,42.846734,0.54,street,Quartier des Arrigols 09400 Tarascon-sur-Ariège,09306_attox1,G,QUARTIER DES ARRIGOLS,
260901087,00015,26090108700015,O,1983-03-01,NN,,,2020-07-22T08:16:00,true,4,MAIRIE,30,,AV,VICTOR PILHES,09400,TARASCON-SUR-ARIEGE,,,09306,,,,,,,,,,,,,,,,,,,2008-01-01,A,CCAS,,,,88.99B,NAFRev2,N,1.605104,42.848616,0.87,housenumber,30 Avenue Victor Pilhes 09400 Tarascon-sur-Ariège,09306_0195_00030,G,30 AVENUE VICTOR PILHES,
260901087,00023,26090108700023,O,1984-12-04,NN,,,2019-11-14T14:00:16,false,4,,,,,LA FRAU HAUT,09400,TARASCON-SUR-ARIEGE,,,09306,,,,,,,,,,,,,,,,,,,1997-12-31,F,LOGEMENTS FOYER PERS AGEES,,,,85.3D,NAF1993,N,1.60819,42.850993,0.66,street,Lafrau Haute 09400 Tarascon-sur-Ariège,09306_B060,G,LAFRAU HAUTE,
260901087,00031,26090108700031,O,1985-01-22,NN,,,2019-11-14T14:00:16,false,4,MAIRIE,32,,AV,VICTOR PILHES,09400,TARASCON-SUR-ARIEGE,,,09306,,,,,,,,,,,,,,,,,,,1997-12-31,F,SERVICE DE SOINS A DOMICILE,,,,85.3J,NAF1993,N,1.604981,42.84885,0.87,housenumber,32 Avenue Victor Pilhes 09400 Tarascon-sur-Ariège,09306_0195_00032,G,32 AVENUE VICTOR PILHES,
270900566,00018,27090056600018,O,,,,,2019-11-14T14:00:16,true,1,,,,,MAIRIE,09400,TARASCON-SUR-ARIEGE,,,09306,,,,,,,,,,,,,,,,,,,1995-12-25,F,,,,,90.0A,NAF1993,N,3.0709671,50.6304695,0.92,poi.townhall,Hôtel de Ville Lille,https://osm.org/way/40917078,G,,
270900574,00012,27090057400012,O,1985-05-20,NN,,,2019-11-14T14:00:16,true,3,,,,,MAIRIE,09400,TARASCON-SUR-ARIEGE,,,09306,,,,,,,,,,,,,,,,,,,1996-12-25,F,,,,,90.0B,NAF1993,N,3.0709671,50.6304695,0.92,poi.townhall,Hôtel de Ville Lille,https://osm.org/way/40917078,G,,
270900715,00011,27090071500011,O,,NN,,,2019-11-14T14:00:16,true,1,,30,,PL,VICTOR PILHES,09400,TARASCON-SUR-ARIEGE,,,09306,,,,,,,,,,,,,,,,,,,1995-03-17,F,,,,,75.1E,NAF1993,O,1.605104,42.848616,0.78,housenumber,30 Avenue Victor Pilhes 09400 Tarascon-sur-Ariège,09306_0195_00030,G,30 AVENUE VICTOR PILHES,
300238342,00020,30023834200020,O,,NN,,,2019-11-14T14:00:16,true,1,,15,,RUE,PEYRE VIDAL,09400,TARASCON-SUR-ARIEGE,,,09306,,,,,,,,,,,,,,,,,,,2001-12-31,F,,,,,70.2C,NAF1993,N,1.602754,42.850633,0.43,street,Avenue Eugene Peyre Poutou 09400 Tarascon-sur-Ariège,09306_jxplxa,G,AVENUE EUGENE PEYRE POUTOU,
300247996,00014,30024799600014,O,,,,,2019-11-14T14:00:16,true,1,,92,,AV,VICTOR PILHES,09400,TARASCON-SUR-ARIEGE,,,09306,,,,,,,,,,,,,,,,,,,1984-12-25,F,,,,,77.05,NAP,N,1.601406,42.855626,0.87,housenumber,92 Avenue Victor Pilhes 09400 Tarascon-sur-Ariège,09306_0195_00092,G,92 AVENUE VICTOR PILHES,
300248507,00042,30024850700042,O,,NN,,,2019-11-14T14:00:16,true,1,,,,,CAMPING PRE LOMBARD,09400,TARASCON-SUR-ARIEGE,,,09306,,,,,,,,,,,,,,,,,,,1986-07-01,F,,,,,86.06,NAP,N,1.6102135,42.8385486,0.8,poi.camp_site,Pré Lombard (Camping) Ussat,https://osm.org/way/370471252,G,,
300262029,00014,30026202900014,O,,NN,,,2019-11-14T14:00:16,true,1,,84,,AV,VICTOR PILHES,09400,TARASCON-SUR-ARIEGE,,,09306,,,,,,,,,,,,,,,,,,,1988-06-20,F,,,,,65.03,NAP,N,1.601819,42.854842,0.87,housenumber,84 Avenue Victor Pilhes 09400 Tarascon-sur-Ariège,09306_0195_00084,G,84 AVENUE VICTOR PILHES,
300265311,00013,30026531100013,O,,NN,,,2019-11-14T14:00:16,true,1,,84,,AV,VICTOR PILHES,09400,TARASCON-SUR-ARIEGE,,,09306,,,,,,,,,,,,,,,,,,,1987-02-28,F,,,,,81.21,NAP,N,1.601819,42.854842,0.87,housenumber,84 Avenue Victor Pilhes 09400 Tarascon-sur-Ariège,09306_0195_00084,G,84 AVENUE VICTOR PILHES,
300300381,00054,30030038100054,O,2018-01-02,,,4312AZ,2019-11-14T14:00:16,false,1,RN 20,,,AV,SAINT ROCH,09400,TARASCON-SUR-ARIEGE,,,09306,,,,,,,,,,,,,,,,,,,2018-01-02,A,,,,,43.12A,NAFRev2,O,1.601759,42.844236,0.82,street,Avenue Saint Roch 09400 Tarascon-sur-Ariège,09306_0173,G,AVENUE SAINT ROCH,
300362696,00019,30036269600019,O,,,,,2019-11-14T14:00:16,true,1,,4,,PL,JEAN JAURES,09400,TARASCON-SUR-ARIEGE,,,09306,,,,,,,,,,,,,,,,,,,1985-12-25,F,,,,,64.30,NAP,N,1.605919,42.847534,0.85,housenumber,4 Place Jean Jaurés 09400 Tarascon-sur-Ariège,09306_0080_00004,G,4 PLACE JEAN JAURES,
300362779,00013,30036277900013,O,,NN,,,2019-11-14T14:00:16,true,1,,17,,PL,JEAN JAURES,09400,TARASCON-SUR-ARIEGE,,,09306,,,,,,,,,,,,,,,,,,,,F,,,,,67.09,NAP,N,1.606049,42.847256,0.85,housenumber,17 Place Jean Jaurés 09400 Tarascon-sur-Ariège,09306_0080_00017,G,17 PLACE JEAN JAURES,
300402070,00019,30040207000019,O,1900-01-01,NN,,,2019-11-14T14:00:16,true,5,CAGNAC,,,RTE,DE SAURAT,09400,TARASCON-SUR-ARIEGE,,,09306,,,,,,,,,,,,,,,,,,,2006-09-29,F,,,,,70.2C,NAFRev1,N,1.59616,42.850651,0.82,street,Route de Saurat 09400 Tarascon-sur-Ariège,09306_0179,G,ROUTE DE SAURAT,
301127296,00012,30112729600012,O,,,,,2019-11-14T14:00:16,true,1,,,,AV,VICTOR PICHES,09400,TARASCON-SUR-ARIEGE,,,09306,,,,,,,,,,,,,,,,,,,1984-12-25,F,,,,,,,N,1.603454,42.852848,0.7,street,Avenue Victor Pilhes 09400 Tarascon-sur-Ariège,09306_0195,G,AVENUE VICTOR PILHES,
301376737,00013,30137673700013,O,2001-11-06,NN,,,2019-11-14T14:00:16,false,2,LES ARRIGOLS,,,RTE,DE SAURAT,09400,TARASCON-SUR-ARIEGE,,,09306,,,,,,,,,,,,,,,,,,,1997-10-01,F,,,,,74.1A,NAF1993,,1.59616,42.850651,0.82,street,Route de Saurat 09400 Tarascon-sur-Ariège,09306_0179,G,ROUTE DE SAURAT,
301470050,00024,30147005000024,O,1990-10-29,NN,,,2019-11-14T14:00:16,true,4,,3,,AV,PEYREVIDAL,09400,TARASCON-SUR-ARIEGE,,,09306,,,,,,,,,,,,,,,,,,,2011-12-31,F,,,,,66.22Z,NAFRev2,N,1.604797,42.847023,0.84,housenumber,3 Avenue Peyrevidal 09400 Tarascon-sur-Ariège,09306_0115_00003,G,3 AVENUE PEYREVIDAL,
301594263,00016,30159426300016,O,,NN,,,2019-11-14T14:00:16,true,1,,27,,AV,VICTOR PILHES,09400,TARASCON-SUR-ARIEGE,,,09306,,,,,,,,,,,,,,,,,,,1995-12-25,F,,,,,70.2C,NAF1993,N,1.604762,42.849484,0.87,housenumber,27 Avenue Victor Pilhes 09400 Tarascon-sur-Ariège,09306_0195_00027,G,27 AVENUE VICTOR PILHES,
301627881,00016,30162788100016,O,,NN,,,2019-11-14T14:00:16,true,1,,11,,AV,PECHINEY,09400,TARASCON-SUR-ARIEGE,,,09306,,,,,,,,,,,,,,,,,,,1987-12-31,F,,,,,84.13,NAP,N,1.605138,42.84395,0.83,housenumber,11 Avenue Pechiney 09400 Tarascon-sur-Ariège,09306_0114_00011,G,11 AVENUE PECHINEY,
301800116,00016,30180011600016,O,,NN,,,2019-11-14T14:00:16,true,1,,49,,AV,VICTOR PILHES,09400,TARASCON-SUR-ARIEGE,,,09306,,,,,,,,,,,,,,,,,,,1995-12-25,F,,,,,70.2C,NAF1993,N,1.603373,42.852154,0.87,housenumber,49 Avenue Victor Pilhes 09400 Tarascon-sur-Ariège,09306_0195_00049,G,49 AVENUE VICTOR PILHES,