siren,nic,siret,statutDiffusionEtablissement,dateCreationEtablissement,trancheEffectifsEtablissement,anneeEffectifsEtablissement,activitePrincipaleRegistreMetiersEtablissement,dateDernierTraitementEtablissement,etablissementSiege,nombrePeriodesEtablissement,complementAdresseEtablissement,numeroVoieEtablissement,indiceRepetitionEtablissement,typeVoieEtablissement,libelleVoieEtablissement,codePostalEtablissement,libelleCommuneEtablissement,libelleCommuneEtrangerEtablissement,distributionSpecialeEtablissement,codeCommuneEtablissement,codeCedexEtablissement,libelleCedexEtablissement,codePaysEtrangerEtablissement,libellePaysEtrangerEtablissement,complementAdresse2Etablissement,numeroVoie2Etablissement,indiceRepetition2Etablissement,typeVoie2Etablissement,libelleVoie2Etablissement,codePostal2Etablissement,libelleCommune2Etablissement,libelleCommuneEtranger2Etablissement,distributionSpeciale2Etablissement,codeCommune2Etablissement,codeCedex2Etablissement,libelleCedex2Etablissement,codePaysEtranger2Etablissement,libellePaysEtranger2Etablissement,dateDebut,etatAdministratifEtablissement,enseigne1Etablissement,enseigne2Etablissement,enseigne3Etablissement,denominationUsuelleEtablissement,activitePrincipaleEtablissement,nomenclatureActivitePrincipaleEtablissement,caractereEmployeurEtablissement,longitude,latitude,geo_score,geo_type,geo_adresse,geo_id,geo_ligne,geo_l4,geo_l5
200047173,00014,20004717300014,O,2013-04-04,02,2020,,2022-08-29T09:05:09,true,3,MAIRIE DE BANNEGON,,,,LE BOURG,18210,BANNEGON,,,18021,,,,,,,,,,,,,,,,,,,2021-04-23,F,,,,,84.11Z,NAFRev2,O,2.715398,46.79937,0.94,street,Le Bourg 18210 Bannegon,18021_usssan,G,LE BOURG,
211800214,00010,21180021400010,O,1983-03-01,02,2020,,2022-08-29T09:06:09,true,4,,,,,LE BOURG,18210,BANNEGON,,,18021,,,,,,,,,,,,,,,,,,,2008-01-01,A,MAIRIE,,,,84.11Z,NAFRev2,O,2.715398,46.79937,0.94,street,Le Bourg 18210 Bannegon,18021_usssan,G,LE BOURG,
211800214,00028,21180021400028,O,1983-12-21,NN,,,2021-10-27T08:07:05,false,3,,,,,LE BOURG,18210,BANNEGON,,,18021,,,,,,,,,,,,,,,,,,,2008-01-01,A,ECOLE ELEMENTAIRE PUBLIQUE,,,,85.20Z,NAFRev2,N,2.715398,46.79937,0.94,street,Le Bourg 18210 Bannegon,18021_usssan,G,LE BOURG,
211800214,00036,21180021400036,O,1999-03-29,NN,,,2021-03-16T10:04:42,false,4,MAIRIE,,,,LE BOURG,18210,BANNEGON,,,18021,,,,,,,,,,,,,,,,,,,2020-12-31,F,LOCATION LOCAUX COMMERCIAUX MULTISERVICE,,,,68.20B,NAFRev2,N,2.715398,46.79937,0.94,street,Le Bourg 18210 Bannegon,18021_usssan,G,LE BOURG,
251887865,00011,25188786500011,O,2000-12-29,NN,,,2015-05-14T03:46:11,true,4,MAIRIE,,,,LE BOURG,18210,BANNEGON,,,18021,,,,,,,,,,,,,,,,,,,2013-04-04,F,,,,,84.12Z,NAFRev2,O,2.715398,46.79937,0.94,street,Le Bourg 18210 Bannegon,18021_usssan,G,LE BOURG,
261803597,00010,26180359700010,O,1995-12-25,NN,,,2018-02-19T14:45:56,true,3,MAIRIE,,,,LE BOURG,18210,BANNEGON,,,18021,,,,,,,,,,,,,,,,,,,2017-02-09,F,CCAS,,,,88.99B,NAFRev2,N,2.715398,46.79937,0.94,street,Le Bourg 18210 Bannegon,18021_usssan,G,LE BOURG,
303909030,00031,30390903000031,O,,NN,,,,true,1,,,,,,18210,BANNEGON,,,18021,,,,,,,,,,,,,,,,,,,,F,,,,,64.11,NAP,N,,,0,,,,,,
305252983,00039,30525298300039,O,1980-01-01,NN,,,,true,1,,,,,LE PETIT VERNAIS,18210,BANNEGON,,,18021,,,,,,,,,,,,,,,,,,,2000-06-30,F,,,,,45.3E,NAF1993,O,2.710729,46.797938,0.94,street,Le Petit Vernais 18210 Bannegon,18021_B172,G,LE PETIT VERNAIS,
305292997,00015,30529299700015,O,,NN,,,,true,1,,,,LD,LE BUT,18210,BANNEGON,,,18021,,,,,,,,,,,,,,,,,,,1988-12-31,F,,,,,01.00,NAP,N,2.700914,46.803694,0.94,street,Le But 18210 Bannegon,18021_emwblu,G,LE BUT,
309588002,00019,30958800200019,O,,,,,,true,1,,,,,LE PETIT VERNAIS,18210,BANNEGON,,,18021,,,,,,,,,,,,,,,,,,,1985-12-25,F,,,,,62.46,NAP,N,2.710729,46.797938,0.94,street,Le Petit Vernais 18210 Bannegon,18021_B172,G,LE PETIT VERNAIS,
312567209,00035,31256720900035,O,2005-04-01,,,,2007-02-02T13:57:07,false,2,,,,,LE BOURG,18210,BANNEGON,,,18021,,,,,,,,,,,,,,,,,,,2007-01-16,F,,,,,51.1T,NAFRev1,N,2.715398,46.79937,0.94,street,Le Bourg 18210 Bannegon,18021_usssan,G,LE BOURG,
313783086,00017,31378308600017,O,,,,,,true,1,,,,,LA FORET,18210,BANNEGON,,,18021,,,,,,,,,,,,,,,,,,,1988-09-19,F,,,,,01.07,NAP,N,2.726695,46.801057,0.93,street,La Foret 18210 Bannegon,18021_bc2jww,G,LA FORET,
319803003,00023,31980300300023,O,2014-03-03,,,,2016-02-21T03:51:54,true,2,,16,,RUE,DES ALANDES,18210,BANNEGON,,,18021,,,,,,,,,,,,,,,,,,,2016-02-12,F,,,,,43.39Z,NAFRev2,N,2.718762,46.799106,0.94,housenumber,16 Rue des Alandes 18210 Bannegon,18021_0002_00016,G,16 RUE DES ALANDES,
321020034,00013,32102003400013,O,,NN,,,,true,1,,,,,LES SACQUETS,18210,BANNEGON,,,18021,,,,,,,,,,,,,,,,,,,1984-01-09,F,,,,,01.00,NAP,N,2.742698,46.805785,0.54,street,Les Saques 18210 Bannegon,18021_uq4swb,G,LES SAQUES,
321020042,00016,32102004200016,O,,NN,,,,true,1,,,,,LES SACQUETS,18210,BANNEGON,,,18021,,,,,,,,,,,,,,,,,,,1984-01-09,F,,,,,01.00,NAP,N,2.742698,46.805785,0.54,street,Les Saques 18210 Bannegon,18021_uq4swb,G,LES SAQUES,
322482522,00016,32248252200016,O,,NN,,,,true,1,,,,,LE BOURG,18210,BANNEGON,,,18021,,,,,,,,,,,,,,,,,,,1990-03-09,F,,,,,62.43,NAP,N,2.715398,46.79937,0.94,street,Le Bourg 18210 Bannegon,18021_usssan,G,LE BOURG,
325215085,00045,32521508500045,O,2018-09-01,03,2020,,2022-08-29T09:18:46,false,1,,,,,DOMAINE DES AUBRIS,18210,BANNEGON,,,18021,,,,,,,,,,,,,,,,,,,2018-09-01,A,,,,,94.99Z,NAFRev2,O,2.731267,46.785215,0.49,street,Les Aubris 18210 Bannegon,18021_cj0xya,G,LES AUBRIS,
326445129,00017,32644512900017,O,1983-01-01,01,2020,,2022-08-29T09:19:18,true,4,,,,LD,LES BIONS,18210,BANNEGON,,,18021,,,,,,,,,,,,,,,,,,,2021-06-11,F,,,,,01.42Z,NAFRev2,N,2.728542,46.820121,0.93,street,Les Bions 18210 Bannegon,18021_q4wv3g,G,LES BIONS,
327841136,00010,32784113600010,O,1983-01-01,NN,,,2012-07-28T10:01:14,true,4,,,,LD,LES MAUGUINS,18210,BANNEGON,,,18021,,,,,,,,,,,,,,,,,,,2008-12-25,F,,,,,01.11Z,NAFRev2,N,2.719884,46.832782,0.93,street,Les Mauguins 18210 Bannegon,18021_dgm7yd,G,LES MAUGUINS,
328022686,00013,32802268600013,O,1983-08-26,NN,,,2008-04-05T00:28:42,true,3,,,,LD,CHAMBRE,18210,BANNEGON,,,18021,,,,,,,,,,,,,,,,,,,2008-01-01,A,,,,,01.11Z,NAFRev2,N,2.721541,46.808529,0.91,street,Lieu Dit Chambre 18210 Bannegon,18021_9nevv9,G,LIEU DIT CHAMBRE,
328709787,00043,32870978700043,O,2008-05-01,,,,2018-02-16T08:35:08,true,2,,,,,LES SAQUETS,18210,BANNEGON,,,18021,,,,,,,,,,,,,,,,,,,2015-12-10,F,,,,,90.03B,NAFRev2,N,2.742698,46.805785,0.72,street,Les Saques 18210 Bannegon,18021_uq4swb,G,LES SAQUES,
328910997,00019,32891099700019,O,,NN,,,,true,1,,,,,,18210,BANNEGON,,,18021,,,,,,,,,,,,,,,,,,,1989-01-03,F,,,,,62.11,NAP,N,,,0,,,,,,
329105282,00019,32910528200019,O,1984-01-09,01,2020,,2022-08-29T09:20:44,true,3,,,,LD,LES SACQUETS,18210,BANNEGON,,,18021,,,,,,,,,,,,,,,,,,,2008-01-01,A,,,,,01.42Z,NAFRev2,N,2.742698,46.805785,0.54,street,Les Saques 18210 Bannegon,18021_uq4swb,G,LES SAQUES,
329213557,00013,32921355700013,O,1984-01-01,NN,,,2023-02-08T03:41:28,true,4,,,,LD,LES AUBRIS,18210,BANNEGON,,,18021,,,,,,,,,,,,,,,,,,,2022-12-31,F,,,,,01.42Z,NAFRev2,N,2.731267,46.785215,0.93,street,Les Aubris 18210 Bannegon,18021_cj0xya,G,LES AUBRIS,
331359927,00026,33135992700026,O,,NN,,,,true,1,,,,,LE BOURG,18210,BANNEGON,,,18021,,,,,,,,,,,,,,,,,,,1995-12-31,F,,,,,52.1B,NAF1993,N,2.715398,46.79937,0.94,street,Le Bourg 18210 Bannegon,18021_usssan,G,LE BOURG,
332176619,00010,33217661900010,O,,NN,,,,true,1,,,,LD,LE BROT AU CHAT,18210,BANNEGON,,,18021,,,,,,,,,,,,,,,,,,,1993-10-01,F,,,,,01.1A,NAF1993,N,2.742032,46.785194,0.94,street,Le Brot au Chat 18210 Bannegon,18021_B020,G,LE BROT AU CHAT,
332655091,00012,33265509100012,O,,NN,,,,true,1,,,,,,18210,BANNEGON,,,18021,,,,,,,,,,,,,,,,,,,,F,,,,,01.07,NAP,N,,,0,,,,,,
333107811,00023,33310781100023,O,1982-12-31,NN,,,2018-01-26T03:35:20,true,4,,,,,LE PRE DE LA GRANGE,18210,BANNEGON,,,18021,,,,,,,,,,,,,,,,,,,2014-10-06,F,,,,,01.11Z,NAFRev2,N,2.74355,46.787441,0.47,street,Grand Pré de Rhimbé 18210 Bannegon,18021_B131,G,GRAND PRE DE RHIMBE,
334725256,00013,33472525600013,O,,NN,,,,true,1,,,,,PONTABARAT,18210,BANNEGON,,,18021,,,,,,,,,,,,,,,,,,,1988-04-23,F,,,,,01.00,NAP,N,,,0,,,,,,
339688418,00013,33968841800013,O,1986-11-26,NN,,,2014-07-08T00:43:36,true,5,,,,LD,CHAMERON,18210,BANNEGON,,,18021,,,,,,,,,,,,,,,,,,,2011-08-28,F,,,,,56.10A,NAFRev2,O,2.741405,46.795886,0.93,street,Chameron 18210 Bannegon,18021_ip5q6v,G,CHAMERON,
340576065,00015,34057606500015,O,1987-02-20,NN,,,2019-01-08T09:52:37,true,3,,,,,MAIRIE,18210,BANNEGON,,,18021,,,,,,,,,,,,,,,,,,,2008-01-01,A,,,,,77.31Z,NAFRev2,N,2.714517,46.799703,0.92,street,Rue de la Mairie 18210 Bannegon,18021_0055,G,RUE DE LA MAIRIE,
340661511,00014,34066151100014,O,,,,,,true,1,,,,LD,LES THIOTS,18210,BANNEGON,,,18021,,,,,,,,,,,,,,,,,,,1997-08-01,F,,,,,70.2C,NAF1993,N,2.712147,46.821471,0.94,street,Les Thiots 18210 Bannegon,18021_qr3zek,G,LES THIOTS,
342385382,00037,34238538200037,P,2005-04-01,NN,,,2011-03-04T13:29:24,false,2,[ND],[ND],[ND],[ND],[ND],[ND],BANNEGON,,[ND],18021,[ND],[ND],,,[ND],[ND],[ND],[ND],[ND],[ND],,,[ND],,[ND],[ND],,,2005-06-27,F,[ND],[ND],[ND],[ND],22.2G,NAFRev1,N,,,0,,,,,,
343289401,00014,34328940100014,O,,NN,,,,true,1,,,,,PONTABARAT,18210,BANNEGON,,,18021,,,,,,,,,,,,,,,,,,,1990-12-31,F,,,,,01.50,NAP,N,,,0,,,,,,
343652640,00040,34365264000040,O,2016-04-01,,,,2021-02-23T10:58:51,true,1,,16,,PL,SAINT GEORGES,18210,BANNEGON,,,18021,,,,,,,,,,,,,,,,,,,2016-04-01,A,LE SAGONIN,,,LE SAGONIN,56.10A,NAFRev2,N,2.714083,46.800548,0.85,housenumber,16 Place Saint Georges 18210 Bannegon,18021_0080_00016,G,16 PLACE SAINT GEORGES,
343876330,00014,34387633000014,O,1988-01-05,01,2020,1071CB,2022-08-29T09:28:40,true,3,,,,,LE BOURG,18210,BANNEGON,,,18021,,,,,,,,,,,,,,,,,,,2008-01-01,A,,,,,10.71C,NAFRev2,O,2.715398,46.79937,0.94,street,Le Bourg 18210 Bannegon,18021_usssan,G,LE BOURG,
344252614,00013,34425261400013,O,1988-03-05,00,2020,,2022-08-29T09:28:57,true,3,,,,LD,LE PONT DE SARGY,18210,BANNEGON,,,18021,,,,,,,,,,,,,,,,,,,2008-01-01,A,,,,,01.50Z,NAFRev2,N,2.732245,46.809406,0.93,street,Le Pont de Sargy 18210 Bannegon,18021_B187,G,LE PONT DE SARGY,
344855895,00027,34485589500027,O,1996-01-02,NN,,,2008-11-08T00:20:11,false,4,LE VIEUX CHATEAU,,,,LE RHIMBE,18210,BANNEGON,,,18021,,,,,,,,,,,,,,,,,,,2000-12-01,F,,,,,17.3Z,NAF1993,N,2.749119,46.787306,0.95,street,Le Rhimbe 18210 Bannegon,18021_0tebtl,G,LE RHIMBE,
347571242,00028,34757124200028,O,2010-10-28,,,,2017-04-30T03:29:57,true,2,,26,,,L'ECLUSE- LE RHIMBE,18210,BANNEGON,,,18021,,,,,,,,,,,,,,,,,,,2017-04-30,F,,,,,56.21Z,NAFRev2,N,2.750852,46.786299,0.61,housenumber,26 Le Rhimbe 18210 Bannegon,18021_0tebtl_00026,G,26 LE RHIMBE,
348888959,00015,34888895900015,O,1900-01-01,NN,,,2011-04-28T00:39:18,false,3,,,,,LES THIOTS,18210,BANNEGON,,,18021,,,,,,,,,,,,,,,,,,,1996-09-30,F,,,,,52.6D,NAF1993,,2.712147,46.821471,0.94,street,Les Thiots 18210 Bannegon,18021_qr3zek,G,LES THIOTS,
350098786,00014,35009878600014,O,1989-01-01,NN,,,2013-07-10T09:26:12,true,4,,,,,,18210,BANNEGON,,,18021,,,,,,,,,,,,,,,,,,,2013-11-11,F,,,,,01.42Z,NAFRev2,N,,,0,,,,,,
352663595,00010,35266359500010,O,1989-10-01,NN,,,2014-06-13T23:34:18,true,7,,,,LD,MOULIN DE CHAMERON,18210,BANNEGON,,,18021,,,,,,,,,,,,,,,,,,,2013-07-01,F,,,,,55.10Z,NAFRev2,N,2.741405,46.795886,0.5,street,Chameron 18210 Bannegon,18021_ip5q6v,G,CHAMERON,
353813934,00018,35381393400018,O,1990-01-15,NN,,,2008-01-04T23:58:38,true,3,,,,,LES MAUGUINS,18210,BANNEGON,,,18021,,,,,,,,,,,,,,,,,,,2008-01-01,A,,,,,01.42Z,NAFRev2,N,2.719884,46.832782,0.93,street,Les Mauguins 18210 Bannegon,18021_dgm7yd,G,LES MAUGUINS,
356000240,09314,35600024009314,O,2000-03-14,,,,,false,3,,,,,LE BOURG,18210,BANNEGON,,,18021,,,,,,,,,,,,,,,,,,,2003-09-23,F,SERVICES DE LA POSTE,,,,64.1A,NAFRev1,N,2.715398,46.79937,0.94,street,Le Bourg 18210 Bannegon,18021_usssan,G,LE BOURG,
378486849,00011,37848684900011,O,1990-06-01,NN,,,,true,1,,,,RUE,PRINCIPALE,18210,BANNEGON,,,18021,,,,,,,,,,,,,,,,,,,1998-10-09,F,,,,,55.4A,NAF1993,N,2.713498,46.80189,0.4,street,Rue de l’Ancienne Halle 18210 Bannegon,18021_0005,G,RUE DE L ANCIENNE HALLE,
380785816,00014,38078581600014,O,,NN,,,,true,1,,,,,LE PETIT VERNOIS,18210,BANNEGON,,,18021,,,,,,,,,,,,,,,,,,,1995-07-12,F,,,,,01.2A,NAF1993,N,2.710729,46.797938,0.78,street,Le Petit Vernais 18210 Bannegon,18021_B172,G,LE PETIT VERNAIS,
381834753,00018,38183475300018,O,1988-09-20,NN,,,2006-12-15T00:42:23,false,3,,,,,LA FORET,18210,BANNEGON,,,18021,,,,,,,,,,,,,,,,,,,1992-03-01,F,,,,,01.3Z,NAF1993,N,2.726695,46.801057,0.93,street,La Foret 18210 Bannegon,18021_bc2jww,G,LA FORET,
383996071,00015,38399607100015,O,1991-11-18,NN,,,2021-02-23T11:12:10,true,4,,,,,LE BROT AU CHAT,18210,BANNEGON,,,18021,,,,,,,,,,,,,,,,,,,2009-04-01,A,,,,,68.20B,NAFRev2,N,2.742032,46.785194,0.94,street,Le Brot au Chat 18210 Bannegon,18021_B020,G,LE BROT AU CHAT,
387652571,00028,38765257100028,O,1997-02-13,NN,,,2006-11-25T11:49:46,true,3,,,,LD,CHAMERON,18210,BANNEGON,,,18021,,,,,,,,,,,,,,,,,,,2004-11-30,F,,,,,74.1J,NAFRev1,N,2.741405,46.795886,0.93,street,Chameron 18210 Bannegon,18021_ip5q6v,G,CHAMERON,
388345977,00010,38834597700010,O,1992-03-01,NN,,,2021-03-26T03:50:22,true,4,,,,,FERME DE LA FORET,18210,BANNEGON,,,18021,,,,,,,,,,,,,,,,,,,2020-12-31,F,,,,,01.11Z,NAFRev2,N,2.726695,46.801057,0.53,street,La Foret 18210 Bannegon,18021_bc2jww,G,LA FORET,
390435311,00019,39043531100019,O,1993-01-01,NN,,,2008-09-16T14:45:28,true,3,,,,,LA CROIX BODIN,18210,BANNEGON,,,18021,,,,,,,,,,,,,,,,,,,2008-01-01,A,,,,,01.42Z,NAFRev2,N,2.741514,46.833618,0.94,street,La Croix Bodin 18210 Bannegon,18021_B099,G,LA CROIX BODIN,
390435428,00011,39043542800011,O,1900-01-01,NN,,,2013-05-22T04:36:14,true,4,,,,,LA CROIX BODIN,18210,BANNEGON,,,18021,,,,,,,,,,,,,,,,,,,2013-01-01,A,,,,,68.20B,NAFRev2,N,2.741514,46.833618,0.94,street,La Croix Bodin 18210 Bannegon,18021_B099,G,LA CROIX BODIN,
390508828,00014,39050882800014,O,1993-01-01,NN,,,2010-09-24T11:34:44,true,4,,,,,LA CARELLE,18210,BANNEGON,,,18021,,,,,,,,,,,,,,,,,,,2008-06-01,F,,,,,01.50Z,NAFRev2,N,2.695133,46.80583,0.93,street,La Carelle 18210 Bannegon,18021_n0yxqx,G,LA CARELLE,
390635944,00015,39063594400015,O,1993-03-16,NN,,,2017-09-26T08:29:23,true,3,CHEZ MN PICQ LAURENT,,,,PONT DE SARGY,18210,BANNEGON,,,18021,,,,,,,,,,,,,,,,,,,2008-01-01,A,,,,,77.31Z,NAFRev2,N,2.732245,46.809406,0.93,street,Le Pont de Sargy 18210 Bannegon,18021_B187,G,LE PONT DE SARGY,
392803417,00014,39280341700014,O,1993-10-01,NN,,,2008-01-05T00:09:13,true,3,,,,,LES FOURNEAUX,18210,BANNEGON,,,18021,,,,,,,,,,,,,,,,,,,2008-01-01,A,,,,,68.20B,NAFRev2,N,2.742118,46.787857,0.93,street,Les Fourneaux 18210 Bannegon,18021_ju7ggo,G,LES FOURNEAUX,
392898045,00019,39289804500019,O,1993-10-01,NN,,,2021-11-06T08:38:45,true,3,,,,,LE PONT DE SARGY,18210,BANNEGON,,,18021,,,,,,,,,,,,,,,,,,,2008-01-01,A,,,,,68.20B,NAFRev2,N,2.732245,46.809406,0.93,street,Le Pont de Sargy 18210 Bannegon,18021_B187,G,LE PONT DE SARGY,
393582135,00017,39358213500017,O,1994-01-01,NN,,,2008-01-05T00:17:45,true,3,,,,,BERGERENNE,18210,BANNEGON,,,18021,,,,,,,,,,,,,,,,,,,2008-01-01,A,,,,,01.42Z,NAFRev2,N,2.742263,46.818024,0.91,street,Le Grand Bergerenne 18210 Bannegon,18021_B124,G,LE GRAND BERGERENNE,
398944702,00016,39894470200016,O,1994-09-01,NN,,,2007-07-02T13:19:43,true,3,,,,,LES BIONS,18210,BANNEGON,,,18021,,,,,,,,,,,,,,,,,,,2006-12-31,F,,,,,70.2B,NAFRev1,N,2.728542,46.820121,0.93,street,Les Bions 18210 Bannegon,18021_q4wv3g,G,LES BIONS,
399502418,00011,39950241800011,O,1995-01-01,NN,,,2021-01-15T03:33:53,true,4,,,,,LES DENIS,18210,BANNEGON,,,18021,,,,,,,,,,,,,,,,,,,2020-12-31,F,,,,,01.42Z,NAFRev2,N,2.748258,46.799177,0.93,street,Les Denis 18210 Bannegon,18021_e73vi3,G,LES DENIS,
402943807,00014,40294380700014,O,1994-10-03,NN,,,2013-05-18T03:53:38,true,5,,,,,,18210,BANNEGON,,,18021,,,,,,,,,,,,,,,,,,,2011-06-30,A,,,,,94.99Z,NAFRev2,N,,,0,,,,,,
404265662,00027,40426566200027,O,1996-02-29,,,,2008-01-04T20:37:54,false,2,,,,LD,PONT A BARAS,18210,BANNEGON,,,18021,,,,,,,,,,,,,,,,,,,2008-01-01,A,,,,,01.50Z,NAFRev2,N,2.731408,46.791331,0.93,street,Pont à Baras 18210 Bannegon,18021_B185,G,PONT A BARAS,
405224700,00014,40522470000014,O,1985-12-31,NN,,,,true,3,LES THIOTS,,,,,18210,BANNEGON,,,18021,,,,,,,,,,,,,,,,,,,2003-11-10,F,,,,,01.1A,NAFRev1,N,2.712147,46.821471,0.94,street,Les Thiots 18210 Bannegon,18021_qr3zek,D,LES THIOTS,
408547602,00024,40854760200024,O,2001-05-01,NN,,,2008-01-04T21:12:50,true,3,,,,,MOULIN DE CHAMERON,18210,BANNEGON,,,18021,,,,,,,,,,,,,,,,,,,2008-01-01,A,,,,,94.99Z,NAFRev2,N,2.741405,46.795886,0.5,street,Chameron 18210 Bannegon,18021_ip5q6v,G,CHAMERON,
409140225,00015,40914022500015,O,1996-10-03,NN,,,,true,4,,,,,LES THIOTS,18210,BANNEGON,,,18021,,,,,,,,,,,,,,,,,,,2000-12-08,F,,,,,52.6D,NAF1993,O,2.712147,46.821471,0.94,street,Les Thiots 18210 Bannegon,18021_qr3zek,G,LES THIOTS,
412470585,00016,41247058500016,O,2005-12-31,NN,,,2015-05-14T07:59:38,true,8,CHATEAU DE BANNEGON,,,,CHATEAU DE BANNEGON,18210,BANNEGON,,,18021,,,,,,,,,,,,,,,,,,,2013-12-31,A,,,,,91.03Z,NAFRev2,N,2.742032,46.785194,0.65,street,Le Brot au Chat 18210 Bannegon,18021_B020,G,LE BROT AU CHAT,
420371692,00013,42037169200013,O,1998-09-01,NN,,,,true,4,,,,,LES AMPOLIES,18210,BANNEGON,,,18021,,,,,,,,,,,,,,,,,,,1999-05-07,F,,,,,52.4L,NAF1993,O,2.747297,46.782827,0.94,street,Les Ampolies 18210 Bannegon,18021_fh8978,G,LES AMPOLIES,
420460230,00022,42046023000022,O,2003-02-01,NN,,,2006-11-25T16:09:57,false,3,,,,,ECLUSE LE RHIMBE,18210,BANNEGON,,,18021,,,,,,,,,,,,,,,,,,,2005-07-13,F,,,,,52.6E,NAFRev1,N,2.749119,46.787306,0.61,street,Le Rhimbe 18210 Bannegon,18021_0tebtl,G,LE RHIMBE,
423532704,00016,42353270400016,O,1999-07-01,NN,,,2013-05-29T03:59:34,true,4,,,,,LE BOURG,18210,BANNEGON,,,18021,,,,,,,,,,,,,,,,,,,2013-05-23,F,,,,,56.10A,NAFRev2,N,2.715398,46.79937,0.94,street,Le Bourg 18210 Bannegon,18021_usssan,G,LE BOURG,
431434760,00010,43143476000010,O,2000-01-01,NN,,,2019-05-17T03:42:18,true,7,,,,,LE BOURG,18210,BANNEGON,,,18021,,,,,,,,,,,,,,,,,,,2018-06-30,F,,,,,68.20B,NAFRev2,N,2.715398,46.79937,0.94,street,Le Bourg 18210 Bannegon,18021_usssan,G,LE BOURG,
431743368,00026,43174336800026,O,2005-07-01,,,,2021-02-23T13:12:46,true,2,,,,,LA BARAQUE,18210,BANNEGON,,,18021,,,,,,,,,,,,,,,,,,,2008-01-01,A,,,,,90.01Z,NAFRev2,N,2.704225,46.798757,0.93,street,La Baraque 18210 Bannegon,18021_851co7,G,LA BARAQUE,
431743541,00028,43174354100028,O,2005-07-01,,,,2017-09-01T09:59:20,true,4,LA BARAQUE,,,,LA BARAQUE,18210,BANNEGON,,,18021,,,,,,,,,,,,,,,,,,,2016-10-01,A,,,,,90.03A,NAFRev2,N,2.704225,46.798757,0.93,street,La Baraque 18210 Bannegon,18021_851co7,G,LA BARAQUE,
431743541,00036,43174354100036,O,2010-10-01,,,,2017-09-01T09:59:20,false,2,,,,,LA BARAQUE,18210,BANNEGON,,,18021,,,,,,,,,,,,,,,,,,,2014-12-15,F,,,,,32.13Z,NAFRev2,N,2.704225,46.798757,0.93,street,La Baraque 18210 Bannegon,18021_851co7,G,LA BARAQUE,
433000726,00011,43300072600011,O,2000-09-01,01,2020,,2022-08-29T09:11:06,true,6,,,,,CHATEAU DE BANNEGON,18210,BANNEGON,,,18021,,,,,,,,,,,,,,,,,,,2009-02-08,A,,,,,55.20Z,NAFRev2,O,2.742032,46.785194,0.65,street,Le Brot au Chat 18210 Bannegon,18021_B020,G,LE BROT AU CHAT,
433772688,00027,43377268800027,O,2007-04-26,,,,2017-07-26T08:31:10,true,2,,,,,LES SAQUETS,18210,BANNEGON,,,18021,,,,,,,,,,,,,,,,,,,2013-11-13,F,,,,,90.03A,NAFRev2,N,2.742698,46.805785,0.72,street,Les Saques 18210 Bannegon,18021_uq4swb,G,LES SAQUES,
439050626,00019,43905062600019,O,2001-08-30,NN,,,2006-11-25T17:33:55,true,3,,,,,LES AMPOLIES,18210,BANNEGON,,,18021,,,,,,,,,,,,,,,,,,,2004-08-31,F,,,,,51.1T,NAFRev1,N,2.747297,46.782827,0.94,street,Les Ampolies 18210 Bannegon,18021_fh8978,G,LES AMPOLIES,
441563590,00062,44156359000062,O,2013-03-15,,,,2021-02-23T13:23:11,true,1,,22,,,LE RHIMBE,18210,BANNEGON,,,18021,,,,,,,,,,,,,,,,,,,2013-03-15,A,LES JARDINS DU BERRY,,,,01.49Z,NAFRev2,N,2.750281,46.786128,0.95,housenumber,22 Le Rhimbe 18210 Bannegon,18021_0tebtl_00022,G,22 LE RHIMBE,
441563590,00070,44156359000070,O,2014-01-03,,,1039BP,2021-02-23T13:23:11,false,1,,22,,,LE RHIMBE,18210,BANNEGON,,,18021,,,,,,,,,,,,,,,,,,,2014-01-03,A,,,,,10.39B,NAFRev2,N,2.750281,46.786128,0.95,housenumber,22 Le Rhimbe 18210 Bannegon,18021_0tebtl_00022,G,22 LE RHIMBE,
442540548,00017,44254054800017,O,2002-06-21,NN,,,2008-01-05T21:14:29,true,3,,,,,LES GRANDS JARDINS,18210,BANNEGON,,,18021,,,,,,,,,,,,,,,,,,,2008-01-01,A,,,,,68.20B,NAFRev2,N,2.71767,46.797703,0.94,street,Les Grands Jardins 18210 Bannegon,18021_B140,G,LES GRANDS JARDINS,
443540554,00013,44354055400013,O,2002-09-25,NN,,,2006-11-25T18:06:45,false,3,,,,,LE BOURG,18210,BANNEGON,,,18021,,,,,,,,,,,,,,,,,,,2006-05-22,F,,,,,74.1G,NAFRev1,N,2.715398,46.79937,0.94,street,Le Bourg 18210 Bannegon,18021_usssan,G,LE BOURG,
445216864,00014,44521686400014,O,2003-01-30,02,2020,,2022-08-29T09:00:58,true,5,,,,,CHATEAU DE BANNEGON,18210,BANNEGON,,,18021,,,,,,,,,,,,,,,,,,,2012-08-31,A,,,,,64.20Z,NAFRev2,O,2.742032,46.785194,0.65,street,Le Brot au Chat 18210 Bannegon,18021_B020,G,LE BROT AU CHAT,
452328669,00018,45232866900018,O,2003-10-13,NN,,,2008-01-05T21:34:39,true,3,,,,,LE BOURG,18210,BANNEGON,,,18021,,,,,,,,,,,,,,,,,,,2008-01-01,A,,,,,68.20B,NAFRev2,N,2.715398,46.79937,0.94,street,Le Bourg 18210 Bannegon,18021_usssan,G,LE BOURG,
477783955,00016,47778395500016,O,2004-07-03,,,,2012-07-06T09:02:07,false,4,,,,,LE BOURG,18210,BANNEGON,,,18021,,,,,,,,,,,,,,,,,,,2010-08-07,F,,,,,56.10A,NAFRev2,N,2.715398,46.79937,0.94,street,Le Bourg 18210 Bannegon,18021_usssan,G,LE BOURG,
479288060,00011,47928806000011,O,2004-11-08,NN,,,2011-10-25T10:49:18,false,3,,,,,LA CROIX DES POUZES,18210,BANNEGON,,,18021,,,,,,,,,,,,,,,,,,,2005-06-30,F,,,,,52.6G,NAFRev1,N,2.723257,46.792139,0.94,street,La Croix des Pouzes 18210 Bannegon,18021_B100,G,LA CROIX DES POUZES,
480541697,00011,48054169700011,O,2005-01-24,,,,2008-01-05T00:10:27,true,2,,,,,LES JUNCHERES,18210,BANNEGON,,,18021,,,,,,,,,,,,,,,,,,,2008-01-01,A,,,,,47.99A,NAFRev2,N,2.74287,46.813961,0.93,street,Les Juncheres 18210 Bannegon,18021_4du4r1,G,LES JUNCHERES,
480669266,00029,48066926600029,O,2005-07-01,,,,2017-08-31T08:40:45,true,4,,,,,LA BARAQUE,18210,BANNEGON,,,18021,,,,,,,,,,,,,,,,,,,2016-09-30,F,,,,,90.03A,NAFRev2,N,2.704225,46.798757,0.93,street,La Baraque 18210 Bannegon,18021_851co7,G,LA BARAQUE,
481959351,00042,48195935100042,O,2008-03-17,,,,2008-06-03T20:30:54,true,2,,,,,LE BOURG,18210,BANNEGON,,,18021,,,,,,,,,,,,,,,,,,,2008-06-30,F,,,,,81.30Z,NAFRev2,N,2.715398,46.79937,0.94,street,Le Bourg 18210 Bannegon,18021_usssan,G,LE BOURG,
484119714,00018,48411971400018,O,2005-09-01,,,,2008-01-05T01:25:15,true,2,,,,LD,LE PETIT VERNAIS,18210,BANNEGON,,,18021,,,,,,,,,,,,,,,,,,,2008-01-01,A,,,,,01.45Z,NAFRev2,N,2.710729,46.797938,0.94,street,Le Petit Vernais 18210 Bannegon,18021_B172,G,LE PETIT VERNAIS,
488353657,00023,48835365700023,O,2020-06-12,,,,2021-02-23T13:52:53,true,1,,15,,RUE,DES GRANDS JARDINS,18210,BANNEGON,,,18021,,,,,,,,,,,,,,,,,,,2020-06-12,A,LE GOUT DES CHOSES,,,LE GOUT DES CHOSES,47.79Z,NAFRev2,N,2.717179,46.797712,0.94,housenumber,15 Rue des Grands Jardins 18210 Bannegon,18021_0035_00015,G,15 RUE DES GRANDS JARDINS,
490460144,00010,49046014400010,O,2006-01-01,NN,,,2008-04-26T19:25:45,true,3,,,,,CHATEAU DE BANNEGON,18210,BANNEGON,,,18021,,,,,,,,,,,,,,,,,,,2008-01-01,A,,,,,94.99Z,NAFRev2,N,2.742032,46.785194,0.65,street,Le Brot au Chat 18210 Bannegon,18021_B020,G,LE BROT AU CHAT,
493863864,00010,49386386400010,O,2006-12-13,,,,2022-02-17T08:47:12,true,3,,,,LD,LES BIONS,18210,BANNEGON,,,18021,,,,,,,,,,,,,,,,,,,2021-10-31,F,,,,,68.20B,NAFRev2,N,2.728542,46.820121,0.93,street,Les Bions 18210 Bannegon,18021_q4wv3g,G,LES BIONS,
503737579,00014,50373757900014,O,2008-05-01,NN,,,2018-06-05T13:45:29,false,3,,,,,LA TERRAUDE,18210,BANNEGON,,,18021,,,,,,,,,,,,,,,,,,,2009-03-09,F,,,,,43.31Z,NAFRev2,O,2.718638,46.806928,0.93,street,La Terraude 18210 Bannegon,18021_mu5ay3,G,LA TERRAUDE,