siren,nic,siret,statutDiffusionEtablissement,dateCreationEtablissement,trancheEffectifsEtablissement,anneeEffectifsEtablissement,activitePrincipaleRegistreMetiersEtablissement,dateDernierTraitementEtablissement,etablissementSiege,nombrePeriodesEtablissement,complementAdresseEtablissement,numeroVoieEtablissement,indiceRepetitionEtablissement,typeVoieEtablissement,libelleVoieEtablissement,codePostalEtablissement,libelleCommuneEtablissement,libelleCommuneEtrangerEtablissement,distributionSpecialeEtablissement,codeCommuneEtablissement,codeCedexEtablissement,libelleCedexEtablissement,codePaysEtrangerEtablissement,libellePaysEtrangerEtablissement,complementAdresse2Etablissement,numeroVoie2Etablissement,indiceRepetition2Etablissement,typeVoie2Etablissement,libelleVoie2Etablissement,codePostal2Etablissement,libelleCommune2Etablissement,libelleCommuneEtranger2Etablissement,distributionSpeciale2Etablissement,codeCommune2Etablissement,codeCedex2Etablissement,libelleCedex2Etablissement,codePaysEtranger2Etablissement,libellePaysEtranger2Etablissement,dateDebut,etatAdministratifEtablissement,enseigne1Etablissement,enseigne2Etablissement,enseigne3Etablissement,denominationUsuelleEtablissement,activitePrincipaleEtablissement,nomenclatureActivitePrincipaleEtablissement,caractereEmployeurEtablissement,longitude,latitude,geo_score,geo_type,geo_adresse,geo_id,geo_ligne,geo_l4,geo_l5
026050088,00058,02605008800058,O,2022-07-25,,,,2022-10-07T14:37:32,false,1,CANIHUEL,,,,BAUDRY,22480,SAINT-NICOLAS-DU-PELEM,,,22321,,,,,,,,,,,,,,,,,,,2022-07-25,A,,,,,08.12Z,NAFRev2,O,2.758921,50.261047,0.89,poi.pharmacy,Pharmacie Baudry Agny,https://osm.org/way/144652375,G,,
172202111,00321,17220211100321,O,1983-04-11,NN,,,2019-11-14T14:00:24,false,4,,18,,RUE,DU PELEM,22480,SAINT-NICOLAS-DU-PELEM,,,22321,,,,,,,,,,,,,,,,,,,2007-05-09,F,TRESORERIE SAINT-NICOLAS-DU-PELEM,,,,75.1A,NAFRev1,N,-3.163535,48.314027,0.95,housenumber,18 Rue du Pelem 22480 Saint-Nicolas-du-Pélem,22321_0206_00018,G,18 RUE DU PELEM,
172206617,00182,17220661700182,O,1985-01-01,NN,,,2019-11-14T14:00:24,false,5,,2,,RUE,GUSTAVE LAUNAY,22480,SAINT-NICOLAS-DU-PELEM,,,22321,,,,,,,,,,,,,,,,,,,2009-01-01,F,DDE SUBDIV ST NICOLAS DU PELEM,,,,84.13Z,NAFRev2,N,-3.163343,48.31205,0.95,housenumber,2 Rue Gustave Launay 22480 Saint-Nicolas-du-Pélem,22321_0152_00002,G,2 RUE GUSTAVE LAUNAY,
192200616,00014,19220061600014,O,1983-03-01,11,2020,,2022-08-29T09:04:21,true,5,,34,,RUE,DU STADE,22480,SAINT-NICOLAS-DU-PELEM,,BP 28,22321,,,,,,,,,,,,,,,,,,,2010-02-07,A,,,,,85.31Z,NAFRev2,O,-3.162965,48.310499,0.95,housenumber,34 Rue du Stade 22480 Saint-Nicolas-du-Pélem,22321_0247_00034,G,34 RUE DU STADE,
200086841,00018,20008684100018,O,2019-01-01,01,2020,,2022-08-29T09:05:33,true,1,,2,,RUE,GUSTAVE LAUNAY,22480,SAINT-NICOLAS-DU-PELEM,,,22321,,,,,,,,,,,,,,,,,,,2019-01-01,A,,,,,84.11Z,NAFRev2,O,-3.163343,48.31205,0.95,housenumber,2 Rue Gustave Launay 22480 Saint-Nicolas-du-Pélem,22321_0152_00002,G,2 RUE GUSTAVE LAUNAY,
212203210,00019,21220321000019,O,1983-03-01,12,2020,,2022-08-29T09:06:20,true,4,,,,RUE,AUGUSTE-LE-COENT,22480,SAINT-NICOLAS-DU-PELEM,,BP 32,22321,,,,,,,,,,,,,,,,,,,2008-01-01,A,MAIRIE,,,,84.11Z,NAFRev2,O,-3.163302,48.314606,0.94,street,Rue Auguste le Coent 22480 Saint-Nicolas-du-Pélem,22321_0192,G,RUE AUGUSTE LE COENT,
212203210,00043,21220321000043,O,1983-12-21,03,2020,,2022-08-29T09:06:20,false,3,,17,,RUE,A LE BRAZ,22480,SAINT-NICOLAS-DU-PELEM,,,22321,,,,,,,,,,,,,,,,,,,2008-01-01,A,ECOLE PRIMAIRE PUBLIQUE,,,,85.20Z,NAFRev2,N,-3.1649,48.309753,0.84,housenumber,17 Rue Anatole le Braz 22480 Saint-Nicolas-du-Pélem,22321_0194_00017,G,17 RUE ANATOLE LE BRAZ,
212203210,00050,21220321000050,O,1983-12-21,NN,,,2019-11-14T14:00:24,false,4,,,,RUE,A LE BRAZ,22480,SAINT-NICOLAS-DU-PELEM,,,22321,,,,,,,,,,,,,,,,,,,2002-04-17,F,ECOLE MATERNELLE PUBLIQUE,,,,80.1Z,NAF1993,N,-3.165155,48.310282,0.82,street,Rue Anatole le Braz 22480 Saint-Nicolas-du-Pélem,22321_0194,G,RUE ANATOLE LE BRAZ,
212203210,00068,21220321000068,O,1996-12-25,NN,,,2021-02-23T10:31:36,false,3,MAIRIE,,,RUE,AUGUSTE-LE-COENT,22480,SAINT-NICOLAS-DU-PELEM,,BP 32,22321,,,,,,,,,,,,,,,,,,,2015-12-25,A,SERVICE D'ASSAINISSEMENT,,,,37.00Z,NAFRev2,N,-3.163302,48.314606,0.94,street,Rue Auguste le Coent 22480 Saint-Nicolas-du-Pélem,22321_0192,G,RUE AUGUSTE LE COENT,
212203210,00076,21220321000076,O,2000-10-07,NN,,,2019-11-14T14:00:24,false,4,MAIRIE,,,AV,DE LA MAIRIE,22480,SAINT-NICOLAS-DU-PELEM,,,22321,,,,,,,,,,,,,,,,,,,2012-12-25,F,LOTISSEMENT SAINT NICOLAS,,,,42.99Z,NAFRev2,N,-3.174681,48.311034,0.49,street,Impasse de la Voie Romaine 22480 Saint-Nicolas-du-Pélem,22321_0300,G,IMPASSE DE LA VOIE ROMAINE,
212203210,00084,21220321000084,O,2003-04-09,NN,,,2019-11-14T14:00:24,false,4,MAIRIE,,,AV,DE LA MAIRIE,22480,SAINT-NICOLAS-DU-PELEM,,,22321,,,,,,,,,,,,,,,,,,,2009-07-24,F,LOTISSEMENT DU PETIT SAINT HERVE,,,,42.99Z,NAFRev2,N,-3.174681,48.311034,0.49,street,Impasse de la Voie Romaine 22480 Saint-Nicolas-du-Pélem,22321_0300,G,IMPASSE DE LA VOIE ROMAINE,
212203210,00092,21220321000092,O,1978-05-01,NN,,,2019-11-14T14:00:24,false,3,,,,LD,CROAS CUSSULIOU,22480,SAINT-NICOLAS-DU-PELEM,,,22321,,,,,,,,,,,,,,,,,,,2008-01-01,A,CAMPING MUNICIPAL CROAS CUSSULIOU,,,,55.30Z,NAFRev2,N,-3.181383,48.308577,0.75,street,La Croix de Cussuliou 22480 Saint-Nicolas-du-Pélem,22321_B158,G,LA CROIX DE CUSSULIOU,
242200715,00223,24220071500223,O,2007-02-09,,,,2022-02-25T14:09:42,false,1,,,,,PA DU RUELLOU,22480,SAINT-NICOLAS-DU-PELEM,,,22321,,,,,,,,,,,,,,,,,,,2007-02-09,A,DECHETTERIE DE SAINT-NICOLAS DU PELEM,,,,38.11Z,NAFRev2,N,-3.16012,48.30782,0.81,locality,ZA du Ruellou 22480 Saint-Nicolas-du-Pélem,22321_A100,G,ZA DU RUELLOU,
252200571,00013,25220057100013,O,,,,,2019-11-14T14:00:24,true,1,,,,,,22480,SAINT-NICOLAS-DU-PELEM,,,22321,,,,,,,,,,,,,,,,,,,,F,,,,,90.11,NAP,N,,,0,,,,,,
252200886,00015,25220088600015,O,1983-03-01,NN,,,2019-11-14T14:00:24,true,3,,,,,BOURG,22480,SAINT-NICOLAS-DU-PELEM,,,22321,,,,,,,,,,,,,,,,,,,2006-12-25,F,,,,,75.1E,NAFRev1,N,-1.229143,44.2011043,0.89,poi.school,École du bourg Mimizan,https://osm.org/way/35215942,G,,
252201223,00010,25220122300010,O,1983-03-01,NN,,,2019-11-14T14:00:24,false,3,,,,,BOURG,22480,SAINT-NICOLAS-DU-PELEM,,,22321,,,,,,,,,,,,,,,,,,,2003-10-27,F,,,,,,,O,-1.229143,44.2011043,0.89,poi.school,École du bourg Mimizan,https://osm.org/way/35215942,G,,
252201462,00014,25220146200014,O,1983-03-01,NN,,,2019-11-14T14:00:24,true,5,MAIRIE,,,RUE,AUGUSTE LE COENT,22480,SAINT-NICOLAS-DU-PELEM,,BP 32,22321,,,,,,,,,,,,,,,,,,,2013-01-01,F,,,,,84.12Z,NAFRev2,O,-3.163302,48.314606,0.94,street,Rue Auguste le Coent 22480 Saint-Nicolas-du-Pélem,22321_0192,G,RUE AUGUSTE LE COENT,
252201926,00018,25220192600018,O,1983-03-01,NN,,,2019-11-14T14:00:24,true,4,MAIRIE,,,RTE,DE CORLAY,22480,SAINT-NICOLAS-DU-PELEM,,,22321,,,,,,,,,,,,,,,,,,,2004-12-25,F,,,,,90.0A,NAFRev1,O,-3.139144,48.305986,0.81,locality,Route de Corlay 22480 Saint-Nicolas-du-Pélem,22321_C257,G,ROUTE DE CORLAY,
252202379,00019,25220237900019,O,1985-03-05,00,2020,,2022-08-29T09:09:56,true,4,MAIRIE,,,RUE,AUGUSTE-LE-COENT,22480,SAINT-NICOLAS-DU-PELEM,,,22321,,,,,,,,,,,,,,,,,,,2008-01-01,A,,,,,42.99Z,NAFRev2,O,-3.163302,48.314606,0.94,street,Rue Auguste le Coent 22480 Saint-Nicolas-du-Pélem,22321_0192,G,RUE AUGUSTE LE COENT,
262200355,00010,26220035500010,O,1983-03-01,12,2020,,2022-08-29T09:10:21,true,4,MAIRIE,,,RUE,AUGUSTE-LE-COENT,22480,SAINT-NICOLAS-DU-PELEM,,BP 32,22321,,,,,,,,,,,,,,,,,,,2008-01-01,A,,,,,88.99B,NAFRev2,O,-3.163302,48.314606,0.94,street,Rue Auguste le Coent 22480 Saint-Nicolas-du-Pélem,22321_0192,G,RUE AUGUSTE LE COENT,
262200355,00028,26220035500028,O,1984-12-05,NN,,,2022-03-11T08:45:09,false,7,,,,RUE,SAINTE TREPHINE,22480,SAINT-NICOLAS-DU-PELEM,,,22321,,,,,,,,,,,,,,,,,,,2022-01-01,A,EHPAD TI KERJEAN,,,,87.10A,NAFRev2,O,-3.160587,48.313817,0.95,street,Rue de Sainte Trephine 22480 Saint-Nicolas-du-Pélem,22321_0243,G,RUE DE SAINTE TREPHINE,
262200355,00036,26220035500036,O,2003-03-08,NN,,,2019-11-14T14:00:24,false,3,,,,RUE,DE STE TREPHINE,22480,SAINT-NICOLAS-DU-PELEM,,,22321,,,,,,,,,,,,,,,,,,,2008-01-01,F,FOYER LOGEMENTS TI REYEAN,,,,87.30A,NAFRev2,N,-3.160587,48.313817,0.86,street,Rue de Sainte Trephine 22480 Saint-Nicolas-du-Pélem,22321_0243,G,RUE DE SAINTE TREPHINE,
262201817,00018,26220181700018,O,1983-03-01,NN,,,2021-10-27T08:12:43,true,5,MAIRIE,,,RUE,AUGUSTE-LE-COENT,22480,SAINT-NICOLAS-DU-PELEM,,BP 32,22321,,,,,,,,,,,,,,,,,,,2015-12-25,A,,,,,88.99B,NAFRev2,O,-3.163302,48.314606,0.94,street,Rue Auguste le Coent 22480 Saint-Nicolas-du-Pélem,22321_0192,G,RUE AUGUSTE LE COENT,
262202278,00012,26220227800012,O,,,,,2019-11-14T14:00:24,true,1,,,,AV,MAIRIE,22480,SAINT-NICOLAS-DU-PELEM,,,22321,,,,,,,,,,,,,,,,,,,,F,,,,,85.04,NAP,N,3.0709671,50.6304695,0.92,poi.townhall,Hôtel de Ville Lille,https://osm.org/way/40917078,G,,
292200060,00013,29220006000013,O,1983-08-10,00,2020,,2022-08-29T09:10:54,true,4,MAIRIE,,,RUE,AUGUSTE-LE-COENT,22480,SAINT-NICOLAS-DU-PELEM,,,22321,,,,,,,,,,,,,,,,,,,2008-01-01,A,,,,,42.99Z,NAFRev2,O,-3.163302,48.314606,0.94,street,Rue Auguste le Coent 22480 Saint-Nicolas-du-Pélem,22321_0192,G,RUE AUGUSTE LE COENT,
300039484,00021,30003948400021,O,1900-01-01,NN,,,2019-11-14T14:00:24,false,3,,1,,IMP,ANATOLE LE BRAZ,22480,SAINT-NICOLAS-DU-PELEM,,,22321,,,,,,,,,,,,,,,,,,,1995-08-01,F,,,,,45.4F,NAF1993,N,-3.165062,48.309414,0.86,housenumber,1 Impasse Anatole le Braz 22480 Saint-Nicolas-du-Pélem,22321_0195_00001,G,1 IMPASSE ANATOLE LE BRAZ,
300801438,00031,30080143800031,O,1900-01-01,NN,,,2019-11-14T14:00:24,true,4,,26,,RUE,ANATOLE LE BRAZ,22480,SAINT-NICOLAS-DU-PELEM,,,22321,,,,,,,,,,,,,,,,,,,2009-09-30,F,,,,,43.34Z,NAFRev2,N,-3.164985,48.309723,0.95,housenumber,26 Rue Anatole le Braz 22480 Saint-Nicolas-du-Pélem,22321_0194_00026,G,26 RUE ANATOLE LE BRAZ,
300801685,00011,30080168500011,O,1900-01-01,NN,,,2019-11-14T14:00:24,true,4,,16,,RUE,DE ROSTRENEN,22480,SAINT-NICOLAS-DU-PELEM,,,22321,,,,,,,,,,,,,,,,,,,2016-09-18,F,,,,,86.23Z,NAFRev2,N,-3.165501,48.3131,0.96,housenumber,16 Rue de Rostrenen 22480 Saint-Nicolas-du-Pélem,22321_0238_00016,G,16 RUE DE ROSTRENEN,
301195764,00016,30119576400016,O,,NN,,,2019-11-14T14:00:24,true,1,,,,,,22480,SAINT-NICOLAS-DU-PELEM,,,22321,,,,,,,,,,,,,,,,,,,1987-07-18,F,,,,,77.14,NAP,N,,,0,,,,,,
301200424,00010,30120042400010,O,,,,,2019-11-14T14:00:24,true,1,,63,,RUE,DE ROSTRENEN,22480,SAINT-NICOLAS-DU-PELEM,,,22321,,,,,,,,,,,,,,,,,,,1985-12-25,F,,,,,87.07,NAP,N,-3.177472,48.309922,0.96,housenumber,63 Rue de Rostrenen 22480 Saint-Nicolas-du-Pélem,22321_0238_00063,G,63 RUE DE ROSTRENEN,
301200564,00013,30120056400013,O,,NN,,,2019-11-14T14:00:24,true,1,,17,,PL,KREISKER,22480,SAINT-NICOLAS-DU-PELEM,,,22321,,,,,,,,,,,,,,,,,,,1995-06-30,F,,,,,52.4Z,NAF1993,N,-3.161506,48.315296,0.83,housenumber,17 Place Kreisker 22480 Saint-Nicolas-du-Pélem,22321_0172_00017,G,17 PLACE KREISKER,
301510236,00013,30151023600013,O,,,,,2019-11-14T14:00:24,true,1,,,,LD,PICARDIE,22480,SAINT-NICOLAS-DU-PELEM,,,22321,,,,,,,,,,,,,,,,,,,1985-12-25,F,,,,,84.13,NAP,N,2.2951345,49.8905885,0.89,poi.museum,Musée de Picardie Amiens,https://osm.org/way/140247228,G,,
301805297,00019,30180529700019,O,1900-01-01,,,,2019-11-14T14:00:24,false,3,,4,,RUE,A LE BRAZ,22480,SAINT-NICOLAS-DU-PELEM,,,22321,,,,,,,,,,,,,,,,,,,1995-02-07,F,,,,,85.1G,NAF1993,N,-3.165953,48.311994,0.83,housenumber,4 Rue Anatole le Braz 22480 Saint-Nicolas-du-Pélem,22321_0194_00004,G,4 RUE ANATOLE LE BRAZ,
301805297,00027,30180529700027,O,1995-02-07,NN,,,2019-11-14T14:00:24,true,4,,27,,RUE,DU PELEM,22480,SAINT-NICOLAS-DU-PELEM,,,22321,,,,,,,,,,,,,,,,,,,2012-12-31,F,,,,,86.90E,NAFRev2,N,-3.163412,48.313979,0.95,housenumber,27 Rue du Pelem 22480 Saint-Nicolas-du-Pélem,22321_0206_00027,G,27 RUE DU PELEM,
302461686,00057,30246168600057,O,2019-06-15,,,,2020-11-05T08:35:24,true,2,,1,,RUE,DE KERSEVILLE,22480,SAINT-NICOLAS-DU-PELEM,,,22321,,,,,,,,,,,,,,,,,,,2020-10-30,F,,,,,93.29Z,NAFRev2,N,-3.166513,48.316292,0.95,housenumber,1 Rue de Kerseville 22480 Saint-Nicolas-du-Pélem,22321_0168_00001,G,1 RUE DE KERSEVILLE,
303342299,00011,30334229900011,O,,NN,,,2019-11-14T14:00:24,true,1,,,,LD,DANOUET,22480,SAINT-NICOLAS-DU-PELEM,,,22321,,,,,,,,,,,,,,,,,,,1993-12-03,F,,,,,45.2J,NAF1993,N,-3.18584,48.4633285,0.88,poi.place_of_worship,Chapelle du Danouet (Lieu de culte) Bourbriac,https://osm.org/way/407343532,G,,
303865000,00036,30386500000036,O,1988-07-11,NN,,,2019-11-14T14:00:24,true,1,,,,,ROND POINT MILTOWN,22480,SAINT-NICOLAS-DU-PELEM,,,22321,,,,,,,,,,,,,,,,,,,2002-03-31,F,,,,,70.2C,NAF1993,N,-3.164802,48.316248,0.34,street,Rue Louis et Michel Bertrand 22480 Saint-Nicolas-du-Pélem,22321_0110,G,RUE LOUIS ET MICHEL BERTRAND,
304252091,00034,30425209100034,O,1988-07-21,NN,,,2019-11-14T14:00:24,false,3,,65,,RTE,MARTYRS DE L'OCCUPATION,22480,SAINT-NICOLAS-DU-PELEM,,,22321,,,,,,,,,,,,,,,,,,,2004-04-01,F,,,,,01.4A,NAFRev1,N,-3.162987,48.308654,0.84,housenumber,65 Rue des Martyrs de l’Occupation 22480 Saint-Nicolas-du-Pélem,22321_605rdl_00065,G,65 RUE MARTYRS DE L OCCUPATION,
304252091,00042,30425209100042,O,1999-03-26,NN,,,2019-11-14T14:00:24,false,3,,65,,RUE,DES MARTYRS,22480,SAINT-NICOLAS-DU-PELEM,,,22321,,,,,,,,,,,,,,,,,,,2004-04-01,F,,,,,01.1A,NAFRev1,N,-3.162987,48.308654,0.93,housenumber,65 Rue des Martyrs de l’Occupation 22480 Saint-Nicolas-du-Pélem,22321_605rdl_00065,G,65 RUE MARTYRS DE L OCCUPATION,
304545742,00013,30454574200013,O,1900-01-01,NN,,,2019-11-14T14:00:24,true,3,,,,,PENANGUER BOTHOA,22480,SAINT-NICOLAS-DU-PELEM,,,22321,,,,,,,,,,,,,,,,,,,2006-12-31,F,,,,,01.4A,NAFRev1,N,,,0,,,,,,
304790710,00012,30479071000012,O,,,,,2019-11-14T14:00:24,true,1,,,,,BOTHOA,22480,SAINT-NICOLAS-DU-PELEM,,,22321,,,,,,,,,,,,,,,,,,,1984-12-25,F,,,,,60.01,NAP,N,-3.169828,48.310472,0.39,street,Rue Théodore Botrel 22480 Saint-Nicolas-du-Pélem,22321_0119,G,RUE THEODORE BOTREL,
306149394,00018,30614939400018,O,1900-01-01,NN,,,2019-11-14T14:00:24,false,4,,18,,RUE,ANATOLE LE BRAZ,22480,SAINT-NICOLAS-DU-PELEM,,,22321,,,,,,,,,,,,,,,,,,,2005-09-01,F,,,,,85.1C,NAFRev1,O,-3.165214,48.310463,0.95,housenumber,18 Rue Anatole le Braz 22480 Saint-Nicolas-du-Pélem,22321_0194_00018,G,18 RUE ANATOLE LE BRAZ,
306149394,00026,30614939400026,O,2005-09-01,NN,,,2019-11-14T14:00:24,true,3,,2,,RUE,GABRIEL PERI,22480,SAINT-NICOLAS-DU-PELEM,,,22321,,,,,,,,,,,,,,,,,,,2008-03-31,F,,,,,86.21Z,NAFRev2,O,-3.164598,48.314272,0.95,housenumber,2 Rue Gabriel Péri 22480 Saint-Nicolas-du-Pélem,22321_0211_00002,G,2 RUE GABRIEL PERI,
306933748,00015,30693374800015,O,,NN,,,2019-11-14T14:00:24,true,1,,,,,,22480,SAINT-NICOLAS-DU-PELEM,,,22321,,,,,,,,,,,,,,,,,,,1997-09-07,F,,,,,81.21,NAP,N,,,0,,,,,,
306959065,00385,30695906500385,O,1991-11-01,NN,,,2019-11-14T14:00:24,false,4,,18,,RUE,DE ROSTRENEN,22480,SAINT-NICOLAS-DU-PELEM,,,22321,,,,,,,,,,,,,,,,,,,2007-12-10,F,,,,,51.5A,NAFRev1,O,-3.165669,48.313031,0.96,housenumber,18 Rue de Rostrenen 22480 Saint-Nicolas-du-Pélem,22321_0238_00018,G,18 RUE DE ROSTRENEN,
306959065,01581,30695906501581,O,2005-05-30,NN,,,2019-11-14T14:00:24,false,4,,,,,LE RUELLOU,22480,SAINT-NICOLAS-DU-PELEM,,,22321,,,,,,,,,,,,,,,,,,,2013-12-31,F,COMBUSTIBLES DE L'OUEST,,,,46.71Z,NAFRev2,O,-3.150854,48.303846,0.94,street,Le Ruellou 22480 Saint-Nicolas-du-Pélem,22321_n4i57v,G,LE RUELLOU,
307025841,00031,30702584100031,O,1981-01-01,NN,,,2019-11-14T14:00:24,false,4,,4,,RUE,AUGUSTE LE BONNIEC,22480,SAINT-NICOLAS-DU-PELEM,,,22321,,,,,,,,,,,,,,,,,,,2008-03-31,F,,,,,71.11Z,NAFRev2,N,-3.159332,48.315467,0.95,housenumber,4 Rue Auguste le Bonniec 22480 Saint-Nicolas-du-Pélem,22321_0191_00004,G,4 RUE AUGUSTE LE BONNIEC,
308176932,00058,30817693200058,O,1995-05-02,NN,,,2019-11-14T14:00:24,false,3,,14,,RUE,AVRIL,22480,SAINT-NICOLAS-DU-PELEM,,,22321,,,,,,,,,,,,,,,,,,,2003-02-28,F,,,,,72.3Z,NAFRev1,,-3.160984,48.315017,0.87,housenumber,14 Rue Henri Avril 22480 Saint-Nicolas-du-Pélem,22321_0104_00014,G,14 RUE HENRI AVRIL,
309262699,00023,30926269900023,O,,NN,,,2019-11-14T14:00:24,true,1,,18,,RUE,DE ROSTRENEN,22480,SAINT-NICOLAS-DU-PELEM,,,22321,,,,,,,,,,,,,,,,,,,1994-01-02,F,,,,,70.2C,NAF1993,N,-3.165669,48.313031,0.96,housenumber,18 Rue de Rostrenen 22480 Saint-Nicolas-du-Pélem,22321_0238_00018,G,18 RUE DE ROSTRENEN,
309517357,00013,30951735700013,O,1900-01-01,NN,,,2019-11-14T14:00:24,false,3,,6,,RUE,HENRI AVRIL,22480,SAINT-NICOLAS-DU-PELEM,,BP 3,22321,,,,,,,,,,,,,,,,,,,2005-05-24,F,,,,,65.1D,NAFRev1,N,-3.161636,48.314915,0.95,housenumber,6 Rue Henri Avril 22480 Saint-Nicolas-du-Pélem,22321_0104_00006,G,6 RUE HENRI AVRIL,
309547545,00017,30954754500017,O,,,,,2019-11-14T14:00:24,true,1,,55,,RUE,DE STE TREPHINE,22480,SAINT-NICOLAS-DU-PELEM,,,22321,,,,,,,,,,,,,,,,,,,1984-12-25,F,,,,,82.06,NAP,N,-3.160587,48.313817,0.74,street,Rue de Sainte Trephine 22480 Saint-Nicolas-du-Pélem,22321_0243,G,RUE DE SAINTE TREPHINE,
309881985,00019,30988198500019,O,1900-01-01,NN,,,2019-11-14T14:00:24,true,3,,8,,RUE,DE BOISBOISSEL,22480,SAINT-NICOLAS-DU-PELEM,,,22321,,,,,,,,,,,,,,,,,,,2006-04-01,F,,,,,92.4Z,NAFRev1,N,-3.167643,48.314104,0.7,street,Impasse de Boisboissel 22480 Saint-Nicolas-du-Pélem,22321_0118,G,IMPASSE DE BOISBOISSEL,
310405618,00029,31040561800029,O,1981-10-01,NN,,,2019-11-14T14:00:24,true,1,,,,,BOTHOA,22480,SAINT-NICOLAS-DU-PELEM,,,22321,,,,,,,,,,,,,,,,,,,1999-06-30,F,,,,,45.4A,NAF1993,N,-3.169828,48.310472,0.39,street,Rue Théodore Botrel 22480 Saint-Nicolas-du-Pélem,22321_0119,G,RUE THEODORE BOTREL,
310812086,00026,31081208600026,O,,,,,2019-11-14T14:00:24,true,1,,5,,RUE,DE KERLONJOU,22480,SAINT-NICOLAS-DU-PELEM,,,22321,,,,,,,,,,,,,,,,,,,1984-12-25,F,,,,,55.71,NAP,N,-3.169514,48.315194,0.95,housenumber,5 Rue de Kerlonjou 22480 Saint-Nicolas-du-Pélem,22321_0163_00005,G,5 RUE DE KERLONJOU,
311092720,00011,31109272000011,O,1988-09-29,NN,,,2019-11-14T14:00:24,true,3,,8,,RUE,DU PELEM,22480,SAINT-NICOLAS-DU-PELEM,,,22321,,,,,,,,,,,,,,,,,,,1998-12-25,F,,,,,70.2C,NAF1993,N,-3.162668,48.314552,0.95,housenumber,8 Rue du Pelem 22480 Saint-Nicolas-du-Pélem,22321_0206_00008,G,8 RUE DU PELEM,
311701031,00024,31170103100024,O,2007-07-01,,,,2019-11-14T14:00:24,false,2,,14,,RUE,HENRI AVRIL,22480,SAINT-NICOLAS-DU-PELEM,,,22321,,,,,,,,,,,,,,,,,,,2008-01-01,A,,,,,88.10A,NAFRev2,N,-3.160984,48.315017,0.95,housenumber,14 Rue Henri Avril 22480 Saint-Nicolas-du-Pélem,22321_0104_00014,G,14 RUE HENRI AVRIL,
312008188,00012,31200818800012,O,,,,,2019-11-14T14:00:24,true,1,,1,,RUE,RENAN,22480,SAINT-NICOLAS-DU-PELEM,,,22321,,,,,,,,,,,,,,,,,,,1984-12-25,F,,,,,35.01,NAP,N,-3.165442,48.311614,0.86,housenumber,1 Rue Ernest Renan 22480 Saint-Nicolas-du-Pélem,22321_0224_00001,G,1 RUE ERNEST RENAN,
312332026,00011,31233202600011,O,,,,,2019-11-14T14:00:24,true,1,,,,,ZONE ARTISANALE DU RUELLOU,22480,SAINT-NICOLAS-DU-PELEM,,,22321,,,,,,,,,,,,,,,,,,,1990-06-30,F,,,,,53.04,NAP,N,,,0,,,,,,
312633126,00015,31263312600015,O,1978-01-01,,,,2019-11-14T14:00:24,false,3,,2,,RUE,KERAUTER AN GALL,22480,SAINT-NICOLAS-DU-PELEM,,,22321,,,,,,,,,,,,,,,,,,,1993-07-01,F,,,,,85.1G,NAF1993,N,-3.16977,48.313821,0.95,housenumber,2 Rue Kerauter An Gall 22480 Saint-Nicolas-du-Pélem,22321_0160_00002,G,2 RUE KERAUTER AN GALL,
312633126,00023,31263312600023,O,1993-07-01,NN,,,2019-11-14T14:00:24,true,4,,,,RUE,PRAT ZALL,22480,SAINT-NICOLAS-DU-PELEM,,,22321,,,,,,,,,,,,,,,,,,,2014-09-30,F,,,,,86.90D,NAFRev2,N,-3.162255,48.313903,0.95,street,Rue Prat Zall 22480 Saint-Nicolas-du-Pélem,22321_0219,G,RUE PRAT ZALL,
312694144,00014,31269414400014,O,1978-01-01,NN,,,2019-11-14T14:00:24,true,5,,,,,MAIRIE,22480,SAINT-NICOLAS-DU-PELEM,,,22321,,,,,,,,,,,,,,,,,,,2008-01-01,A,,,,,88.10A,NAFRev2,N,3.0709671,50.6304695,0.92,poi.townhall,Hôtel de Ville Lille,https://osm.org/way/40917078,G,,
312977218,00014,31297721800014,O,1978-01-01,NN,,,2022-09-30T15:51:35,false,4,,,,RUE,GABRIEL PERI,22480,SAINT-NICOLAS-DU-PELEM,,,22321,,,,,,,,,,,,,,,,,,,2002-12-25,F,,,,,85.1C,NAF1993,N,-3.164847,48.314251,0.95,street,Rue Gabriel Péri 22480 Saint-Nicolas-du-Pélem,22321_0211,G,RUE GABRIEL PERI,
312989049,00019,31298904900019,O,1978-01-01,NN,,,2019-11-14T14:00:24,true,3,,,,RUE,DE SAINTE TREPHINE,22480,SAINT-NICOLAS-DU-PELEM,,,22321,,,,,,,,,,,,,,,,,,,2002-12-31,F,,,,,28.4A,NAF1993,N,-3.160587,48.313817,0.95,street,Rue de Sainte Trephine 22480 Saint-Nicolas-du-Pélem,22321_0243,G,RUE DE SAINTE TREPHINE,
313724064,00024,31372406400024,O,1980-10-14,NN,,,2019-11-14T14:00:24,true,4,,8,,RTE,DE ROSTRENEN,22480,SAINT-NICOLAS-DU-PELEM,,,22321,,,,,,,,,,,,,,,,,,,2008-09-01,F,,,,,96.02A,NAFRev2,N,-3.164965,48.313317,0.82,housenumber,8 Rue de Rostrenen 22480 Saint-Nicolas-du-Pélem,22321_0238_00008,G,8 RUE DE ROSTRENEN,
313928384,00012,31392838400012,O,1978-01-01,,,,2019-11-14T14:00:24,true,1,,,,,KERGUINSEC,22480,SAINT-NICOLAS-DU-PELEM,,,22321,,,,,,,,,,,,,,,,,,,1992-05-09,F,,,,,01.3Z,NAF1993,N,-3.167501,48.319535,0.69,street,Kerguissec 22480 Saint-Nicolas-du-Pélem,22321_27ldb7,G,KERGUISSEC,
313990210,00012,31399021000012,O,,,,,2019-11-14T14:00:24,true,1,,,,,LA PISCINE,22480,SAINT-NICOLAS-DU-PELEM,,,22321,,,,,,,,,,,,,,,,,,,1985-12-25,F,,,,,67.01,NAP,N,-3.17599,48.311268,0.44,street,La Voie Romaine 22480 Saint-Nicolas-du-Pélem,22321_0075,G,LA VOIE ROMAINE,
314123563,00012,31412356300012,O,,,,,2019-11-14T14:00:24,true,1,,4,,RUE,DU PELEM,22480,SAINT-NICOLAS-DU-PELEM,,,22321,,,,,,,,,,,,,,,,,,,1985-12-25,F,,,,,62.43,NAP,N,-3.162462,48.314672,0.95,housenumber,4 Rue du Pelem 22480 Saint-Nicolas-du-Pélem,22321_0206_00004,G,4 RUE DU PELEM,
314766841,00022,31476684100022,O,,NN,,,2019-11-14T14:00:24,true,1,,,,RUE,KREISKER,22480,SAINT-NICOLAS-DU-PELEM,,,22321,,,,,,,,,,,,,,,,,,,,F,,,,,64.44,NAP,N,-3.162216,48.315175,0.73,street,Place Kreisker 22480 Saint-Nicolas-du-Pélem,22321_0172,G,PLACE KREISKER,
315028787,00028,31502878700028,O,1981-01-23,NN,,,2019-11-14T14:00:24,true,3,,,,,LE RUELLOU,22480,SAINT-NICOLAS-DU-PELEM,,,22321,,,,,,,,,,,,,,,,,,,2008-01-01,A,,,,,68.20A,NAFRev2,N,-3.150854,48.303846,0.94,street,Le Ruellou 22480 Saint-Nicolas-du-Pélem,22321_n4i57v,G,LE RUELLOU,
315091827,00016,31509182700016,O,1979-01-01,NN,,,2019-11-14T14:00:24,true,1,,7,B,RUE,DE PELEM,22480,SAINT-NICOLAS-DU-PELEM,,,22321,,,,,,,,,,,,,,,,,,,1999-12-29,F,,,,,60.2B,NAF1993,O,-3.160931,48.314566,0.77,housenumber,7bis Rue de Sainte Trephine 22480 Saint-Nicolas-du-Pélem,22321_0243_00007_bis,G,7BIS RUE DE SAINTE TREPHINE,
315411249,00016,31541124900016,O,1979-01-01,NN,,,2019-11-14T14:00:24,false,6,,2,,RUE,CHATEAUBRIAND,22480,SAINT-NICOLAS-DU-PELEM,,BP 13,22321,,,,,,,,,,,,,,,,,,,2017-04-01,F,,,,,41.20B,NAFRev2,N,-3.162195,48.312676,0.95,housenumber,2 Rue Chateaubriand 22480 Saint-Nicolas-du-Pélem,22321_0129_00002,G,2 RUE CHATEAUBRIAND,
315424036,00061,31542403600061,O,1997-09-30,NN,,,2019-11-14T14:00:24,true,4,,,,RUE,PRATZALL,22480,SAINT-NICOLAS-DU-PELEM,,,22321,,,,,,,,,,,,,,,,,,,2011-07-01,F,,,,,86.90D,NAFRev2,N,-3.162255,48.313903,0.81,street,Rue Prat Zall 22480 Saint-Nicolas-du-Pélem,22321_0219,G,RUE PRAT ZALL,
315846824,00011,31584682400011,O,,NN,,,2019-11-14T14:00:24,true,1,,5,,RUE,GABRIEL PERI,22480,SAINT-NICOLAS-DU-PELEM,,,22321,,,,,,,,,,,,,,,,,,,1989-11-30,F,,,,,64.11,NAP,N,-3.164762,48.314043,0.95,housenumber,5 Rue Gabriel Péri 22480 Saint-Nicolas-du-Pélem,22321_0211_00005,G,5 RUE GABRIEL PERI,
316543149,00017,31654314900017,O,1979-01-01,NN,,,2019-11-14T14:00:24,true,4,,,,,LE CLEANDY,22480,SAINT-NICOLAS-DU-PELEM,,,22321,,,,,,,,,,,,,,,,,,,2012-01-23,F,,,,,49.41B,NAFRev2,N,-3.166487,48.313982,0.36,street,Rue Charles le Goffic 22480 Saint-Nicolas-du-Pélem,22321_0196,G,RUE CHARLES LE GOFFIC,
316563238,00039,31656323800039,O,1987-09-01,NN,,,2019-11-14T14:00:24,false,4,,18,,RUE,ANATOLE LE BRAZ,22480,SAINT-NICOLAS-DU-PELEM,,,22321,,,,,,,,,,,,,,,,,,,2003-12-31,F,CENTRE MEDICAL ANATOLE LE BRAZ,,,,85.1C,NAFRev1,N,-3.165214,48.310463,0.95,housenumber,18 Rue Anatole le Braz 22480 Saint-Nicolas-du-Pélem,22321_0194_00018,G,18 RUE ANATOLE LE BRAZ,