siren,nic,siret,statutDiffusionEtablissement,dateCreationEtablissement,trancheEffectifsEtablissement,anneeEffectifsEtablissement,activitePrincipaleRegistreMetiersEtablissement,dateDernierTraitementEtablissement,etablissementSiege,nombrePeriodesEtablissement,complementAdresseEtablissement,numeroVoieEtablissement,indiceRepetitionEtablissement,typeVoieEtablissement,libelleVoieEtablissement,codePostalEtablissement,libelleCommuneEtablissement,libelleCommuneEtrangerEtablissement,distributionSpecialeEtablissement,codeCommuneEtablissement,codeCedexEtablissement,libelleCedexEtablissement,codePaysEtrangerEtablissement,libellePaysEtrangerEtablissement,complementAdresse2Etablissement,numeroVoie2Etablissement,indiceRepetition2Etablissement,typeVoie2Etablissement,libelleVoie2Etablissement,codePostal2Etablissement,libelleCommune2Etablissement,libelleCommuneEtranger2Etablissement,distributionSpeciale2Etablissement,codeCommune2Etablissement,codeCedex2Etablissement,libelleCedex2Etablissement,codePaysEtranger2Etablissement,libellePaysEtranger2Etablissement,dateDebut,etatAdministratifEtablissement,enseigne1Etablissement,enseigne2Etablissement,enseigne3Etablissement,denominationUsuelleEtablissement,activitePrincipaleEtablissement,nomenclatureActivitePrincipaleEtablissement,caractereEmployeurEtablissement,longitude,latitude,geo_score,geo_type,geo_adresse,geo_id,geo_ligne,geo_l4,geo_l5
130012867,00367,13001286700367,O,2010-11-01,NN,,,2021-10-27T08:03:55,false,2,,2,,AV,DES CANADIENS,27230,THIBERVILLE,,BP 11,27629,,,,,,,,,,,,,,,,,,,2019-01-01,F,TRESORERIE DE THIBERVILLE,,,,84.11Z,NAFRev2,N,0.453337,49.13715,0.85,housenumber,2 Avenue des Canadiens 27230 Thiberville,27629_0006_00002,G,2 AVENUE DES CANADIENS,
172702110,00153,17270211000153,O,1983-01-01,NN,,,2012-07-27T14:29:03,false,4,,2,,AV,DES CANADIENS,27230,THIBERVILLE,,,27629,,,,,,,,,,,,,,,,,,,2010-11-01,F,TRESORERIE THIBERVILLE,,,,84.11Z,NAFRev2,N,0.453337,49.13715,0.85,housenumber,2 Avenue des Canadiens 27230 Thiberville,27629_0006_00002,G,2 AVENUE DES CANADIENS,
192710994,00018,19271099400018,O,1983-03-01,12,2020,,2022-08-29T09:04:22,true,4,,2,,,ROUTE DE BERNAY,27230,THIBERVILLE,,,27629,,,,,,,,,,,,,,,,,,,2012-02-05,A,,,,,85.31Z,NAFRev2,O,0.461412,49.134399,0.95,housenumber,2 Route de Bernay 27230 Thiberville,27629_0030_00002,G,2 ROUTE DE BERNAY,
200066017,00019,20006601700019,O,2017-01-01,22,2020,,2022-08-29T09:05:20,true,1,,21,B,RUE,DE LISIEUX,27230,THIBERVILLE,,,27629,,,,,,,,,,,,,,,,,,,2017-01-01,A,,,,,84.11Z,NAFRev2,O,0.453437,49.138664,0.86,housenumber,21bis Rue de Lisieux 27230 Thiberville,27629_0085_00021_bis,G,21BIS RUE DE LISIEUX,
200066017,00027,20006601700027,O,2017-01-01,,,,2023-03-24T09:29:08,false,1,,21,B,RUE,DE LISIEUX,27230,THIBERVILLE,,,27629,,,,,,,,,,,,,,,,,,,2017-01-01,A,BAAE ZA BELLERIE (291),,,,42.99Z,NAFRev2,N,0.453437,49.138664,0.86,housenumber,21bis Rue de Lisieux 27230 Thiberville,27629_0085_00021_bis,G,21BIS RUE DE LISIEUX,
200066017,00043,20006601700043,O,2017-01-01,,,,2023-03-24T09:30:18,false,1,,21,B,RUE,DE LISIEUX,27230,THIBERVILLE,,,27629,,,,,,,,,,,,,,,,,,,2017-01-01,A,ZA INTERCOMMUNALE LA BELLERIE EPAIGNES (293),,,,42.99Z,NAFRev2,N,0.453437,49.138664,0.86,housenumber,21bis Rue de Lisieux 27230 Thiberville,27629_0085_00021_bis,G,21BIS RUE DE LISIEUX,
200066017,00068,20006601700068,O,2017-01-01,12,2020,,2022-08-29T09:05:20,false,2,,21,B,RUE,DE LISIEUX,27230,THIBERVILLE,,,27629,,,,,,,,,,,,,,,,,,,2017-05-31,A,SERVICE AIDE A DOMICILE LIEUVIN PAYS D'AUGE,,,,88.10A,NAFRev2,O,0.453437,49.138664,0.86,housenumber,21bis Rue de Lisieux 27230 Thiberville,27629_0085_00021_bis,G,21BIS RUE DE LISIEUX,
200066017,00076,20006601700076,O,2017-01-01,03,2020,,2023-03-24T09:31:39,false,2,,21,B,RUE,DE LISIEUX,27230,THIBERVILLE,,,27629,,,,,,,,,,,,,,,,,,,2017-05-31,A,SPANC LIEUVIN PAYS D'AUGE,,,,84.12Z,NAFRev2,N,0.453437,49.138664,0.86,housenumber,21bis Rue de Lisieux 27230 Thiberville,27629_0085_00021_bis,G,21BIS RUE DE LISIEUX,
200066017,00084,20006601700084,O,2017-01-01,,,,2017-08-18T10:29:41,false,2,,21,B,RUE,DE LISIEUX,27230,THIBERVILLE,,,27629,,,,,,,,,,,,,,,,,,,2017-05-31,F,ACTION SOCIALE VIEVRE LIEUVIN(SCE AIDE A DOMICILE),,,,88.10A,NAFRev2,N,0.453437,49.138664,0.86,housenumber,21bis Rue de Lisieux 27230 Thiberville,27629_0085_00021_bis,G,21BIS RUE DE LISIEUX,
200066017,00092,20006601700092,O,2017-01-01,NN,,,2021-03-10T12:54:20,false,2,,21,B,RUE,DE LISIEUX,27230,THIBERVILLE,,,27629,,,,,,,,,,,,,,,,,,,2018-12-31,F,REGIE DE TRANSPORT VIEVRE LIEUVIN,,,,49.39A,NAFRev2,O,0.453437,49.138664,0.86,housenumber,21bis Rue de Lisieux 27230 Thiberville,27629_0085_00021_bis,G,21BIS RUE DE LISIEUX,
200066017,00100,20006601700100,O,2017-01-01,,,,2023-03-24T09:32:50,false,1,,21,B,RUE,DE LISIEUX,27230,THIBERVILLE,,,27629,,,,,,,,,,,,,,,,,,,2017-01-01,A,ZONE D'ACTIVITES LE CASTEL,,,,42.99Z,NAFRev2,N,0.453437,49.138664,0.86,housenumber,21bis Rue de Lisieux 27230 Thiberville,27629_0085_00021_bis,G,21BIS RUE DE LISIEUX,
200066017,00118,20006601700118,O,2018-03-06,,,,2023-03-24T09:34:06,false,1,,21,B,RUE,DE LISIEUX,27230,THIBERVILLE,,,27629,,,,,,,,,,,,,,,,,,,2018-03-06,A,ZONE D'ACTIVITES LE CHEVAL NOIR,,,,42.99Z,NAFRev2,N,0.453437,49.138664,0.86,housenumber,21bis Rue de Lisieux 27230 Thiberville,27629_0085_00021_bis,G,21BIS RUE DE LISIEUX,
200066017,00126,20006601700126,O,2018-03-26,,,,2023-03-24T09:35:41,false,1,,21,B,RUE,DE LISIEUX,27230,THIBERVILLE,,,27629,,,,,,,,,,,,,,,,,,,2018-03-26,A,BAAE1 ZONE D'ACTIVITES LE CASTEL,,,,42.99Z,NAFRev2,N,0.453437,49.138664,0.86,housenumber,21bis Rue de Lisieux 27230 Thiberville,27629_0085_00021_bis,G,21BIS RUE DE LISIEUX,
212706295,00012,21270629500012,O,1983-03-01,12,2020,,2022-08-29T09:06:35,true,4,,14,,RUE,DE LISIEUX,27230,THIBERVILLE,,,27629,,,,,,,,,,,,,,,,,,,2008-01-01,A,MAIRIE,,,,84.11Z,NAFRev2,O,0.456326,49.137565,0.96,housenumber,14 Rue de Lisieux 27230 Thiberville,27629_0085_00014,G,14 RUE DE LISIEUX,
212706295,00020,21270629500020,O,1983-12-21,03,2020,,2022-08-29T09:06:35,false,4,,,,PL,DES ECOLES,27230,THIBERVILLE,,,27629,,,,,,,,,,,,,,,,,,,2008-01-01,A,ECOLE ELEMENTAIRE PUBLIQUE,,,,85.20Z,NAFRev2,N,0.457616,49.135937,0.8,street,Place des Ecoles 27230 Thiberville,27629_0009,G,PLACE DES ECOLES,
212706295,00038,21270629500038,O,1983-12-21,02,2020,,2022-08-29T09:06:35,false,3,,,,,PLACE DES ECOLES,27230,THIBERVILLE,,,27629,,,,,,,,,,,,,,,,,,,2008-01-01,A,ECOLE MATERNELLE PUBLIQUE,,,,85.10Z,NAFRev2,N,0.457616,49.135937,0.95,street,Place des Ecoles 27230 Thiberville,27629_0009,G,PLACE DES ECOLES,
212706295,00046,21270629500046,O,1996-12-25,NN,,,,false,3,MAIRIE,14,,RUE,DE LISIEUX,27230,THIBERVILLE,,,27629,,,,,,,,,,,,,,,,,,,2002-11-29,F,CANTINE SCOLAIRE,,,,55.5A,NAF1993,N,0.456326,49.137565,0.96,housenumber,14 Rue de Lisieux 27230 Thiberville,27629_0085_00014,G,14 RUE DE LISIEUX,
212706295,00053,21270629500053,O,1996-12-25,NN,,,2008-01-04T18:29:50,false,2,MAIRIE,,,,,27230,THIBERVILLE,,,27629,,,,,,,,,,,,,,,,,,,2008-01-01,A,SERVICE D'ASSAINISSEMENT,,,,37.00Z,NAFRev2,N,0.456322,49.13801,0.92,street,Rue de la Mairie 27230 Thiberville,27629_0088,D,RUE DE LA MAIRIE,
212706295,00061,21270629500061,O,1998-01-01,NN,,,2006-10-26T23:40:39,false,3,MAIRIE,14,,RUE,DE LISIEUX,27230,THIBERVILLE,,,27629,,,,,,,,,,,,,,,,,,,2006-07-04,F,LOTISSEMENT L'EPINE,,,,70.1C,NAFRev1,N,0.456326,49.137565,0.96,housenumber,14 Rue de Lisieux 27230 Thiberville,27629_0085_00014,G,14 RUE DE LISIEUX,
212706295,00079,21270629500079,O,1998-01-01,NN,,,2006-10-26T23:40:39,false,3,MAIRIE,14,,RUE,DE LISIEUX,27230,THIBERVILLE,,,27629,,,,,,,,,,,,,,,,,,,2004-06-02,F,LOTISSEMENT LEPINEUX,,,,70.1C,NAFRev1,N,0.456326,49.137565,0.96,housenumber,14 Rue de Lisieux 27230 Thiberville,27629_0085_00014,G,14 RUE DE LISIEUX,
212706295,00087,21270629500087,O,2005-08-31,,,,2012-08-21T16:21:19,false,3,MAIRIE,14,,RUE,LISIEUX,27230,THIBERVILLE,,,27629,,,,,,,,,,,,,,,,,,,2012-02-02,F,LOTISSEMENT LA ROUTE D'ORBEC,,,,42.99Z,NAFRev2,N,0.456326,49.137565,0.95,housenumber,14 Rue de Lisieux 27230 Thiberville,27629_0085_00014,G,14 RUE DE LISIEUX,
242700193,00012,24270019300012,O,,NN,,,,true,1,,,,,,27230,THIBERVILLE,,,27629,,,,,,,,,,,,,,,,,,,1997-01-01,F,,,,,75.1A,NAF1993,O,,,0,,,,,,
242700425,00018,24270042500018,O,1997-01-01,NN,,,,false,4,,1,B,RUE,DE BERNAY,27230,THIBERVILLE,,,27629,,,,,,,,,,,,,,,,,,,2001-10-18,F,,,,,75.1A,NAF1993,O,0.454928,49.137792,0.85,housenumber,1bis Rue de Bernay 27230 Thiberville,27629_0065_00001_bis,G,1BIS RUE DE BERNAY,
242700425,00026,24270042500026,O,1997-01-01,NN,,,2006-11-25T09:08:29,false,4,,1,B,RUE,DE BERNAY,27230,THIBERVILLE,,,27629,,,,,,,,,,,,,,,,,,,2001-10-18,F,SERVICE AIDE MENAGERE DU CANTON,,,,85.3J,NAF1993,N,0.454928,49.137792,0.85,housenumber,1bis Rue de Bernay 27230 Thiberville,27629_0065_00001_bis,G,1BIS RUE DE BERNAY,
242700425,00034,24270042500034,O,2001-10-18,NN,,,2019-06-24T13:13:08,true,4,,21,B,RUE,DE LISIEUX,27230,THIBERVILLE,,,27629,,,,,,,,,,,,,,,,,,,2017-01-01,F,,,,,84.11Z,NAFRev2,O,0.453437,49.138664,0.86,housenumber,21bis Rue de Lisieux 27230 Thiberville,27629_0085_00021_bis,G,21BIS RUE DE LISIEUX,
242700425,00042,24270042500042,O,2001-10-18,NN,,,2019-06-24T13:13:08,false,4,,21,B,RUE,DE LISIEUX,27230,THIBERVILLE,,,27629,,,,,,,,,,,,,,,,,,,2017-01-01,F,SERVICE AIDE MENAGERE DU CANTON,,,,88.10A,NAFRev2,N,0.453437,49.138664,0.86,housenumber,21bis Rue de Lisieux 27230 Thiberville,27629_0085_00021_bis,G,21BIS RUE DE LISIEUX,
242700425,00059,24270042500059,O,2002-01-09,NN,,,2018-09-29T12:07:17,false,4,,21,B,RUE,DE LISIEUX,27230,THIBERVILLE,,,27629,,,,,,,,,,,,,,,,,,,2017-01-01,F,SERVICE D'ASSAINISSEMENT,,,,37.00Z,NAFRev2,N,0.453437,49.138664,0.86,housenumber,21bis Rue de Lisieux 27230 Thiberville,27629_0085_00021_bis,G,21BIS RUE DE LISIEUX,
252701008,00028,25270100800028,O,2002-07-01,NN,,,2015-05-14T03:46:24,true,5,COMMUNAUTE DE CNES,21,B,RUE,DE LISIEUX,27230,THIBERVILLE,,,27629,,,,,,,,,,,,,,,,,,,2014-01-01,F,,,,,84.12Z,NAFRev2,O,0.453437,49.138664,0.86,housenumber,21bis Rue de Lisieux 27230 Thiberville,27629_0085_00021_bis,G,21BIS RUE DE LISIEUX,
252701016,00013,25270101600013,O,1983-03-01,NN,,,2006-10-26T23:43:31,true,3,,,,,,27230,THIBERVILLE,,,27629,,,,,,,,,,,,,,,,,,,2004-12-31,F,,,,,41.0Z,NAFRev1,N,,,0,,,,,,
252701834,00019,25270183400019,O,,NN,,,,true,1,,,,,,27230,THIBERVILLE,,,27629,,,,,,,,,,,,,,,,,,,1997-10-08,F,,,,,75.1C,NAF1993,N,,,0,,,,,,
252704101,00010,25270410100010,O,1996-12-31,,,,,false,2,,1,B,RUE,DE BERNAY,27230,THIBERVILLE,,,27629,,,,,,,,,,,,,,,,,,,2001-12-05,F,,,,,80.1Z,NAF1993,N,0.454928,49.137792,0.85,housenumber,1bis Rue de Bernay 27230 Thiberville,27629_0065_00001_bis,G,1BIS RUE DE BERNAY,
252704101,00028,25270410100028,O,2001-12-05,NN,,,2020-08-25T10:20:19,false,4,,21,B,RUE,DE LISIEUX,27230,THIBERVILLE,,,27629,,,,,,,,,,,,,,,,,,,2018-07-17,F,,,,,85.20Z,NAFRev2,N,0.453437,49.138664,0.86,housenumber,21bis Rue de Lisieux 27230 Thiberville,27629_0085_00021_bis,G,21BIS RUE DE LISIEUX,
252704119,00012,25270411900012,O,1995-12-25,,,,,false,3,,1,B,RUE,DE BERNAY,27230,THIBERVILLE,,,27629,,,,,,,,,,,,,,,,,,,2001-12-05,F,,,,,80.1Z,NAF1993,N,0.454928,49.137792,0.85,housenumber,1bis Rue de Bernay 27230 Thiberville,27629_0065_00001_bis,G,1BIS RUE DE BERNAY,
252704119,00020,25270411900020,O,2001-12-05,NN,,,2021-10-27T08:12:04,false,4,,21,B,RUE,DE LISIEUX,27230,THIBERVILLE,,,27629,,,,,,,,,,,,,,,,,,,2019-07-01,F,,,,,85.20Z,NAFRev2,N,0.453437,49.138664,0.86,housenumber,21bis Rue de Lisieux 27230 Thiberville,27629_0085_00021_bis,G,21BIS RUE DE LISIEUX,
252704127,00015,25270412700015,O,1996-12-31,,,,,false,2,,1,B,RTE,DE BERNAY,27230,THIBERVILLE,,,27629,,,,,,,,,,,,,,,,,,,2001-12-05,F,,,,,80.1Z,NAF1993,N,0.454928,49.137792,0.69,housenumber,1bis Rue de Bernay 27230 Thiberville,27629_0065_00001_bis,G,1BIS RUE DE BERNAY,
252704127,00023,25270412700023,O,2001-12-05,NN,,,2020-08-25T10:20:19,false,4,,21,B,RUE,DE LISIEUX,27230,THIBERVILLE,,,27629,,,,,,,,,,,,,,,,,,,2018-02-12,F,,,,,85.20Z,NAFRev2,N,0.453437,49.138664,0.86,housenumber,21bis Rue de Lisieux 27230 Thiberville,27629_0085_00021_bis,G,21BIS RUE DE LISIEUX,
262701972,00016,26270197200016,O,1982-01-01,,,,2006-11-25T09:09:39,true,3,,,,,,27230,THIBERVILLE,,,27629,,,,,,,,,,,,,,,,,,,2002-04-12,F,CDE,,,,85.3K,NAF1993,N,,,0,,,,,,
262706443,00013,26270644300013,O,1995-12-25,,,,2010-06-26T03:07:22,true,2,MAIRIE,14,,RUE,DE LISIEUX,27230,THIBERVILLE,,,27629,,,,,,,,,,,,,,,,,,,2008-01-01,A,CCAS,,,,88.99B,NAFRev2,N,0.456326,49.137565,0.96,housenumber,14 Rue de Lisieux 27230 Thiberville,27629_0085_00014,G,14 RUE DE LISIEUX,
272700998,00011,27270099800011,O,,,,,,true,1,,,,,,27230,THIBERVILLE,,,27629,,,,,,,,,,,,,,,,,,,1995-12-25,F,,,,,90.0A,NAF1993,N,,,0,,,,,,
272701178,00019,27270117800019,O,,,,,,true,1,,,,,,27230,THIBERVILLE,,,27629,,,,,,,,,,,,,,,,,,,1995-12-25,F,,,,,55.5A,NAF1993,N,,,0,,,,,,
300189750,00023,30018975000023,O,,,,,,true,1,,6,,RUE,DE BERNAY,27230,THIBERVILLE,,,27629,,,,,,,,,,,,,,,,,,,1984-12-25,F,,,,,38.40,NAP,N,0.45471,49.137746,0.96,housenumber,6 Rue de Bernay 27230 Thiberville,27629_0065_00006,G,6 RUE DE BERNAY,
300490760,00018,30049076000018,O,,,,,,true,1,,8,,PL,D'ARMES,27230,THIBERVILLE,,,27629,,,,,,,,,,,,,,,,,,,1987-12-31,F,,,,,62.41,NAP,N,0.455365,49.138252,0.8,housenumber,8 Place d’Armes 27230 Thiberville,27629_0063_00008,G,8 PLACE D ARMES,
300883568,00010,30088356800010,O,,NN,,,,true,1,,,,RUE,DU MESNIL,27230,THIBERVILLE,,,27629,,,,,,,,,,,,,,,,,,,1991-10-06,F,,,,,45.4D,NAF1993,N,0.459498,49.138316,0.95,street,Rue du Mesnil 27230 Thiberville,27629_0092,G,RUE DU MESNIL,
300922184,00019,30092218400019,O,,,,,,true,1,,,,,SAINT GERMAIN LA CAMPAGNE,27230,THIBERVILLE,,,27629,,,,,,,,,,,,,,,,,,,1984-12-25,F,,,,,,,N,0.4426541,49.0346682,0.91,poi,(Pont) Saint-Germain-la-Campagne,https://osm.org/way/24908743,G,,
301018420,00010,30101842000010,O,,NN,,,,true,1,,28,,RUE,DE LISIEUX,27230,THIBERVILLE,,,27629,,,,,,,,,,,,,,,,,,,1989-12-29,F,,,,,69.11,NAP,N,0.449687,49.139513,0.96,housenumber,28 Rue de Lisieux 27230 Thiberville,27629_0085_00028,G,28 RUE DE LISIEUX,
301107843,00015,30110784300015,O,,,,,2006-11-25T09:12:39,true,1,,4,,RUE,D ORBEC,27230,THIBERVILLE,,,27629,,,,,,,,,,,,,,,,,,,1990-07-01,F,,,,,93.0D,NAF1993,N,0.454764,49.138008,0.96,housenumber,4 Rue d’Orbec 27230 Thiberville,27629_0060_00004,G,4 RUE D ORBEC,
301180956,00031,30118095600031,O,1988-04-01,NN,,,,true,1,,8,,PL,D'ARMES,27230,THIBERVILLE,,,27629,,,,,,,,,,,,,,,,,,,2001-12-31,F,,,,,52.2A,NAF1993,O,0.455365,49.138252,0.8,housenumber,8 Place d’Armes 27230 Thiberville,27629_0063_00008,G,8 PLACE D ARMES,
301228227,00049,30122822700049,O,1900-01-01,NN,,,2011-04-28T00:10:51,false,4,,2,,ALL,POULAIN,27230,THIBERVILLE,,,27629,,,,,,,,,,,,,,,,,,,1995-12-25,F,,,,,45.4J,NAF1993,N,0.455503,49.137241,0.82,housenumber,2 Allee Poulain 27230 Thiberville,27629_7dqtms_00002,G,2 ALLEE POULAIN,
301446100,00010,30144610000010,O,1900-01-01,NN,,,,false,4,,10,T,RTE,DE LIEUREY,27230,THIBERVILLE,,,27629,,,,,,,,,,,,,,,,,,,2003-01-02,F,,,,,85.1C,NAFRev1,N,0.456901,49.139999,0.72,housenumber,10ter Rue de Lieurey 27230 Thiberville,27629_0080_00010_ter,G,10TER RUE DE LIEUREY,
301446100,00028,30144610000028,O,2003-01-02,NN,,,2010-07-21T14:22:44,false,5,,6,,RUE,DE CORMEILLES,27230,THIBERVILLE,,,27629,,,,,,,,,,,,,,,,,,,2010-06-30,F,,,,,86.21Z,NAFRev2,O,0.448319,49.146703,0.96,housenumber,6 Rue de Cormeilles 27230 Thiberville,27629_0070_00006,G,6 RUE DE CORMEILLES,
301767570,00015,30176757000015,O,1964-01-01,NN,,,2008-11-07T00:17:49,false,4,,1,,RUE,DU 8 MAI,27230,THIBERVILLE,,,27629,,,,,,,,,,,,,,,,,,,1996-12-25,F,,,,,45.2L,NAF1993,O,0.456896,49.142893,0.95,housenumber,1 Rue du 8 Mai 27230 Thiberville,27629_0014_00001,G,1 RUE DU 8 MAI,
301767570,00023,30176757000023,O,1996-01-01,02,2020,4391AZ,2022-08-29T09:11:23,true,4,ZI,,,RTE,DE CORMEILLES,27230,THIBERVILLE,,,27629,,,,,,,,,,,,,,,,,,,2008-01-01,A,,,,,43.91A,NAFRev2,O,0.453115,49.142877,0.85,street,Route de Cormeilles 27230 Thiberville,27629_0035,G,ROUTE DE CORMEILLES,
302187844,00014,30218784400014,O,,,,,,true,1,,44,,RUE,DE BERNAY,27230,THIBERVILLE,,,27629,,,,,,,,,,,,,,,,,,,1984-12-25,F,,,,,64.23,NAP,N,0.456985,49.136869,0.96,housenumber,44 Rue de Bernay 27230 Thiberville,27629_0065_00044,G,44 RUE DE BERNAY,
302424841,00013,30242484100013,O,,,,,,true,1,,2,,RUE,D'ORBEC,27230,THIBERVILLE,,,27629,,,,,,,,,,,,,,,,,,,1985-12-25,F,,,,,62.43,NAP,N,0.454779,49.138025,0.96,housenumber,2 Rue d’Orbec 27230 Thiberville,27629_0060_00002,G,2 RUE D ORBEC,
303014088,00023,30301408800023,O,,NN,,,,true,1,,,,,LA BULLE,27230,THIBERVILLE,,,27629,,,,,,,,,,,,,,,,,,,,F,,,,,77.01,NAP,N,0.420685,49.124979,0.92,street,La Bulletière 27230 Thiberville,27629_5f8xcr,G,LA BULLETIERE,
303755532,00015,30375553200015,O,1977-01-01,NN,,,2008-11-07T00:19:23,true,3,,18,,RUE,DE BERNAY,27230,THIBERVILLE,,,27629,,,,,,,,,,,,,,,,,,,2007-06-30,F,,,,,93.0D,NAFRev1,N,0.45551,49.137588,0.96,housenumber,18 Rue de Bernay 27230 Thiberville,27629_0065_00018,G,18 RUE DE BERNAY,
305368243,00013,30536824300013,O,1900-01-01,,,,2020-08-11T03:48:34,true,5,,4,,AV,DES CANADIENS,27230,THIBERVILLE,,,27629,,,,,,,,,,,,,,,,,,,2020-06-30,F,,,,,71.11Z,NAFRev2,N,0.452947,49.137207,0.85,housenumber,4 Avenue des Canadiens 27230 Thiberville,27629_0006_00004,G,4 AVENUE DES CANADIENS,
305837817,00348,30583781700348,O,1998-07-27,01,2020,,2022-08-29T09:12:23,false,3,,18,,RUE,DE LISIEUX,27230,THIBERVILLE,,,27629,,,,,,,,,,,,,,,,,,,2008-01-01,A,,,,,86.10Z,NAFRev2,O,0.454525,49.138325,0.96,housenumber,18 Rue de Lisieux 27230 Thiberville,27629_0085_00018,G,18 RUE DE LISIEUX,
306218603,00018,30621860300018,O,1976-01-01,NN,,,2010-11-24T10:27:46,true,4,,3,,RUE,DE LISIEUX,27230,THIBERVILLE,,,27629,,,,,,,,,,,,,,,,,,,2009-12-25,F,,,,,68.20B,NAFRev2,N,0.457481,49.136948,0.96,housenumber,3 Rue de Lisieux 27230 Thiberville,27629_0085_00003,G,3 RUE DE LISIEUX,
306614280,00015,30661428000015,O,1900-01-01,NN,,,,false,3,,6,,RUE,DE LA MAIRIE,27230,THIBERVILLE,,,27629,,,,,,,,,,,,,,,,,,,1995-12-31,F,AGF,,,,67.2Z,NAF1993,,0.456322,49.13801,0.87,street,Rue de la Mairie 27230 Thiberville,27629_0088,G,RUE DE LA MAIRIE,
306614298,00017,30661429800017,O,1900-01-01,,,,2014-07-08T00:13:31,true,5,,2,,RUE,QUARANTE SOUS,27230,THIBERVILLE,,,27629,,,,,,,,,,,,,,,,,,,2011-12-31,F,,,,,43.34Z,NAFRev2,N,0.456698,49.138389,0.49,housenumber,2 Rue des 40 sous 27230 Thiberville,27629_0095_00002,G,2 RUE DES 40 SOUS,
306618760,00012,30661876000012,O,,NN,,,,true,1,,22,,RUE,DE BERNAY,27230,THIBERVILLE,,,27629,,,,,,,,,,,,,,,,,,,,F,,,,,66.01,NAP,N,0.455649,49.137537,0.96,housenumber,22 Rue de Bernay 27230 Thiberville,27629_0065_00022,G,22 RUE DE BERNAY,
307715961,00016,30771596100016,O,1900-01-01,00,2020,,2022-08-29T09:12:45,true,3,,,,,,27230,THIBERVILLE,,,27629,,,,,,,,,,,,,,,,,,,2008-01-01,A,,,,,94.99Z,NAFRev2,O,,,0,,,,,,
308980820,00010,30898082000010,O,1964-01-01,NN,,,2008-11-07T00:23:40,true,4,,3,,RUE,DE BERNAY,27230,THIBERVILLE,,,27629,,,,,,,,,,,,,,,,,,,2004-03-31,F,,,,,15.1F,NAFRev1,O,0.455897,49.137522,0.96,housenumber,3 Rue de Bernay 27230 Thiberville,27629_0065_00003,G,3 RUE DE BERNAY,
309034445,00010,30903444500010,O,1900-01-01,NN,,,2016-12-23T13:39:46,true,4,LE BEAUJOUAS,400,,RTE,DU PAYS D'AUGE,27230,THIBERVILLE,,,27629,,,,,,,,,,,,,,,,,,,2016-12-07,A,,,,,70.10Z,NAFRev2,N,0.443429,49.144354,0.9,housenumber,400 Route des Portes du Pays d’Auge 27230 Thiberville,27629_0120_00400,G,400 RTE PORTES DU PAYS D AUGE,
309484889,00014,30948488900014,O,1977-01-01,NN,,,2017-12-11T19:51:42,true,4,,,,,POSTE RESTANTE,27230,THIBERVILLE,,,27629,,,,,,,,,,,,,,,,,,,2016-12-31,F,,,,,93.29Z,NAFRev2,N,0.455957,49.136271,0.42,street,Rue de l’Ancienne Poste 27230 Thiberville,27629_0003,G,RUE DE L ANCIENNE POSTE,
310657515,00014,31065751500014,O,,,,,,true,1,,38,,RUE,DE BERNAY,27230,THIBERVILLE,,,27629,,,,,,,,,,,,,,,,,,,1989-10-01,F,,,,,67.01,NAP,N,0.456652,49.137027,0.96,housenumber,38 Rue de Bernay 27230 Thiberville,27629_0065_00038,G,38 RUE DE BERNAY,
310972252,00020,31097225200020,O,1900-01-01,01,2020,,2022-08-29T09:13:34,true,4,,23,,RUE,DE LISIEUX,27230,THIBERVILLE,,,27629,,,,,,,,,,,,,,,,,,,2008-01-01,A,,,,,86.21Z,NAFRev2,O,0.452381,49.138803,0.96,housenumber,23 Rue de Lisieux 27230 Thiberville,27629_0085_00023,G,23 RUE DE LISIEUX,
310978192,00030,31097819200030,O,2007-07-02,,,9602AA,2021-02-23T10:38:57,true,1,,18,,RUE,DE BERNAY,27230,THIBERVILLE,,,27629,,,,,,,,,,,,,,,,,,,2007-07-02,A,,,,,96.02A,NAFRev2,N,0.45551,49.137588,0.96,housenumber,18 Rue de Bernay 27230 Thiberville,27629_0065_00018,G,18 RUE DE BERNAY,
311122345,00011,31112234500011,O,,,,,,true,1,,,,,SANS DOMICILE FIXE,27230,THIBERVILLE,,,27629,,,,,,,,,,,,,,,,,,,1984-12-25,F,,,,,86.06,NAP,N,,,0,,,,,,
311165625,00014,31116562500014,O,,,,,,true,1,,10,,RUE,DE LISIEUX,27230,THIBERVILLE,,,27629,,,,,,,,,,,,,,,,,,,1984-12-25,F,,,,,67.04,NAP,N,0.456415,49.137528,0.96,housenumber,10 Rue de Lisieux 27230 Thiberville,27629_0085_00010,G,10 RUE DE LISIEUX,
311405914,00012,31140591400012,O,,NN,,,,true,1,,,,,RTE NATIONALE 13,27230,THIBERVILLE,,,27629,,,,,,,,,,,,,,,,,,,,F,,,,,64.49,NAP,N,0.448518,49.139642,0.31,street,Chemin de la Station 27230 Thiberville,27629_0140,G,CHEMIN DE LA STATION,
311608608,00015,31160860800015,O,,NN,,,,true,1,,,,,LA VALLEE,27230,THIBERVILLE,,,27629,,,,,,,,,,,,,,,,,,,,F,,,,,55.71,NAP,N,0.451811,49.126368,0.95,street,La Vallée 27230 Thiberville,27629_6t8fvv,G,LA VALLEE,
311984629,00015,31198462900015,O,1978-01-01,NN,,,,true,1,,10,,RUE,DE LIEUREY,27230,THIBERVILLE,,,27629,,,,,,,,,,,,,,,,,,,2000-09-30,F,,,,,55.1A,NAF1993,O,0.456211,49.138601,0.96,housenumber,10 Rue de Lieurey 27230 Thiberville,27629_0080_00010,G,10 RUE DE LIEUREY,
312041809,00129,31204180900129,O,1997-01-27,NN,,,2006-12-15T00:17:35,false,4,,14,,RUE,DE BERNAY,27230,THIBERVILLE,,,27629,,,,,,,,,,,,,,,,,,,2002-03-31,F,,,,,52.1B,NAF1993,N,0.455277,49.137637,0.96,housenumber,14 Rue de Bernay 27230 Thiberville,27629_0065_00014,G,14 RUE DE BERNAY,
312210123,00013,31221012300013,O,1900-01-01,NN,,,2017-12-01T08:26:05,false,1,,14,,RUE,DE LISIEUX,27230,THIBERVILLE,,,27629,,,,,,,,,,,,,,,,,,,1900-01-01,F,,,,,82.06,NAP,,0.456326,49.137565,0.96,housenumber,14 Rue de Lisieux 27230 Thiberville,27629_0085_00014,G,14 RUE DE LISIEUX,
312321045,00014,31232104500014,O,,NN,,,,true,1,,8,,RTE,D'ORBEC,27230,THIBERVILLE,,,27629,,,,,,,,,,,,,,,,,,,,F,,,,,64.11,NAP,N,0.453832,49.135644,0.82,housenumber,8 Route d’Orbec 27230 Thiberville,27629_0050_00008,G,8 ROUTE D ORBEC,
312812647,00013,31281264700013,O,1978-01-01,NN,,,2008-11-07T00:27:59,true,3,,40,,RTE,D ORBEC,27230,THIBERVILLE,,,27629,,,,,,,,,,,,,,,,,,,2005-01-31,F,,,,,52.4W,NAFRev1,N,0.452512,49.134953,0.77,interpolation,40 Rue d’Orbec 27230 Thiberville,,G,38 RUE D ORBEC,
313137580,00020,31313758000020,O,1984-02-17,NN,,,,false,4,,14,,RUE,PAUL LABBE,27230,THIBERVILLE,,,27629,,,,,,,,,,,,,,,,,,,2002-11-18,F,,,,,85.1G,NAF1993,N,0.455006,49.138436,0.95,housenumber,14 Rue Paul Labbe 27230 Thiberville,27629_0105_00014,G,14 RUE PAUL LABBE,
313137580,00038,31313758000038,O,2002-11-18,NN,,,2009-04-14T09:38:03,false,4,,,,RUE,DE LA MAIRIE,27230,THIBERVILLE,,,27629,,,,,,,,,,,,,,,,,,,2008-09-30,F,,,,,86.90D,NAFRev2,N,0.456322,49.13801,0.95,street,Rue de la Mairie 27230 Thiberville,27629_0088,G,RUE DE LA MAIRIE,
313707226,00020,31370722600020,O,,NN,,,,true,1,,,,RUE,DE LISIEUX,27230,THIBERVILLE,,,27629,,,,,,,,,,,,,,,,,,,1992-12-21,F,,,,,52.6E,NAF1993,N,0.453419,49.138751,0.96,street,Rue de Lisieux 27230 Thiberville,27629_0085,G,RUE DE LISIEUX,
314060088,00015,31406008800015,O,1964-01-01,NN,,,2008-11-07T00:29:18,true,3,,,,RUE,DE LISIEUX,27230,THIBERVILLE,,,27629,,,,,,,,,,,,,,,,,,,2005-12-24,F,,,,,15.8C,NAFRev1,N,0.453419,49.138751,0.96,street,Rue de Lisieux 27230 Thiberville,27629_0085,G,RUE DE LISIEUX,
314119538,00671,31411953800671,O,2001-09-01,NN,,,2010-03-15T20:10:51,false,4,,24,,RTE,D'ORBEC,27230,THIBERVILLE,,,27629,,,,,,,,,,,,,,,,,,,2009-12-31,F,,,,,69.20Z,NAFRev2,N,0.454081,49.137344,0.77,housenumber,24 Rue d’Orbec 27230 Thiberville,27629_0060_00024,G,24 RUE D ORBEC,