siren,nic,siret,statutDiffusionEtablissement,dateCreationEtablissement,trancheEffectifsEtablissement,anneeEffectifsEtablissement,activitePrincipaleRegistreMetiersEtablissement,dateDernierTraitementEtablissement,etablissementSiege,nombrePeriodesEtablissement,complementAdresseEtablissement,numeroVoieEtablissement,indiceRepetitionEtablissement,typeVoieEtablissement,libelleVoieEtablissement,codePostalEtablissement,libelleCommuneEtablissement,libelleCommuneEtrangerEtablissement,distributionSpecialeEtablissement,codeCommuneEtablissement,codeCedexEtablissement,libelleCedexEtablissement,codePaysEtrangerEtablissement,libellePaysEtrangerEtablissement,complementAdresse2Etablissement,numeroVoie2Etablissement,indiceRepetition2Etablissement,typeVoie2Etablissement,libelleVoie2Etablissement,codePostal2Etablissement,libelleCommune2Etablissement,libelleCommuneEtranger2Etablissement,distributionSpeciale2Etablissement,codeCommune2Etablissement,codeCedex2Etablissement,libelleCedex2Etablissement,codePaysEtranger2Etablissement,libellePaysEtranger2Etablissement,dateDebut,etatAdministratifEtablissement,enseigne1Etablissement,enseigne2Etablissement,enseigne3Etablissement,denominationUsuelleEtablissement,activitePrincipaleEtablissement,nomenclatureActivitePrincipaleEtablissement,caractereEmployeurEtablissement,longitude,latitude,geo_score,geo_type,geo_adresse,geo_id,geo_ligne,geo_l4,geo_l5
174102111,00146,17410211100146,O,1983-03-23,NN,,,2019-11-14T14:00:37,false,4,,,,RUE,NATIONALE,41500,SAINT-DYE-SUR-LOIRE,,,41207,,,,,,,,,,,,,,,,,,,1995-01-01,F,PERCEPT SAINT-DYE-SUR-LOIRE,,,,75.1A,NAF1993,N,1.488487,47.655646,0.96,street,Rue Nationale 41500 Saint-Dyé-sur-Loire,41207_0086,G,RUE NATIONALE,
214102071,00013,21410207100013,O,1983-03-01,11,2020,,2022-08-29T09:07:12,true,4,,75,,RTE,NATIONALE,41500,SAINT-DYE-SUR-LOIRE,,,41207,,,,,,,,,,,,,,,,,,,2008-01-01,A,MAIRIE,,,,84.11Z,NAFRev2,O,1.487248,47.655364,0.8,housenumber,75 Rue Nationale 41500 Saint-Dyé-sur-Loire,41207_0086_00075,G,75 RUE NATIONALE,
214102071,00021,21410207100021,O,1983-12-21,02,2020,,2022-08-29T09:07:12,false,3,,19,,CHE,DU FLANC,41500,SAINT-DYE-SUR-LOIRE,,,41207,,,,,,,,,,,,,,,,,,,2008-01-01,A,ECOLE PRIMAIRE PUBLIQUE LA GABARE,,,,85.20Z,NAFRev2,N,1.487238,47.654287,0.83,housenumber,19 Chemin du Flanc 41500 Saint-Dyé-sur-Loire,41207_0055_00019,G,19 CHEMIN DU FLANC,
214102071,00039,21410207100039,O,1997-01-08,NN,,,2019-11-14T14:00:37,false,3,,75,,RTE,NATIONALE,41500,SAINT-DYE-SUR-LOIRE,,,41207,,,,,,,,,,,,,,,,,,,2008-01-01,A,SERVICE ASSAINISSEMENT,,,,37.00Z,NAFRev2,N,1.487248,47.655364,0.8,housenumber,75 Rue Nationale 41500 Saint-Dyé-sur-Loire,41207_0086_00075,G,75 RUE NATIONALE,
214102071,00047,21410207100047,O,2001-01-01,NN,,,2019-11-14T14:00:37,false,3,MAIRIE,75,,RTE,NATIONALE,41500,SAINT-DYE-SUR-LOIRE,,,41207,,,,,,,,,,,,,,,,,,,2008-01-01,A,LOCATION LOCAL COMMERCIAL,,,,68.20B,NAFRev2,N,1.487248,47.655364,0.8,housenumber,75 Rue Nationale 41500 Saint-Dyé-sur-Loire,41207_0086_00075,G,75 RUE NATIONALE,
214102071,00054,21410207100054,O,2004-06-29,NN,,,2019-11-14T14:00:37,false,4,MAIRIE,75,,RTE,NATIONALE,41500,SAINT-DYE-SUR-LOIRE,,,41207,,,,,,,,,,,,,,,,,,,2009-12-24,F,BA LOTISSEMENT DES GREVES,,,,42.99Z,NAFRev2,N,1.487248,47.655364,0.8,housenumber,75 Rue Nationale 41500 Saint-Dyé-sur-Loire,41207_0086_00075,G,75 RUE NATIONALE,
254100852,00014,25410085200014,O,1983-03-01,01,2020,,2022-08-29T09:10:01,true,3,MAIRIE,75,,RTE,NATIONALE,41500,SAINT-DYE-SUR-LOIRE,,,41207,,,,,,,,,,,,,,,,,,,2008-01-01,A,,,,,36.00Z,NAFRev2,N,1.487248,47.655364,0.8,housenumber,75 Rue Nationale 41500 Saint-Dyé-sur-Loire,41207_0086_00075,G,75 RUE NATIONALE,
254102304,00014,25410230400014,O,1985-06-17,NN,,,2019-11-14T14:00:37,true,5,MAIRIE,75,,RTE,NATIONALE,41500,SAINT-DYE-SUR-LOIRE,,,41207,,,,,,,,,,,,,,,,,,,2018-06-22,F,,,,,84.12Z,NAFRev2,O,1.487248,47.655364,0.8,housenumber,75 Rue Nationale 41500 Saint-Dyé-sur-Loire,41207_0086_00075,G,75 RUE NATIONALE,
264100447,00012,26410044700012,O,1983-09-14,NN,,,2019-11-14T14:00:37,true,4,MAIRIE,,,,,41500,SAINT-DYE-SUR-LOIRE,,,41207,,,,,,,,,,,,,,,,,,,2017-01-01,F,CCAS,,,,88.99B,NAFRev2,N,1.490839,47.655811,0.39,street,Rue du Mail 41500 Saint-Dyé-sur-Loire,41207_0073,D,RUE DU MAIL,
264100512,00013,26410051200013,O,,,,,2019-11-14T14:00:37,true,1,,,,,,41500,SAINT-DYE-SUR-LOIRE,,,41207,,,,,,,,,,,,,,,,,,,,F,,,,,95.11,NAP,N,,,0,,,,,,
301703765,00018,30170376500018,O,,,,,2019-11-14T14:00:37,true,1,,1,,RUE,DE CHAMBORD,41500,SAINT-DYE-SUR-LOIRE,,,41207,,,,,,,,,,,,,,,,,,,1993-07-31,F,,,,,52.1B,NAF1993,N,1.489115,47.655561,0.95,housenumber,1 Rue de Chambord 41500 Saint-Dyé-sur-Loire,41207_0033_00001,G,1 RUE DE CHAMBORD,
302547971,00010,30254797100010,O,,NN,,,2019-11-14T14:00:37,true,1,,1,,RUE,DE CHAMBORD,41500,SAINT-DYE-SUR-LOIRE,,,41207,,,,,,,,,,,,,,,,,,,,F,,,,,62.11,NAP,N,1.489115,47.655561,0.95,housenumber,1 Rue de Chambord 41500 Saint-Dyé-sur-Loire,41207_0033_00001,G,1 RUE DE CHAMBORD,
303823082,00019,30382308200019,O,,,,,2019-11-14T14:00:37,true,1,,7,,RUE,MONTAGNE,41500,SAINT-DYE-SUR-LOIRE,,,41207,,,,,,,,,,,,,,,,,,,1985-12-25,F,,,,,00.10,NAP,N,1.485287,47.655659,0.95,housenumber,7 Rue Montagne 41500 Saint-Dyé-sur-Loire,41207_0075_00007,G,7 RUE MONTAGNE,
304359755,00028,30435975500028,O,1997-08-14,NN,,,2019-11-14T14:00:37,true,3,,,,CHE,DU CREUX DE L'ECUELLE,41500,SAINT-DYE-SUR-LOIRE,,,41207,,,,,,,,,,,,,,,,,,,2005-08-31,F,,,,,74.1J,NAFRev1,N,1.477964,47.653613,0.87,street,Chemin du Creux de l’Ecuelle 41500 Saint-Dyé-sur-Loire,41207_0039,G,CHEMIN DU CREUX DE L ECUELLE,
304832975,00037,30483297500037,O,1996-01-01,NN,,9602AB,2019-11-14T14:00:37,true,4,,10,,RTE,DE BLOIS,41500,SAINT-DYE-SUR-LOIRE,,,41207,,,,,,,,,,,,,,,,,,,2013-12-31,F,,,,,96.02A,NAFRev2,N,1.479028,47.654211,0.83,housenumber,10 Route de Blois 41500 Saint-Dyé-sur-Loire,41207_0019_00010,G,10 ROUTE DE BLOIS,
310331798,00010,31033179800010,O,1900-01-01,NN,,,2022-10-11T03:42:24,true,5,,11,,RUE,DE CHAMBORD,41500,SAINT-DYE-SUR-LOIRE,,,41207,,,,,,,,,,,,,,,,,,,2022-04-01,F,,,,,01.19Z,NAFRev2,N,1.489317,47.655024,0.95,housenumber,11 Rue de Chambord 41500 Saint-Dyé-sur-Loire,41207_0033_00011,G,11 RUE DE CHAMBORD,
310583513,00067,31058351300067,O,2012-05-01,,,,2019-11-14T14:00:37,false,1,,35,,QUAI,DE LA LOIRE,41500,SAINT-DYE-SUR-LOIRE,,,41207,,,,,,,,,,,,,,,,,,,2012-05-01,F,,,,,86.90F,NAFRev2,N,1.489967,47.657507,0.95,housenumber,35 Quai de la Loire 41500 Saint-Dyé-sur-Loire,41207_0070_00035,G,35 QUAI DE LA LOIRE,
311433726,00065,31143372600065,P,1994-12-10,,,,2019-11-14T14:00:37,false,3,[ND],[ND],[ND],[ND],[ND],[ND],SAINT-DYE-SUR-LOIRE,,[ND],41207,[ND],[ND],,,[ND],[ND],[ND],[ND],[ND],[ND],,,[ND],,[ND],[ND],,,1997-06-10,F,[ND],[ND],[ND],[ND],74.2A,NAF1993,N,,,0,,,,,,
311433726,00073,31143372600073,P,1997-06-10,NN,,,2019-11-14T14:00:37,false,4,[ND],[ND],[ND],[ND],[ND],[ND],SAINT-DYE-SUR-LOIRE,,[ND],41207,[ND],[ND],,,[ND],[ND],[ND],[ND],[ND],[ND],,,[ND],,[ND],[ND],,,2008-12-31,F,[ND],[ND],[ND],[ND],71.11Z,NAFRev2,N,,,0,,,,,,
311516496,00032,31151649600032,O,,,,,2019-11-14T14:00:37,true,1,,48,,RUE,DES PIECEROTS,41500,SAINT-DYE-SUR-LOIRE,,,41207,,,,,,,,,,,,,,,,,,,1993-10-01,F,,,,,45.3A,NAF1993,N,1.504586,47.660953,0.95,housenumber,48 Rue des Piécerots 41500 Saint-Dyé-sur-Loire,41207_0093_00048,G,48 RUE DES PIECEROTS,
313456956,00017,31345695600017,O,,NN,,,2019-11-14T14:00:37,true,1,,44,,RUE,NATIONALE,41500,SAINT-DYE-SUR-LOIRE,,,41207,,,,,,,,,,,,,,,,,,,1995-03-31,F,,,,,52.2C,NAF1993,O,1.488936,47.655968,0.96,housenumber,44 Rue Nationale 41500 Saint-Dyé-sur-Loire,41207_0086_00044,G,44 RUE NATIONALE,
313712820,00056,31371282000056,O,1995-08-31,NN,,,2019-11-14T14:00:37,true,1,,87,,RUE,NATIONALE,41500,SAINT-DYE-SUR-LOIRE,,,41207,,,,,,,,,,,,,,,,,,,1998-03-25,F,,,,,55.4A,NAF1993,O,1.486218,47.655079,0.96,housenumber,87 Rue Nationale 41500 Saint-Dyé-sur-Loire,41207_0086_00087,G,87 RUE NATIONALE,
313831364,00010,31383136400010,O,,NN,,,2019-11-14T14:00:37,true,1,,73,,RUE,NATIONALE,41500,SAINT-DYE-SUR-LOIRE,,,41207,,,,,,,,,,,,,,,,,,,,F,,,,,49.05,NAP,N,1.487432,47.655431,0.96,housenumber,73 Rue Nationale 41500 Saint-Dyé-sur-Loire,41207_0086_00073,G,73 RUE NATIONALE,
314333659,00014,31433365900014,O,1978-01-01,NN,,,2019-11-14T14:00:37,true,7,,6,,RUE,DU TRAMWAY,41500,SAINT-DYE-SUR-LOIRE,,,41207,,,,,,,,,,,,,,,,,,,2016-10-13,F,,,,,95.29Z,NAFRev2,N,1.490504,47.651651,0.94,housenumber,6 Rue du Tramway 41500 Saint-Dyé-sur-Loire,41207_ym1642_00006,G,6 RUE DU TRAMWAY,
314378209,00022,31437820900022,O,1900-01-01,NN,,,2019-11-14T14:00:37,true,9,,3,,RUE,DU MAIL,41500,SAINT-DYE-SUR-LOIRE,,,41207,,,,,,,,,,,,,,,,,,,2013-05-30,F,,,,,86.90E,NAFRev2,O,1.490984,47.655768,0.95,housenumber,3 Rue du Mail 41500 Saint-Dyé-sur-Loire,41207_0073_00003,G,3 RUE DU MAIL,
314577354,00033,31457735400033,O,1900-01-01,NN,,,2019-11-14T14:00:37,false,3,,5,,CHE,DES CASSEURS,41500,SAINT-DYE-SUR-LOIRE,,,41207,,,,,,,,,,,,,,,,,,,1995-09-28,F,,,,,51.1T,NAF1993,N,1.493391,47.649771,0.7,housenumber,5 Chemin des Casseux 41500 Saint-Dyé-sur-Loire,41207_0031_00005,G,5 CHEMIN DES CASSEUX,
314995036,00022,31499503600022,O,,NN,,,2019-11-14T14:00:37,true,1,,22,,RUE,DE CHAMBORD,41500,SAINT-DYE-SUR-LOIRE,,,41207,,,,,,,,,,,,,,,,,,,1996-02-13,F,,,,,26.6L,NAF1993,N,1.489679,47.654499,0.95,housenumber,22 Rue de Chambord 41500 Saint-Dyé-sur-Loire,41207_0033_00022,G,22 RUE DE CHAMBORD,
316422518,00019,31642251800019,O,,,,,2019-11-14T14:00:37,true,1,,7,,RUE,SAINT SAUVEUR,41500,SAINT-DYE-SUR-LOIRE,,,41207,,,,,,,,,,,,,,,,,,,1984-12-25,F,,,,,84.10,NAP,N,1.486361,47.656087,0.94,housenumber,7 Rue Saint Sauveur 41500 Saint-Dyé-sur-Loire,41207_0120_00007,G,7 RUE SAINT SAUVEUR,
317494169,00012,31749416900012,O,1979-01-01,NN,,,2019-11-14T14:00:37,true,4,,3,,RUE,DES PIECEROTS,41500,SAINT-DYE-SUR-LOIRE,,,41207,,,,,,,,,,,,,,,,,,,2002-01-03,F,,,,,70.2C,NAF1993,N,1.498168,47.659492,0.95,housenumber,3 Rue des Piécerots 41500 Saint-Dyé-sur-Loire,41207_0093_00003,G,3 RUE DES PIECEROTS,
317828580,00017,31782858000017,O,,,,,2019-11-14T14:00:37,true,1,,107,,RUE,NATIONALE,41500,SAINT-DYE-SUR-LOIRE,,,41207,,,,,,,,,,,,,,,,,,,1984-12-25,F,,,,,65.06,NAP,N,1.485044,47.654526,0.96,housenumber,107 Rue Nationale 41500 Saint-Dyé-sur-Loire,41207_0086_00107,G,107 RUE NATIONALE,
317996627,00012,31799662700012,O,,NN,,,2019-11-14T14:00:37,true,1,,5,,RTE,DE CHAMBORD,41500,SAINT-DYE-SUR-LOIRE,,,41207,,,,,,,,,,,,,,,,,,,1984-12-11,F,,,,,70.2A,NAF1993,N,1.49201,47.651543,0.85,housenumber,5 Route de Chambord 41500 Saint-Dyé-sur-Loire,41207_0032_00005,G,5 ROUTE DE CHAMBORD,
318231891,00017,31823189100017,O,1980-01-01,NN,,,2019-11-14T14:00:37,true,1,,4,,RUE,DU CANADA,41500,SAINT-DYE-SUR-LOIRE,,,41207,,,,,,,,,,,,,,,,,,,2001-10-02,F,,,,,36.1G,NAF1993,O,1.48664,47.655642,0.95,housenumber,4 Rue du Canada 41500 Saint-Dyé-sur-Loire,41207_0025_00004,G,4 RUE DU CANADA,
319961587,00015,31996158700015,O,1980-09-25,NN,,,2019-11-14T14:00:37,false,4,,3,,RUE,SAINT SAUVEUR,41500,SAINT-DYE-SUR-LOIRE,,,41207,,,,,,,,,,,,,,,,,,,1999-05-10,F,,,,,02.0B,NAF1993,N,1.486682,47.656161,0.94,housenumber,3 Rue Saint Sauveur 41500 Saint-Dyé-sur-Loire,41207_0120_00003,G,3 RUE SAINT SAUVEUR,
320101488,00015,32010148800015,O,,,,,2019-11-14T14:00:37,true,1,,35,,RUE,DE CHAMBORD,41500,SAINT-DYE-SUR-LOIRE,,,41207,,,,,,,,,,,,,,,,,,,1984-12-25,F,,,,,77.03,NAP,N,1.491922,47.652786,0.95,housenumber,35 Rue de Chambord 41500 Saint-Dyé-sur-Loire,41207_0033_00035,G,35 RUE DE CHAMBORD,
320940562,00061,32094056200061,O,2007-08-15,NN,,,2019-11-14T14:00:37,false,3,,6,,CHE,DE LA PONTONNIERE,41500,SAINT-DYE-SUR-LOIRE,,,41207,,,,,,,,,,,,,,,,,,,2010-04-20,F,,,,,46.18Z,NAFRev2,O,1.47921,47.65296,0.87,housenumber,6 Chemin de la Pontonniere 41500 Saint-Dyé-sur-Loire,41207_0094_00006,G,6 CHEMIN DE LA PONTONNIERE,
323091843,00017,32309184300017,O,,NN,,,2019-11-14T14:00:37,true,1,,5,,RUE,DU MAIL,41500,SAINT-DYE-SUR-LOIRE,,,41207,,,,,,,,,,,,,,,,,,,1991-06-02,F,,,,,86.07,NAP,N,1.491079,47.655629,0.95,housenumber,5 Rue du Mail 41500 Saint-Dyé-sur-Loire,41207_0073_00005,G,5 RUE DU MAIL,
323341958,00011,32334195800011,O,,NN,,,2019-11-14T14:00:37,true,1,,89,,RUE,NATIONALE,41500,SAINT-DYE-SUR-LOIRE,,,41207,,,,,,,,,,,,,,,,,,,2002-02-17,F,,,,,02.20,NAP,N,1.486121,47.65505,0.96,housenumber,89 Rue Nationale 41500 Saint-Dyé-sur-Loire,41207_0086_00089,G,89 RUE NATIONALE,
324088806,00033,32408880600033,O,2001-01-01,NN,,,2019-11-14T14:00:37,true,3,,115,,RUE,NATIONALE,41500,SAINT-DYE-SUR-LOIRE,,,41207,,,,,,,,,,,,,,,,,,,2008-01-01,A,,,,,68.20B,NAFRev2,N,1.483453,47.652925,0.96,housenumber,115 Rue Nationale 41500 Saint-Dyé-sur-Loire,41207_0086_00115,G,115 RUE NATIONALE,
324666601,00020,32466660100020,O,1988-02-02,NN,,,2019-11-14T14:00:37,true,3,,52,,RUE,NATIONALE,41500,SAINT-DYE-SUR-LOIRE,,,41207,,,,,,,,,,,,,,,,,,,2008-01-01,A,,,,,56.10A,NAFRev2,N,1.488243,47.655835,0.96,housenumber,52 Rue Nationale 41500 Saint-Dyé-sur-Loire,41207_0086_00052,G,52 RUE NATIONALE,
325018877,00010,32501887700010,O,,NN,,,2019-11-14T14:00:37,true,1,,4,,RTE,DE L ECUELLE,41500,SAINT-DYE-SUR-LOIRE,,,41207,,,,,,,,,,,,,,,,,,,1989-12-26,F,,,,,01.10,NAP,N,1.479667,47.653107,0.85,housenumber,4 Route de l’Ecuelle 41500 Saint-Dyé-sur-Loire,41207_0043_00004,G,4 ROUTE DE L ECUELLE,
325627719,00017,32562771900017,O,,NN,,,2019-11-14T14:00:37,true,1,,24,,RTE,DE CHAMBORD,41500,SAINT-DYE-SUR-LOIRE,,,41207,,,,,,,,,,,,,,,,,,,,F,,,,,87.07,NAP,N,1.494457,47.647489,0.86,housenumber,24 Route de Chambord 41500 Saint-Dyé-sur-Loire,41207_0032_00024,G,24 ROUTE DE CHAMBORD,
326814464,00011,32681446400011,O,,NN,,,2019-11-14T14:00:37,true,1,,58,,RUE,NATIONALE,41500,SAINT-DYE-SUR-LOIRE,,,41207,,,,,,,,,,,,,,,,,,,1990-10-31,F,,,,,81.21,NAP,N,1.487635,47.655627,0.96,housenumber,58 Rue Nationale 41500 Saint-Dyé-sur-Loire,41207_0086_00058,G,58 RUE NATIONALE,
327905725,00021,32790572500021,O,1989-11-01,NN,,,2019-11-14T14:00:37,true,1,,6,,RTE,D ORLEANS,41500,SAINT-DYE-SUR-LOIRE,,,41207,,,,,,,,,,,,,,,,,,,2001-12-31,F,,,,,50.1Z,NAF1993,O,1.495955,47.657481,0.84,housenumber,6 Route d’Orléans 41500 Saint-Dyé-sur-Loire,41207_0088_00006,G,6 ROUTE D ORLEANS,
327922571,00010,32792257100010,O,1983-06-01,NN,,,2019-11-14T14:00:37,true,3,,40,,RUE,NATIONALE,41500,SAINT-DYE-SUR-LOIRE,,,41207,,,,,,,,,,,,,,,,,,,2003-06-30,F,,,,,70.2C,NAFRev1,N,1.489073,47.65612,0.96,housenumber,40 Rue Nationale 41500 Saint-Dyé-sur-Loire,41207_0086_00040,G,40 RUE NATIONALE,
328184288,00020,32818428800020,O,,NN,,,2019-11-14T14:00:37,true,1,,39,,RUE,NATIONALE,41500,SAINT-DYE-SUR-LOIRE,,,41207,,,,,,,,,,,,,,,,,,,1990-09-30,F,,,,,84.12,NAP,N,1.490352,47.655998,0.96,housenumber,39 Rue Nationale 41500 Saint-Dyé-sur-Loire,41207_0086_00039,G,39 RUE NATIONALE,
328587134,00011,32858713400011,O,1983-10-25,NN,,,2019-11-14T14:00:37,true,6,,61,,RUE,NATIONALE,41500,SAINT-DYE-SUR-LOIRE,,,41207,,,,,,,,,,,,,,,,,,,2010-11-30,F,,,,,96.02A,NAFRev2,N,1.488329,47.655773,0.96,housenumber,61 Rue Nationale 41500 Saint-Dyé-sur-Loire,41207_0086_00061,G,61 RUE NATIONALE,
329308563,00017,32930856300017,O,,NN,,,2019-11-14T14:00:37,true,1,,60,,RUE,NATIONALE,41500,SAINT-DYE-SUR-LOIRE,,,41207,,,,,,,,,,,,,,,,,,,,F,,,,,64.47,NAP,N,1.487532,47.655581,0.96,housenumber,60 Rue Nationale 41500 Saint-Dyé-sur-Loire,41207_0086_00060,G,60 RUE NATIONALE,
329616023,00027,32961602300027,O,2013-01-10,,,,2019-11-14T14:00:37,true,2,,16,B,RTE,NATIONALE,41500,SAINT-DYE-SUR-LOIRE,,,41207,,,,,,,,,,,,,,,,,,,2018-07-31,F,,,,,59.20Z,NAFRev2,N,1.491401,47.656374,0.71,housenumber,16bis Rue Nationale 41500 Saint-Dyé-sur-Loire,41207_0086_00016_bis,G,16BIS RUE NATIONALE,
330621020,00024,33062102000024,O,1993-10-06,NN,,,2019-11-14T14:00:37,true,3,,14,,RTE,,41500,SAINT-DYE-SUR-LOIRE,,,41207,,,,,,,,,,,,,,,,,,,1995-12-25,F,,,,,45.2V,NAF1993,O,1.493674,47.648666,0.66,housenumber,14 Route de Chambord 41500 Saint-Dyé-sur-Loire,41207_0032_00014,G,14 ROUTE DE CHAMBORD,
331609057,00046,33160905700046,O,1999-09-07,,,,2019-11-14T14:00:37,false,3,,,,CHE,DU FLANC,41500,SAINT-DYE-SUR-LOIRE,,,41207,,,,,,,,,,,,,,,,,,,2000-06-18,F,,,,,51.1R,NAF1993,N,1.487408,47.654374,0.81,street,Chemin du Flanc 41500 Saint-Dyé-sur-Loire,41207_0055,G,CHEMIN DU FLANC,
331609057,00053,33160905700053,O,2000-06-18,NN,,,2019-11-14T14:00:37,false,4,,3,B,RTE,NATIONALE,41500,SAINT-DYE-SUR-LOIRE,,,41207,,,,,,,,,,,,,,,,,,,2003-12-25,F,,,,,51.1R,NAFRev1,N,1.494523,47.657028,0.69,housenumber,3bis Rue Nationale 41500 Saint-Dyé-sur-Loire,41207_0086_00003_bis,G,3BIS RUE NATIONALE,
331631473,00013,33163147300013,O,,,,,2019-11-14T14:00:37,true,1,,14,,RTE,D ORLEANS,41500,SAINT-DYE-SUR-LOIRE,,,41207,,,,,,,,,,,,,,,,,,,1992-03-20,F,,,,,45.2V,NAF1993,N,1.499131,47.658306,0.84,housenumber,14 Route d’Orléans 41500 Saint-Dyé-sur-Loire,41207_0088_00014,G,14 ROUTE D ORLEANS,
331654756,00021,33165475600021,O,1987-06-01,NN,,,2019-11-14T14:00:37,true,3,,,,RTE,NATIONALE,41500,SAINT-DYE-SUR-LOIRE,,,41207,,,,,,,,,,,,,,,,,,,2008-01-01,A,,,,,46.18Z,NAFRev2,N,1.490071,47.655932,0.81,street,Route Nationale 41500 Saint-Dyé-sur-Loire,41207_0085,G,ROUTE NATIONALE,
331835413,00021,33183541300021,O,,NN,,,2019-11-14T14:00:37,true,1,,,,,COMMUNE DE RATTACHEMENT,41500,SAINT-DYE-SUR-LOIRE,,,41207,,,,,,,,,,,,,,,,,,,,F,,,,,64.49,NAP,N,,,0,,,,,,
332474725,00014,33247472500014,O,1985-04-29,NN,,,2019-11-14T14:00:37,true,3,,6,,RUE,PORTE OISEAU,41500,SAINT-DYE-SUR-LOIRE,,,41207,,,,,,,,,,,,,,,,,,,2008-01-01,A,,,,,46.18Z,NAFRev2,N,1.488531,47.656285,0.95,housenumber,6 Rue Porte Oiseau 41500 Saint-Dyé-sur-Loire,41207_0095_00006,G,6 RUE PORTE OISEAU,
332994839,00014,33299483900014,O,,NN,,,2019-11-14T14:00:37,true,1,,1,,RUE,DE L EGLISE,41500,SAINT-DYE-SUR-LOIRE,,,41207,,,,,,,,,,,,,,,,,,,1991-06-01,F,,,,,77.12,NAP,N,1.48763,47.656035,0.95,housenumber,1 Rue de l’Eglise 41500 Saint-Dyé-sur-Loire,41207_0050_00001,G,1 RUE DE L EGLISE,
335231007,00014,33523100700014,O,,,,,2019-11-14T14:00:37,true,1,,16,,RTE,DE CHAMBORD,41500,SAINT-DYE-SUR-LOIRE,,,41207,,,,,,,,,,,,,,,,,,,1989-12-31,F,,,,,81.21,NAP,N,1.493781,47.648475,0.86,housenumber,16 Route de Chambord 41500 Saint-Dyé-sur-Loire,41207_0032_00016,G,16 ROUTE DE CHAMBORD,
337517080,00012,33751708000012,O,1985-01-01,NN,,,2019-11-14T14:00:37,false,3,,5,,RTE,DE CHAMBORD,41500,SAINT-DYE-SUR-LOIRE,,,41207,,,,,,,,,,,,,,,,,,,1993-01-01,F,,,,,70.2A,NAF1993,N,1.49201,47.651543,0.85,housenumber,5 Route de Chambord 41500 Saint-Dyé-sur-Loire,41207_0032_00005,G,5 ROUTE DE CHAMBORD,
338537764,00064,33853776400064,O,2009-06-04,,,,2019-11-14T14:00:37,false,2,,24,,RUE,NATIONALE,41500,SAINT-DYE-SUR-LOIRE,,,41207,,,,,,,,,,,,,,,,,,,2009-10-28,F,,,,,86.90E,NAFRev2,N,1.490552,47.656136,0.96,housenumber,24 Rue Nationale 41500 Saint-Dyé-sur-Loire,41207_0086_00024,G,24 RUE NATIONALE,
338895626,00012,33889562600012,O,,NN,,,2019-11-14T14:00:37,true,1,,3,,RUE,DU 8 MAI,41500,SAINT-DYE-SUR-LOIRE,,,41207,,,,,,,,,,,,,,,,,,,1987-12-31,F,,,,,87.07,NAP,N,1.498329,47.658792,0.94,housenumber,3 Rue du 8 Mai 41500 Saint-Dyé-sur-Loire,41207_0062_00003,G,3 RUE DU 8 MAI,
339440737,00049,33944073700049,O,2010-01-01,,,,2023-01-08T03:32:01,false,2,CLOS DES TOURELLES,,,RUE,DU MAIL,41500,SAINT-DYE-SUR-LOIRE,,,41207,,,,,,,,,,,,,,,,,,,2022-09-13,F,,,,,68.20A,NAFRev2,N,1.490839,47.655811,0.95,street,Rue du Mail 41500 Saint-Dyé-sur-Loire,41207_0073,G,RUE DU MAIL,
341938991,00013,34193899100013,O,1987-07-28,NN,,,2019-11-14T14:00:37,true,3,,5,,RUE,PORTE OISEAU,41500,SAINT-DYE-SUR-LOIRE,,,41207,,,,,,,,,,,,,,,,,,,2008-01-01,A,,,,,68.20B,NAFRev2,N,1.488644,47.656879,0.95,housenumber,5 Rue Porte Oiseau 41500 Saint-Dyé-sur-Loire,41207_0095_00005,G,5 RUE PORTE OISEAU,
342108206,00018,34210820600018,O,1987-08-01,NN,,,2019-11-14T14:00:37,false,4,,69,,RTE,NATIONALE,41500,SAINT-DYE-SUR-LOIRE,,,41207,,,,,,,,,,,,,,,,,,,2001-11-30,F,,,,,15.1F,NAF1993,N,1.487745,47.65558,0.8,housenumber,69 Rue Nationale 41500 Saint-Dyé-sur-Loire,41207_0086_00069,G,69 RUE NATIONALE,
342713005,00037,34271300500037,O,2003-04-07,NN,,,2019-11-14T14:00:37,false,4,,3,,RUE,SAINT SAUVEUR,41500,SAINT-DYE-SUR-LOIRE,,,41207,,,,,,,,,,,,,,,,,,,2011-03-31,F,,,,,68.20B,NAFRev2,N,1.486682,47.656161,0.94,housenumber,3 Rue Saint Sauveur 41500 Saint-Dyé-sur-Loire,41207_0120_00003,G,3 RUE SAINT SAUVEUR,
343524708,00017,34352470800017,O,1988-01-12,NN,,,2019-11-14T14:00:37,false,7,,39,,RTE,NATIONALE,41500,SAINT-DYE-SUR-LOIRE,,,41207,,,,,,,,,,,,,,,,,,,2012-01-11,F,,,,,68.20B,NAFRev2,N,1.490352,47.655998,0.8,housenumber,39 Rue Nationale 41500 Saint-Dyé-sur-Loire,41207_0086_00039,G,39 RUE NATIONALE,
343524708,00025,34352470800025,O,2012-01-11,,,,2019-11-14T14:00:37,true,2,,,,RUE,DU MAIL,41500,SAINT-DYE-SUR-LOIRE,,,41207,,,,,,,,,,,,,,,,,,,2013-12-31,F,,,,,87.30A,NAFRev2,N,1.490839,47.655811,0.95,street,Rue du Mail 41500 Saint-Dyé-sur-Loire,41207_0073,G,RUE DU MAIL,
343533436,00022,34353343600022,O,,NN,,,2019-11-14T14:00:37,true,1,,,,RUE,DE LA CROIX BLANCHE,41500,SAINT-DYE-SUR-LOIRE,,,41207,,,,,,,,,,,,,,,,,,,1992-12-31,F,,,,,85.1G,NAF1993,N,1.485907,47.654486,0.94,street,Rue de la Croix Blanche 41500 Saint-Dyé-sur-Loire,41207_0040,G,RUE DE LA CROIX BLANCHE,
343541405,00019,34354140500019,O,1988-01-20,NN,,,2019-11-14T14:00:37,false,4,,39,,RTE,NATIONALE,41500,SAINT-DYE-SUR-LOIRE,,,41207,,,,,,,,,,,,,,,,,,,1999-10-15,F,,,,,70.2C,NAF1993,N,1.490352,47.655998,0.8,housenumber,39 Rue Nationale 41500 Saint-Dyé-sur-Loire,41207_0086_00039,G,39 RUE NATIONALE,
344813134,00022,34481313400022,O,1995-04-04,NN,,,2019-11-14T14:00:37,true,5,,71,,RUE,NATIONALE,41500,SAINT-DYE-SUR-LOIRE,,,41207,,,,,,,,,,,,,,,,,,,2011-04-30,F,,,,,10.71C,NAFRev2,O,1.487646,47.655545,0.96,housenumber,71 Rue Nationale 41500 Saint-Dyé-sur-Loire,41207_0086_00071,G,71 RUE NATIONALE,
344937628,00016,34493762800016,O,1988-06-01,NN,,4334ZC,2019-11-14T14:00:37,true,7,,107,,RTE,NATIONALE,41500,SAINT-DYE-SUR-LOIRE,,,41207,,,,,,,,,,,,,,,,,,,2014-09-30,F,,,,,43.34Z,NAFRev2,O,1.485044,47.654526,0.81,housenumber,107 Rue Nationale 41500 Saint-Dyé-sur-Loire,41207_0086_00107,G,107 RUE NATIONALE,
348829102,00014,34882910200014,O,1988-12-02,NN,,,2019-11-14T14:00:37,false,4,,,,RUE,CROIX BLANCHE,41500,SAINT-DYE-SUR-LOIRE,,,41207,,,,,,,,,,,,,,,,,,,1996-12-25,F,,,,,85.1G,NAF1993,N,1.485907,47.654486,0.88,street,Rue de la Croix Blanche 41500 Saint-Dyé-sur-Loire,41207_0040,G,RUE DE LA CROIX BLANCHE,
348829102,00030,34882910200030,O,1996-05-31,NN,,,2019-11-14T14:00:37,false,5,,24,,RUE,NATIONALE,41500,SAINT-DYE-SUR-LOIRE,,,41207,,,,,,,,RUE,CREUSE,41500,SAINT-DYE-SUR-LOIRE,,,41207,,,,,2014-08-25,F,,,,,86.90D,NAFRev2,O,1.490552,47.656136,0.96,housenumber,24 Rue Nationale 41500 Saint-Dyé-sur-Loire,41207_0086_00024,G,24 RUE NATIONALE,
348829102,00055,34882910200055,O,2014-08-25,,,,2022-11-17T04:18:42,false,4,,20,,RUE,NATIONALE,41500,SAINT-DYE-SUR-LOIRE,,,41207,,,,,,,,,,,,,,,,,,,2022-10-01,F,,,,,86.90D,NAFRev2,N,1.491219,47.656327,0.96,housenumber,20 Rue Nationale 41500 Saint-Dyé-sur-Loire,41207_0086_00020,G,20 RUE NATIONALE,
348907767,00019,34890776700019,O,1988-12-16,NN,,,2019-11-14T14:00:37,true,3,,7,,,DE LA LOIRE,41500,SAINT-DYE-SUR-LOIRE,,,41207,,,,,,,,,,,,,,,,,,,2008-01-01,A,,,,,68.20B,NAFRev2,N,1.493144,47.658377,0.88,housenumber,7 Quai de la Loire 41500 Saint-Dyé-sur-Loire,41207_0070_00007,G,7 QUAI DE LA LOIRE,
349194969,00052,34919496900052,O,2000-05-08,NN,,,2019-11-14T14:00:37,true,4,,2,,RUE,DU 8 MAI,41500,SAINT-DYE-SUR-LOIRE,,,41207,,,,,,,,,,,,,,,,,,,2014-08-21,A,,,,,46.19B,NAFRev2,N,1.498562,47.658512,0.94,housenumber,2 Rue du 8 Mai 41500 Saint-Dyé-sur-Loire,41207_0062_00002,G,2 RUE DU 8 MAI,
349879973,00023,34987997300023,O,1991-03-01,NN,,,2019-11-14T14:00:37,true,3,,55,,RUE,NATIONALE,41500,SAINT-DYE-SUR-LOIRE,,,41207,,,,,,,,,,,,,,,,,,,2006-11-30,F,,,,,52.5Z,NAFRev1,N,1.4889,47.655822,0.96,housenumber,55 Rue Nationale 41500 Saint-Dyé-sur-Loire,41207_0086_00055,G,55 RUE NATIONALE,
353312028,00015,35331202800015,O,1990-02-01,NN,,,2019-11-14T14:00:37,true,4,,2,,RUE,DE LA CROIX BLANCHE,41500,SAINT-DYE-SUR-LOIRE,,,41207,,,,,,,,,,,,,,,,,,,1999-12-31,F,,,,,45.3E,NAF1993,O,1.48572,47.654486,0.94,housenumber,2 Rue de la Croix Blanche 41500 Saint-Dyé-sur-Loire,41207_0040_00002,G,2 RUE DE LA CROIX BLANCHE,