siren,nic,siret,statutDiffusionEtablissement,dateCreationEtablissement,trancheEffectifsEtablissement,anneeEffectifsEtablissement,activitePrincipaleRegistreMetiersEtablissement,dateDernierTraitementEtablissement,etablissementSiege,nombrePeriodesEtablissement,complementAdresseEtablissement,numeroVoieEtablissement,indiceRepetitionEtablissement,typeVoieEtablissement,libelleVoieEtablissement,codePostalEtablissement,libelleCommuneEtablissement,libelleCommuneEtrangerEtablissement,distributionSpecialeEtablissement,codeCommuneEtablissement,codeCedexEtablissement,libelleCedexEtablissement,codePaysEtrangerEtablissement,libellePaysEtrangerEtablissement,complementAdresse2Etablissement,numeroVoie2Etablissement,indiceRepetition2Etablissement,typeVoie2Etablissement,libelleVoie2Etablissement,codePostal2Etablissement,libelleCommune2Etablissement,libelleCommuneEtranger2Etablissement,distributionSpeciale2Etablissement,codeCommune2Etablissement,codeCedex2Etablissement,libelleCedex2Etablissement,codePaysEtranger2Etablissement,libellePaysEtranger2Etablissement,dateDebut,etatAdministratifEtablissement,enseigne1Etablissement,enseigne2Etablissement,enseigne3Etablissement,denominationUsuelleEtablissement,activitePrincipaleEtablissement,nomenclatureActivitePrincipaleEtablissement,caractereEmployeurEtablissement,longitude,latitude,geo_score,geo_type,geo_adresse,geo_id,geo_ligne,geo_l4,geo_l5
214203317,00018,21420331700018,O,1983-03-01,03,2020,,2022-08-29T09:07:15,true,4,,,,,LE BOURG,42155,VILLEMONTAIS,,,42331,,,,,,,,,,,,,,,,,,,2008-01-01,A,MAIRIE,,,,84.11Z,NAFRev2,O,3.944417,45.978528,0.51,street,Le Bois 42155 Villemontais,42331_l55seo,G,LE BOIS,
214203317,00026,21420331700026,O,1983-12-21,03,2020,,2022-08-29T09:07:15,false,3,,,,PL,DE LA MAIRIE,42155,VILLEMONTAIS,,,42331,,,,,,,,,,,,,,,,,,,2008-01-01,A,ECOLE PRIMAIRE PUBLIQUE,,,,85.20Z,NAFRev2,N,3.950072,45.979004,0.83,street,Place de la Mairie 42155 Villemontais,42331_0072,G,PLACE DE LA MAIRIE,
214203317,00034,21420331700034,O,1996-01-01,NN,,,2015-09-22T11:17:09,false,4,MAIRIE,,,,LE BOURG,42155,VILLEMONTAIS,,,42331,,,,,,,,,,,,,,,,,,,2013-01-01,F,SCE ASSAINISSEMENT,,,,37.00Z,NAFRev2,N,3.944417,45.978528,0.51,street,Le Bois 42155 Villemontais,42331_l55seo,G,LE BOIS,
254200892,00019,25420089200019,O,1983-03-01,NN,,,2021-10-27T08:12:12,true,4,MAIRIE,,,,LE BOURG,42155,VILLEMONTAIS,,,42331,,,,,,,,,,,,,,,,,,,2020-01-01,F,,,,,36.00Z,NAFRev2,N,3.944417,45.978528,0.51,street,Le Bois 42155 Villemontais,42331_l55seo,G,LE BOIS,
264200957,00019,26420095700019,O,1992-01-01,NN,,,2010-06-26T03:09:41,true,3,MAIRIE,,,,LE BOURG,42155,VILLEMONTAIS,,,42331,,,,,,,,,,,,,,,,,,,2008-01-01,A,CCAS,,,,88.99B,NAFRev2,N,3.944417,45.978528,0.51,street,Le Bois 42155 Villemontais,42331_l55seo,G,LE BOIS,
300506920,00010,30050692000010,O,1973-01-01,NN,,,2014-07-08T00:10:51,true,7,,,,LD,AUX VERNAYS,42155,VILLEMONTAIS,,,42331,,,,,,,,,,,,,,,,,,,2011-07-03,F,,,,,47.89Z,NAFRev2,N,3.950542,45.993711,0.33,street,Chemin de la Croix Verte 42155 Villemontais,42331_0050,G,CHEMIN DE LA CROIX VERTE,
300787801,00012,30078780100012,O,,,,,,true,1,,,,,LE BOURG,42155,VILLEMONTAIS,,,42331,,,,,,,,,,,,,,,,,,,1984-12-25,F,,,,,67.08,NAP,N,3.944417,45.978528,0.51,street,Le Bois 42155 Villemontais,42331_l55seo,G,LE BOIS,
300997681,00014,30099768100014,O,,,,,,true,1,,,,,,42155,VILLEMONTAIS,,,42331,,,,,,,,,,,,,,,,,,,,F,,,,,58.11,NAP,N,,,0,,,,,,
301601571,00013,30160157100013,O,,NN,,,,true,1,,,,,ALIMENTATION UNICO,42155,VILLEMONTAIS,,,42331,,,,,,,,,,,,,,,,,,,1994-09-30,F,,,,,52.1B,NAF1993,N,,,0,,,,,,
302128145,00018,30212814500018,O,,,,,,true,1,,,,,LE BOURG,42155,VILLEMONTAIS,,,42331,,,,,,,,,,,,,,,,,,,1985-12-25,F,,,,,24.08,NAP,N,3.944417,45.978528,0.51,street,Le Bois 42155 Villemontais,42331_l55seo,G,LE BOIS,
304208432,00019,30420843200019,O,,NN,,,,true,1,,,,,,42155,VILLEMONTAIS,,,42331,,,,,,,,,,,,,,,,,,,1991-12-31,F,,,,,55.60,NAP,N,,,0,,,,,,
304320484,00013,30432048400013,O,,,,,,true,1,,,,LD,LA POSTE,42155,VILLEMONTAIS,,,42331,,,,,,,,,,,,,,,,,,,1989-12-31,F,,,,,55.60,NAP,N,3.962132,45.983171,0.91,street,Lieu Dit la Poste 42155 Villemontais,42331_k7d461,G,LIEU DIT LA POSTE,
305227639,00021,30522763900021,O,1991-03-01,NN,,,2014-06-14T00:05:46,true,5,,,,,RIBORDET,42155,VILLEMONTAIS,,,42331,,,,,,,,,,,,,,,,,,,2012-12-31,F,,,,,43.22A,NAFRev2,O,,,0,,,,,,
306871559,00028,30687155900028,O,1983-07-04,,,,,false,3,,,,LD,LA POSTE,42155,VILLEMONTAIS,,,42331,,,,,,,,,,,,,,,,,,,1997-01-01,F,,,,,85.1G,NAF1993,N,3.962132,45.983171,0.91,street,Lieu Dit la Poste 42155 Villemontais,42331_k7d461,G,LIEU DIT LA POSTE,
307384131,00016,30738413100016,O,1900-01-01,NN,,,2021-06-26T04:01:21,false,3,,,,,BOURG ST ROCH,42155,VILLEMONTAIS,,,42331,,,,,,,,,,,,,,,,,,,2006-12-28,F,,,,,70.2C,NAFRev1,N,3.951973,45.98098,0.42,street,Rue Saint-Roch 42155 Villemontais,42331_0120,G,RUE SAINT ROCH,
309198281,00037,30919828100037,O,2005-03-01,,,,2019-06-08T03:59:33,true,3,,,,,LA CROIX DE LAUME,42155,VILLEMONTAIS,,,42331,,,,,,,,,,,,,,,,,,,2019-05-28,F,,,,,96.09Z,NAFRev2,N,3.964066,45.980086,0.93,street,Chemin de la Croix de Laume 42155 Villemontais,42331_0007,G,CHEMIN DE LA CROIX DE LAUME,
311182216,00011,31118221600011,O,1977-01-01,NN,,,,true,1,,,,,LE PIZET,42155,VILLEMONTAIS,,,42331,,,,,,,,,,,,,,,,,,,2001-08-31,F,,,,,45.2V,NAF1993,N,3.952217,45.974286,0.94,street,Le Pizet 42155 Villemontais,42331_6uushb,G,LE PIZET,
314272725,00016,31427272500016,O,,NN,,,,true,1,,,,,LE MUSSET,42155,VILLEMONTAIS,,,42331,,,,,,,,,,,,,,,,,,,,F,,,,,00.10,NAP,N,3.949055,45.97782,0.66,street,Rue du Musset 42155 Villemontais,42331_0082,G,RUE DU MUSSET,
316163294,00010,31616329400010,O,1979-01-01,NN,,,2008-11-07T00:31:42,true,3,,,,,BOIS D OREE,42155,VILLEMONTAIS,,,42331,,,,,,,,,,,,,,,,,,,2005-08-23,F,,,,,45.3E,NAFRev1,N,3.954457,45.993748,0.41,street,Chemin de Pierre à Bois 42155 Villemontais,42331_0088,G,CHEMIN DE PIERRE A BOIS,
317839124,00011,31783912400011,O,1980-01-01,NN,,,2006-10-27T00:56:51,true,3,,,,,MAYENCAT,42155,VILLEMONTAIS,,,42331,,,,,,,,,,,,,,,,,,,2005-12-22,F,,,,,70.2C,NAFRev1,N,3.950509,45.988953,0.92,street,Chemin de Mayencat 42155 Villemontais,42331_0074,G,CHEMIN DE MAYENCAT,
317839132,00014,31783913200014,O,1900-01-01,NN,,,,true,3,,,,,MAYENCAT,42155,VILLEMONTAIS,,,42331,,,,,,,,,,,,,,,,,,,1994-12-25,F,,,,,70.3A,NAF1993,O,3.950509,45.988953,0.92,street,Chemin de Mayencat 42155 Villemontais,42331_0074,G,CHEMIN DE MAYENCAT,
317982338,00012,31798233800012,O,,,,,,true,1,,,,,,42155,VILLEMONTAIS,,,42331,,,,,,,,,,,,,,,,,,,1990-02-28,F,,,,,81.21,NAP,N,,,0,,,,,,
318961570,00013,31896157000013,O,,,,,,true,1,,,,,LE PLAN DU BOIS,42155,VILLEMONTAIS,,,42331,,,,,,,,,,,,,,,,,,,1985-12-25,F,,,,,44.25,NAP,N,3.944417,45.978528,0.47,street,Le Bois 42155 Villemontais,42331_l55seo,G,LE BOIS,
319048427,00011,31904842700011,O,1980-05-01,NN,,,2022-06-04T12:45:40,true,3,,2311,,CHE,DE LA ROCHETTE,42155,VILLEMONTAIS,,,42331,,,,,,,,,,,,,,,,,,,2008-01-01,A,,,,,01.21Z,NAFRev2,N,3.947039,45.995406,0.87,housenumber,2311 Chemin de la Rochette 42155 Villemontais,42331_0108_02311,G,2311 CHEMIN DE LA ROCHETTE,
320237654,00019,32023765400019,O,1980-10-01,01,2020,,2022-08-29T09:16:38,true,5,,,,RUE,DE MURAT,42155,VILLEMONTAIS,,,42331,,,,,,,,,,,,,,,,,,,2017-08-31,A,,,,,85.20Z,NAFRev2,N,3.954962,45.97506,0.66,street,Chemin de Murat 42155 Villemontais,42331_0008,G,CHEMIN DE MURAT,
320419633,00013,32041963300013,O,1980-10-29,NN,,,2008-04-05T00:20:16,true,3,,,,,MAGENCAT,42155,VILLEMONTAIS,,,42331,,,,,,,,,,,,,,,,,,,2008-01-01,A,,,,,68.31Z,NAFRev2,N,3.950509,45.988953,0.62,street,Chemin de Mayencat 42155 Villemontais,42331_0074,G,CHEMIN DE MAYENCAT,
321492100,00011,32149210000011,O,1984-01-01,NN,,,2012-12-20T08:21:46,true,4,,,,,FONTENAY,42155,VILLEMONTAIS,,,42331,,,,,,,,,,,,,,,,,,,2012-12-31,F,,,,,01.41Z,NAFRev2,N,3.95677,45.978115,0.92,street,Chemin de Fontenay 42155 Villemontais,42331_0056,G,CHEMIN DE FONTENAY,
322915141,00012,32291514100012,O,,NN,,,,true,1,,,,,MAYENCAT,42155,VILLEMONTAIS,,,42331,,,,,,,,,,,,,,,,,,,1990-12-31,F,,,,,79.01,NAP,N,3.950509,45.988953,0.92,street,Chemin de Mayencat 42155 Villemontais,42331_0074,G,CHEMIN DE MAYENCAT,
323855809,00014,32385580900014,O,,NN,,,,true,1,,,,,LE BOURG,42155,VILLEMONTAIS,,,42331,,,,,,,,,,,,,,,,,,,1990-06-06,F,,,,,21.08,NAP,N,3.944417,45.978528,0.51,street,Le Bois 42155 Villemontais,42331_l55seo,G,LE BOIS,
324171735,00024,32417173500024,O,1992-01-17,NN,,,,true,1,,,,,AU BOURG,42155,VILLEMONTAIS,,,42331,,,,,,,,,,,,,,,,,,,2002-09-30,F,,,,,55.1A,NAF1993,O,3.954018,45.978435,0.42,street,Route du Col du Bouchet 42155 Villemontais,42331_0034,G,ROUTE DU COL DU BOUCHET,
324185370,00024,32418537000024,O,2021-05-12,,,,2022-07-20T09:44:39,true,2,,4884,,,LE GRAND CHEMIN,42155,VILLEMONTAIS,,,42331,,,,,,,,,,,,,,,,,,,2021-05-15,A,,,,,02.10Z,NAFRev2,N,3.905333,45.993936,0.95,housenumber,4884 Le Grand Chemin 42155 Villemontais,42331_0030_04884,G,4884 LE GRAND CHEMIN,
324505668,00016,32450566800016,O,1982-07-01,NN,,4321AB,2015-08-16T03:25:53,true,6,AU BOURG,,,,RIBORDET,42155,VILLEMONTAIS,,,42331,,,,,,,,,,,,,,,,,,,2015-08-31,F,,,,,43.21A,NAFRev2,N,3.954018,45.978435,0.3,street,Route du Col du Bouchet 42155 Villemontais,42331_0034,D,ROUTE DU COL DU BOUCHET,
325499655,00018,32549965500018,O,1982-10-04,NN,,,2008-11-07T00:42:43,false,4,,,,LD,RANVIER,42155,VILLEMONTAIS,,,42331,,,,,,,,,,,,,,,,,,,1999-06-06,F,,,,,45.2V,NAF1993,O,3.951895,45.978771,0.35,street,Rue du Sabotier 42155 Villemontais,42331_0110,G,RUE DU SABOTIER,
325768208,00010,32576820800010,O,,,,,,true,1,,,,LD,FONTENAY,42155,VILLEMONTAIS,,,42331,,,,,,,,,,,,,,,,,,,1995-12-25,F,,,,,51.1A,NAF1993,N,3.95677,45.978115,0.92,street,Chemin de Fontenay 42155 Villemontais,42331_0056,G,CHEMIN DE FONTENAY,
325784148,00018,32578414800018,O,,NN,,,,true,1,,,,LD,MAYENCAT,42155,VILLEMONTAIS,,,42331,,,,,,,,,,,,,,,,,,,1986-05-05,F,,,,,79.01,NAP,N,3.950509,45.988953,0.92,street,Chemin de Mayencat 42155 Villemontais,42331_0074,G,CHEMIN DE MAYENCAT,
325945863,00034,32594586300034,O,2020-02-03,,,,2021-02-23T10:48:12,true,1,,1056,,RTE,DU COL DU BOUCHET,42155,VILLEMONTAIS,,,42331,,,,,,,,,,,,,,,,,,,2020-02-03,A,,,,INTEREPOCA,47.89Z,NAFRev2,N,3.953761,45.978351,0.88,housenumber,1056 Route du Col du Bouchet 42155 Villemontais,42331_0034_01056,G,1056 ROUTE DU COL DU BOUCHET,
326597614,00022,32659761400022,O,,NN,,,,true,1,,,,LD,AU BOURG,42155,VILLEMONTAIS,,,42331,,,,,,,,,,,,,,,,,,,1993-01-14,F,,,,,55.4B,NAF1993,N,3.954018,45.978435,0.42,street,Route du Col du Bouchet 42155 Villemontais,42331_0034,G,ROUTE DU COL DU BOUCHET,
326698792,00016,32669879200016,O,1983-01-28,NN,,,,true,1,,,,LD,MAYENCAT,42155,VILLEMONTAIS,,,42331,,,,,,,,,,,,,,,,,,,2000-11-24,F,,,,,74.1J,NAF1993,N,3.950509,45.988953,0.92,street,Chemin de Mayencat 42155 Villemontais,42331_0074,G,CHEMIN DE MAYENCAT,
326998333,00016,32699833300016,O,,,,,,true,1,,,,,LA CROIX DE LAUME,42155,VILLEMONTAIS,,,42331,,,,,,,,,,,,,,,,,,,1985-12-25,F,,,,,64.11,NAP,N,3.964066,45.980086,0.93,street,Chemin de la Croix de Laume 42155 Villemontais,42331_0007,G,CHEMIN DE LA CROIX DE LAUME,
327007118,00018,32700711800018,O,,NN,,,,true,1,,,,LD,ARRIS,42155,VILLEMONTAIS,,,42331,,,,,,,,,,,,,,,,,,,,F,,,,,66.02,NAP,N,3.9671,45.970845,0.92,street,Chemin d’Arris 42155 Villemontais,42331_0012,G,CHEMIN D ARRIS,
327125100,00021,32712510000021,O,2002-12-01,02,2020,4399DC,2022-12-04T03:32:50,true,3,,567,,CHE,DES CROZES,42155,VILLEMONTAIS,,,42331,,,,,,,,,,,,,,,,,,,2008-01-01,A,,,,,43.99D,NAFRev2,O,3.959603,45.984815,0.85,housenumber,567 Chemin des Crozes 42155 Villemontais,42331_0006_00567,G,567 CHEMIN DES CROZES,
329291009,00010,32929100900010,O,,,,,,true,1,,,,LD,LA GOUTTE NOIRE,42155,VILLEMONTAIS,,,42331,,,,,,,,,,,,,,,,,,,1985-12-25,F,,,,,62.46,NAP,N,3.927871,45.987909,0.43,street,Chemin de Goutte Rouge 42155 Villemontais,42331_0064,G,CHEMIN DE GOUTTE ROUGE,
329954382,00035,32995438200035,O,2004-08-30,NN,,4399CZ,2021-07-13T09:00:22,true,4,,,,,BOIS D OREE,42155,VILLEMONTAIS,,,42331,,,,,,,,,,,,,,,,,,,2020-12-31,F,,,,,81.30Z,NAFRev2,N,3.954457,45.993748,0.41,street,Chemin de Pierre à Bois 42155 Villemontais,42331_0088,G,CHEMIN DE PIERRE A BOIS,
331128231,00031,33112823100031,O,1987-09-01,NN,,,2006-10-27T02:08:52,false,3,,,,LD,ARRIS,42155,VILLEMONTAIS,,,42331,,,,,,,,,,,,,,,,,,,2004-03-30,F,,,,,63.1E,NAFRev1,N,3.9671,45.970845,0.92,street,Chemin d’Arris 42155 Villemontais,42331_0012,G,CHEMIN D ARRIS,
331390013,00018,33139001300018,O,,NN,,,,true,1,,,,PL,DE LA MAIRIE,42155,VILLEMONTAIS,,,42331,,,,,,,,,,,,,,,,,,,1995-12-31,F,,,,,55.4B,NAF1993,N,3.950072,45.979004,0.83,street,Place de la Mairie 42155 Villemontais,42331_0072,G,PLACE DE LA MAIRIE,
333035715,00015,33303571500015,O,,,,,,true,1,,,,LD,LE MUSSET,42155,VILLEMONTAIS,,,42331,,,,,,,,,,,,,,,,,,,,F,,,,,55.60,NAP,N,3.949055,45.97782,0.66,street,Rue du Musset 42155 Villemontais,42331_0082,G,RUE DU MUSSET,
333889145,00020,33388914500020,O,2002-10-01,NN,,,2010-01-26T09:06:30,false,3,LE BOURG,,,RUE,DU 11 NOVEMBRE,42155,VILLEMONTAIS,,,42331,,,,,,,,,,,,,,,,,,,2004-02-29,F,,,,,55.1A,NAFRev1,O,3.95279,45.97904,0.84,locality,Avenue du 11 Novembre 42155 Villemontais,42331_0005,G,AVENUE DU 11 NOVEMBRE,
333959252,00029,33395925200029,O,1997-07-02,,,,,false,3,,,,,RIBORDET,42155,VILLEMONTAIS,,,42331,,,,,,,,,,,,,,,,,,,1999-03-08,F,,,,,74.1J,NAF1993,N,,,0,,,,,,
333959252,00086,33395925200086,O,2020-03-01,,,4391AZ,2021-02-23T10:53:16,true,1,,217,,RTE,NAPOLEON,42155,VILLEMONTAIS,,,42331,,,,,,,,,,,,,,,,,,,2020-03-01,A,,,,BOIS ET TRAVAUX,43.91A,NAFRev2,N,3.946069,45.977395,0.84,housenumber,217 Route Napoléon 42155 Villemontais,42331_0003_00217,G,217 ROUTE NAPOLEON,
334275716,00010,33427571600010,O,,NN,,,2007-01-18T09:21:11,true,1,,,,,,42155,VILLEMONTAIS,,,42331,,,,,,,,,,,,,,,,,,,1986-12-25,F,,,,,01.2J,NAF1993,N,,,0,,,,,,
337660278,00025,33766027800025,O,2011-01-10,,,,2021-02-23T10:54:26,true,1,CHEZ M. MEIGNAN PASCAL,,,,LA COMBE,42155,VILLEMONTAIS,,,42331,,,,,,,,,,,,,,,,,,,2011-01-10,A,,,,,68.20A,NAFRev2,N,3.962608,45.974756,0.92,street,Chemin de la Combe 42155 Villemontais,42331_0036,G,CHEMIN DE LA COMBE,
339017402,00019,33901740200019,O,1986-10-01,NN,,,2008-01-04T21:26:40,true,3,,,,,LE BOURG,42155,VILLEMONTAIS,,,42331,,,,,,,,,,,,,,,,,,,2008-01-01,A,,,,,94.99Z,NAFRev2,N,3.944417,45.978528,0.51,street,Le Bois 42155 Villemontais,42331_l55seo,G,LE BOIS,
340016534,00018,34001653400018,O,1900-01-01,NN,,,2019-02-27T11:34:17,false,3,,,,,SAINT ROCH,42155,VILLEMONTAIS,,,42331,,,,,,,,,,,,,,,,,,,1992-06-30,F,,,,,92.7C,NAF1993,N,3.953913,45.982668,0.94,locality,Saint Roch 42155 Villemontais,42331_B055,G,SAINT ROCH,
340016658,00015,34001665800015,O,,NN,,,,true,1,,,,,SAINT ROCH,42155,VILLEMONTAIS,,,42331,,,,,,,,,,,,,,,,,,,1992-06-30,F,,,,,92.7C,NAF1993,N,3.953913,45.982668,0.94,locality,Saint Roch 42155 Villemontais,42331_B055,G,SAINT ROCH,
340016773,00012,34001677300012,O,1987-01-16,NN,,,,true,3,,,,,SAINT ROCH,42155,VILLEMONTAIS,,,42331,,,,,,,,,,,,,,,,,,,1992-07-08,F,,,,,92.7C,NAF1993,N,3.953913,45.982668,0.94,locality,Saint Roch 42155 Villemontais,42331_B055,G,SAINT ROCH,
342495223,00014,34249522300014,O,,NN,,,,true,1,,,,,AU BOURG,42155,VILLEMONTAIS,,,42331,,,,,,,,,,,,,,,,,,,1988-03-31,F,,,,,64.49,NAP,N,3.954018,45.978435,0.42,street,Route du Col du Bouchet 42155 Villemontais,42331_0034,G,ROUTE DU COL DU BOUCHET,
342712528,00021,34271252800021,O,1998-05-04,NN,,,2006-11-25T10:45:32,true,4,,,,,L D ST ROCH,42155,VILLEMONTAIS,,,42331,,,,,,,,,,,,,,,,,,,2005-03-14,F,,,,,51.1L,NAFRev1,N,3.951973,45.98098,0.48,street,Rue Saint-Roch 42155 Villemontais,42331_0120,G,RUE SAINT ROCH,
344716907,00037,34471690700037,O,2005-06-30,,,1431ZZ,2021-02-23T10:59:41,true,2,,,,,ARRIS,42155,VILLEMONTAIS,,,42331,,,,,,,,,,,,,,,,,,,2008-01-01,A,,,,,14.39Z,NAFRev2,N,3.9671,45.970845,0.92,street,Chemin d’Arris 42155 Villemontais,42331_0012,G,CHEMIN D ARRIS,
344942776,00024,34494277600024,O,2001-08-01,NN,,,2019-05-17T11:47:33,true,3,,273,,CHE,DE FONTENAY,42155,VILLEMONTAIS,,,42331,,,,,,,,,,,,,,,,,,,2008-01-01,A,,,,,68.20B,NAFRev2,N,3.958317,45.978053,0.86,housenumber,273 Chemin de Fontenay 42155 Villemontais,42331_0056_00273,G,273 CHEMIN DE FONTENAY,
345281802,00016,34528180200016,O,,NN,,,,true,1,,,,LD,LES POTHIERS,42155,VILLEMONTAIS,,,42331,,,,,,,,,,,,,,,,,,,1994-12-31,F,,,,,17.7C,NAF1993,N,3.9523,45.999301,0.79,street,Chemin des Pothiers 42155 Villemontais,42331_0102,G,CHEMIN DES POTHIERS,
347546012,00019,34754601200019,O,,NN,,,,true,1,,,,,LES POTHIERS,42155,VILLEMONTAIS,,,42331,,,,,,,,,,,,,,,,,,,1989-09-30,F,,,,,64.40,NAP,N,3.9523,45.999301,0.79,street,Chemin des Pothiers 42155 Villemontais,42331_0102,G,CHEMIN DES POTHIERS,
347871907,00015,34787190700015,O,1988-09-01,NN,,,2017-01-26T03:58:35,false,4,,,,,LA CHAPELLE ST JEAN,42155,VILLEMONTAIS,,,42331,,,,,,,,,,,,,,,,,,,2016-12-15,F,,,,,01.42Z,NAFRev2,N,3.95071,45.97134,0.84,street,Chemin de la Chapelle Saint-Jean 42155 Villemontais,42331_0024,G,CHEMIN DE LA CHAPELLE SAINT JEAN,
349882548,00051,34988254800051,O,2012-11-05,,,,2022-01-01T15:20:58,true,2,,,,,LES ROCHES,42155,VILLEMONTAIS,,,42331,,,,,,,,,,,,,,,,,,,2012-12-05,A,,,,,70.22Z,NAFRev2,N,3.939761,45.968326,0.55,street,Route des Galoches 42155 Villemontais,42331_0060,G,ROUTE DES GALOCHES,
349941591,00019,34994159100019,O,1989-02-01,,,,,true,4,,,,,LES VERNAYS,42155,VILLEMONTAIS,,,42331,,,,,,,,,,,,,,,,,,,1992-12-25,F,,,,,51.4C,NAF1993,N,3.961177,45.984828,0.4,street,Les Crozes 42155 Villemontais,42331_ng6r2e,G,LES CROZES,
349961037,00018,34996103700018,O,1989-03-11,NN,,1439ZB,2021-02-23T11:02:45,true,5,,,,,LES VERNAYS,42155,VILLEMONTAIS,,,42331,,,,,,,,,,,,,,,,,,,2010-12-15,A,,,,,14.39Z,NAFRev2,N,3.961177,45.984828,0.4,street,Les Crozes 42155 Villemontais,42331_ng6r2e,G,LES CROZES,
350203519,00011,35020351900011,O,,,,,,true,1,,,,,LE BOURG,42155,VILLEMONTAIS,,,42331,,,,,,,,,,,,,,,,,,,1992-12-25,F,,,,,55.1A,NAF1993,N,3.944417,45.978528,0.51,street,Le Bois 42155 Villemontais,42331_l55seo,G,LE BOIS,
350695144,00013,35069514400013,O,1989-01-01,NN,,,2011-11-08T09:50:57,true,4,,,,,LE MUSSET,42155,VILLEMONTAIS,,,42331,,,,,,,,,,,,,,,,,,,2011-10-31,F,,,,,01.21Z,NAFRev2,N,3.949055,45.97782,0.66,street,Rue du Musset 42155 Villemontais,42331_0082,G,RUE DU MUSSET,
350873626,00013,35087362600013,O,,NN,,,,true,1,,,,,LES CROZES,42155,VILLEMONTAIS,,,42331,,,,,,,,,,,,,,,,,,,1990-04-01,F,,,,,79.06,NAP,N,3.961177,45.984828,0.94,street,Les Crozes 42155 Villemontais,42331_ng6r2e,G,LES CROZES,
351743216,00019,35174321600019,O,1989-07-20,NN,,,,true,4,,,,,MAYENCAT,42155,VILLEMONTAIS,,,42331,,,,,,,,,,,,,,,,,,,1994-12-25,F,,,,,70.2A,NAF1993,N,3.950509,45.988953,0.92,street,Chemin de Mayencat 42155 Villemontais,42331_0074,G,CHEMIN DE MAYENCAT,
352149454,00014,35214945400014,O,,NN,,,,true,1,,,,,LA POSTE,42155,VILLEMONTAIS,,,42331,,,,,,,,,,,,,,,,,,,1997-09-30,F,,,,,45.1A,NAF1993,N,3.962132,45.983171,0.91,street,Lieu Dit la Poste 42155 Villemontais,42331_k7d461,G,LIEU DIT LA POSTE,
352598528,00011,35259852800011,O,1989-10-01,NN,,,2008-01-04T23:44:23,true,3,SALLE D ANIMATION RURALE,,,,,42155,VILLEMONTAIS,,,42331,,,,,,,,,,,,,,,,,,,2008-01-01,A,,,,,94.99Z,NAFRev2,N,,,0,,,,,,
352814677,00014,35281467700014,O,1990-03-01,NN,,,2016-03-11T04:15:12,true,3,,,,,FONTENAY,42155,VILLEMONTAIS,,,42331,,,,,,,,,,,,,,,,,,,2008-01-01,A,,,,,68.20B,NAFRev2,N,3.95677,45.978115,0.92,street,Chemin de Fontenay 42155 Villemontais,42331_0056,G,CHEMIN DE FONTENAY,
354003279,00016,35400327900016,O,,,,,,true,1,,,,,AU BOURG,42155,VILLEMONTAIS,,,42331,,,,,,,,,,,,,,,,,,,1991-09-11,F,,,,,67.08,NAP,N,3.954018,45.978435,0.42,street,Route du Col du Bouchet 42155 Villemontais,42331_0034,G,ROUTE DU COL DU BOUCHET,
356000828,05751,35600082805751,O,1991-01-01,NN,,,2006-10-28T00:12:14,false,3,,,,,LE BOURG,42155,VILLEMONTAIS,,,42331,,,,,,,,,,,,,,,,,,,2005-11-01,F,BUREAU DE POSTE,,,,64.1A,NAFRev1,O,3.944417,45.978528,0.51,street,Le Bois 42155 Villemontais,42331_l55seo,G,LE BOIS,
377655295,00014,37765529500014,O,,NN,,,,true,1,,,,,LA ROCHETTE,42155,VILLEMONTAIS,,,42331,,,,,,,,,,,,,,,,,,,1996-12-31,F,,,,,74.8K,NAF1993,N,3.94915,45.990755,0.93,street,Chemin de la Rochette 42155 Villemontais,42331_0108,G,CHEMIN DE LA ROCHETTE,
377825773,00015,37782577300015,O,1990-04-25,NN,,,2006-12-15T00:39:15,false,4,,,,,LA ROCHETTE,42155,VILLEMONTAIS,,,42331,,,,,,,,,,,,,,,,,,,1995-04-01,F,,,,,01.4A,NAF1993,N,3.94915,45.990755,0.93,street,Chemin de la Rochette 42155 Villemontais,42331_0108,G,CHEMIN DE LA ROCHETTE,
377825773,00023,37782577300023,O,1996-09-01,NN,,,2020-03-20T14:21:16,false,4,,145,,CHE,DE LA CROIX DES LIEVRES,42155,VILLEMONTAIS,,,42331,,,,,,,,,,,,,,,,,,,2020-01-31,F,,,,,01.61Z,NAFRev2,N,3.945227,45.993627,0.88,housenumber,145 Chemin de la Croix des Lièvres 42155 Villemontais,42331_0044_00145,G,145 CHEMIN DE LA CRX DES LIEVRES,
378321921,00017,37832192100017,O,1990-04-01,,,,2008-11-08T00:33:53,false,5,,,,,BOURG ST ROCH,42155,VILLEMONTAIS,,,42331,,,,,,,,,,,,,,,,,,,2008-06-02,F,,,,,43.99C,NAFRev2,N,3.951973,45.98098,0.42,street,Rue Saint-Roch 42155 Villemontais,42331_0120,G,RUE SAINT ROCH,
379340391,00018,37934039100018,O,1986-06-19,NN,,,2006-11-25T11:26:15,false,4,,,,,MAISON SAINT PIERRE,42155,VILLEMONTAIS,,,42331,,,,,,,,,,,,,,,,,,,2000-05-06,F,,,,,85.3G,NAF1993,O,3.955408,45.994302,0.43,street,Lieu Dit Pierre a Bois 42155 Villemontais,42331_s1ljs5,G,LIEU DIT PIERRE A BOIS,
379340391,00026,37934039100026,O,2000-05-06,NN,,,2008-01-04T21:28:07,true,3,MME GOURBIERE,,,,MAIRIE,42155,VILLEMONTAIS,,,42331,,,,,,,,,,,,,,,,,,,2008-01-01,A,,,,,88.91A,NAFRev2,N,3.950072,45.979004,0.91,street,Place de la Mairie 42155 Villemontais,42331_0072,G,PLACE DE LA MAIRIE,
380107763,00019,38010776300019,O,1990-12-05,NN,,,2008-01-04T21:37:46,true,3,,,,,,42155,VILLEMONTAIS,,,42331,,,,,,,,,,,,,,,,,,,2008-01-01,A,,,,,01.61Z,NAFRev2,N,,,0,,,,,,
381576255,00016,38157625500016,O,1991-04-01,NN,,,2008-01-04T21:58:01,true,3,,,,,FONTENAY,42155,VILLEMONTAIS,,,42331,,,,,,,,,,,,,,,,,,,2008-01-01,A,,,,,68.20B,NAFRev2,N,3.95677,45.978115,0.92,street,Chemin de Fontenay 42155 Villemontais,42331_0056,G,CHEMIN DE FONTENAY,
381957943,00016,38195794300016,O,1991-04-08,NN,,,2021-12-21T03:55:01,true,3,,,,,LE BOIS,42155,VILLEMONTAIS,,,42331,,,,,,,,,,,,,,,,,,,2008-01-01,A,,,,,55.20Z,NAFRev2,N,3.944417,45.978528,0.94,street,Le Bois 42155 Villemontais,42331_l55seo,G,LE BOIS,
381970391,00011,38197039100011,O,1991-05-15,NN,,,2017-04-30T03:51:11,true,3,,,,,MAIRIE,42155,VILLEMONTAIS,,,42331,,,,,,,,,,,,,,,,,,,2008-01-01,A,,,,,77.31Z,NAFRev2,N,3.950072,45.979004,0.91,street,Place de la Mairie 42155 Villemontais,42331_0072,G,PLACE DE LA MAIRIE,
382191229,00014,38219122900014,O,1991-05-24,NN,,,2018-06-08T04:13:32,true,3,,,,,ST ROCH,42155,VILLEMONTAIS,,,42331,,,,,,,,,,,,,,,,,,,2008-01-01,A,,,,,68.20A,NAFRev2,N,3.951973,45.98098,0.7,street,Rue Saint-Roch 42155 Villemontais,42331_0120,G,RUE SAINT ROCH,
383686839,01893,38368683901893,O,1994-09-01,NN,,,2006-10-28T00:59:48,false,4,,,,RUE,DU 8 MAI,42155,VILLEMONTAIS,,,42331,,,,,,,,,,,,,,,,,,,2004-06-25,F,,,,,65.1E,NAFRev1,O,3.956318,45.980711,0.53,street,Rue du Coq En Paille 42155 Villemontais,42331_0040,G,RUE DU COQ EN PAILLE,
383754215,00010,38375421500010,O,1991-11-11,NN,,,2022-12-16T03:55:27,true,6,,,,,FONTENAY,42155,VILLEMONTAIS,,,42331,,,,,,,,,,,,,,,,,,,2022-12-31,F,,,,,55.20Z,NAFRev2,N,3.95677,45.978115,0.92,street,Chemin de Fontenay 42155 Villemontais,42331_0056,G,CHEMIN DE FONTENAY,
387881501,00028,38788150100028,O,1999-10-07,NN,,,2019-05-17T11:48:20,true,3,,273,,CHE,DE FONTENAY,42155,VILLEMONTAIS,,,42331,,,,,,,,,,,,,,,,,,,2008-01-01,A,,,,,68.20A,NAFRev2,N,3.958317,45.978053,0.86,housenumber,273 Chemin de Fontenay 42155 Villemontais,42331_0056_00273,G,273 CHEMIN DE FONTENAY,
388487209,00016,38848720900016,O,1990-01-01,NN,,,2019-06-24T13:15:34,false,5,,,,,MAIRIE,42155,VILLEMONTAIS,,,42331,,,,,,,,,,,,,,,,,,,2017-09-14,F,,,,,88.10A,NAFRev2,O,3.950072,45.979004,0.91,street,Place de la Mairie 42155 Villemontais,42331_0072,G,PLACE DE LA MAIRIE,