siren,nic,siret,statutDiffusionEtablissement,dateCreationEtablissement,trancheEffectifsEtablissement,anneeEffectifsEtablissement,activitePrincipaleRegistreMetiersEtablissement,dateDernierTraitementEtablissement,etablissementSiege,nombrePeriodesEtablissement,complementAdresseEtablissement,numeroVoieEtablissement,indiceRepetitionEtablissement,typeVoieEtablissement,libelleVoieEtablissement,codePostalEtablissement,libelleCommuneEtablissement,libelleCommuneEtrangerEtablissement,distributionSpecialeEtablissement,codeCommuneEtablissement,codeCedexEtablissement,libelleCedexEtablissement,codePaysEtrangerEtablissement,libellePaysEtrangerEtablissement,complementAdresse2Etablissement,numeroVoie2Etablissement,indiceRepetition2Etablissement,typeVoie2Etablissement,libelleVoie2Etablissement,codePostal2Etablissement,libelleCommune2Etablissement,libelleCommuneEtranger2Etablissement,distributionSpeciale2Etablissement,codeCommune2Etablissement,codeCedex2Etablissement,libelleCedex2Etablissement,codePaysEtranger2Etablissement,libellePaysEtranger2Etablissement,dateDebut,etatAdministratifEtablissement,enseigne1Etablissement,enseigne2Etablissement,enseigne3Etablissement,denominationUsuelleEtablissement,activitePrincipaleEtablissement,nomenclatureActivitePrincipaleEtablissement,caractereEmployeurEtablissement,longitude,latitude,geo_score,geo_type,geo_adresse,geo_id,geo_ligne,geo_l4,geo_l5
215700022,00019,21570002200019,O,1983-03-01,01,2020,,2022-08-29T09:07:48,true,3,,,,,,57590,ABONCOURT-SUR-SEILLE,,,57002,,,,,,,,,,,,,,,,,,,2008-01-01,A,MAIRIE,,,,84.11Z,NAFRev2,N,,,0,,,,,,
303883649,00095,30388364900095,O,2021-01-01,,,,2023-03-01T08:00:23,true,2,,10,,RUE,DE LA FONTAINE,57590,ABONCOURT-SUR-SEILLE,,,57002,,,,,,,,,,,,,,,,,,,2022-07-21,F,HARAS DE LA SEILLE,,,,01.43Z,NAFRev2,N,6.339486,48.816138,0.94,housenumber,10 Rue de la Fontaine 57590 Aboncourt-sur-Seille,57002_0008_00010,G,10 RUE DE LA FONTAINE,
320351364,00015,32035136400015,O,,NN,,,2019-11-14T14:00:46,true,1,,,,,,57590,ABONCOURT-SUR-SEILLE,,,57002,,,,,,,,,,,,,,,,,,,,F,,,,,64.43,NAP,N,,,0,,,,,,
323179192,00014,32317919200014,O,1981-11-01,,,,2019-11-14T14:00:46,true,3,,7,,RUE,CHAUDE,57590,ABONCOURT-SUR-SEILLE,,,57002,,,,,,,,,,,,,,,,,,,2008-01-01,A,,,,,01.49Z,NAFRev2,N,6.338702,48.815444,0.51,housenumber,7 Rue de la Fontaine 57590 Aboncourt-sur-Seille,57002_0008_00007,G,7 RUE DE LA FONTAINE,
393643515,00025,39364351500025,O,1996-01-01,NN,,,2019-11-14T14:00:46,false,4,,14,,RUE,DES LOUPS,57590,ABONCOURT-SUR-SEILLE,,,57002,,,,,,,,,,,,,,,,,,,2018-01-01,F,,,,,68.20A,NAFRev2,N,6.337871,48.815238,0.51,housenumber,14 Rue de la Fontaine 57590 Aboncourt-sur-Seille,57002_0008_00014,G,14 RUE DE LA FONTAINE,
393643515,00033,39364351500033,O,2018-01-01,,,,2022-10-29T03:52:21,true,1,,10,,RUE,DE LA FONTAINE,57590,ABONCOURT-SUR-SEILLE,,,57002,,,,,,,,,,,,,,,,,,,2018-01-01,A,,,,,68.20B,NAFRev2,N,6.339486,48.816138,0.94,housenumber,10 Rue de la Fontaine 57590 Aboncourt-sur-Seille,57002_0008_00010,G,10 RUE DE LA FONTAINE,
393646633,00023,39364663300023,O,1996-01-01,NN,,,2019-11-14T14:00:46,false,4,,14,,RUE,DES LOUPS,57590,ABONCOURT-SUR-SEILLE,,,57002,,,,,,,,,,,,,,,,,,,2001-02-26,F,,,,,70.2A,NAF1993,N,6.337871,48.815238,0.51,housenumber,14 Rue de la Fontaine 57590 Aboncourt-sur-Seille,57002_0008_00014,G,14 RUE DE LA FONTAINE,
395201221,00052,39520122100052,O,2007-04-01,NN,,4312BA,2021-10-27T08:23:18,true,3,,4,,RUE,DE LA FONTAINE,57590,ABONCOURT-SUR-SEILLE,,,57002,,,,,,,,,,,,,,,,,,,2017-10-26,A,STL RICATTE MICHEL,,,,43.12A,NAFRev2,N,6.340144,48.816523,0.94,housenumber,4 Rue de la Fontaine 57590 Aboncourt-sur-Seille,57002_0008_00004,G,4 RUE DE LA FONTAINE,
408925428,00018,40892542800018,O,1980-01-01,NN,,,2019-11-14T14:00:46,true,3,,,,,,57590,ABONCOURT-SUR-SEILLE,,,57002,,,,,,,,,,,,,,,,,,,2006-12-31,F,,,,,01.3Z,NAFRev1,N,,,0,,,,,,
410399232,00017,41039923200017,O,1992-01-01,NN,,,2019-11-14T14:00:46,true,3,,5,,RUE,DE LA FONTAINE,57590,ABONCOURT-SUR-SEILLE,,,57002,,,,,,,,,,,,,,,,,,,2008-01-01,A,,,,,01.11Z,NAFRev2,N,6.339447,48.815737,0.94,housenumber,5 Rue de la Fontaine 57590 Aboncourt-sur-Seille,57002_0008_00005,G,5 RUE DE LA FONTAINE,
413905233,00016,41390523300016,O,1974-01-01,NN,,,2019-11-14T14:00:46,true,4,,,,RTE,NATIONALE 16,57590,ABONCOURT-SUR-SEILLE,,,57002,,,,,,,,,,,,,,,,,,,2003-02-04,F,,,,,01.1A,NAFRev1,N,,,0,,,,,,
414475657,00014,41447565700014,O,1997-01-01,NN,,,2019-11-14T14:00:46,false,3,,4,,RUE,DE LA FONTAINE,57590,ABONCOURT-SUR-SEILLE,,,57002,,,,,,,,,,,,,,,,,,,2003-07-31,F,,,,,92.4Z,NAFRev1,N,6.340144,48.816523,0.94,housenumber,4 Rue de la Fontaine 57590 Aboncourt-sur-Seille,57002_0008_00004,G,4 RUE DE LA FONTAINE,
414475657,00022,41447565700022,O,2008-06-20,,,,2019-11-14T14:00:46,true,2,,15,,RTE,DE MANHOUE,57590,ABONCOURT-SUR-SEILLE,,,57002,,,,,,,,,,,,,,,,,,,2018-04-12,F,,,,,47.99A,NAFRev2,N,6.342281,48.816738,0.84,housenumber,15 Route de Manhoue 57590 Aboncourt-sur-Seille,57002_0015_00015,G,15 ROUTE DE MANHOUE,
419314778,00020,41931477800020,O,2007-05-01,NN,,4332BB,2019-11-14T14:00:46,false,2,,,,RUE,DE LA FONTAINE,57590,ABONCOURT-SUR-SEILLE,,,57002,,,,,,,,,,,,,,,,,,,2008-01-01,A,,,,,43.32B,NAFRev2,N,6.338702,48.815444,0.94,street,Rue de la Fontaine 57590 Aboncourt-sur-Seille,57002_0008,G,RUE DE LA FONTAINE,
422023622,00018,42202362200018,O,1999-01-01,NN,,,2019-11-14T14:00:46,true,4,,2,,RUE,DE L EGLISE,57590,ABONCOURT-SUR-SEILLE,,,57002,,,,,,,,,,,,,,,,,,,2003-12-31,F,,,,,01.3Z,NAFRev1,N,6.340494,48.816033,0.93,housenumber,2 Rue de l’Eglise 57590 Aboncourt-sur-Seille,57002_0005_00002,G,2 RUE DE L EGLISE,
439348152,00034,43934815200034,O,2022-07-22,,,,2023-03-04T12:52:55,true,1,,10,,RUE,DE LA FONTAINE,57590,ABONCOURT-SUR-SEILLE,,,57002,,,,,,,,,,,,,,,,,,,2022-07-22,A,,,,,01.43Z,NAFRev2,N,6.339486,48.816138,0.94,housenumber,10 Rue de la Fontaine 57590 Aboncourt-sur-Seille,57002_0008_00010,G,10 RUE DE LA FONTAINE,
441508157,00019,44150815700019,O,2002-02-15,NN,,,2022-10-29T03:52:20,true,3,MR BERLINGUE JEAN MARIE,10,,RUE,FONTAINE,57590,ABONCOURT-SUR-SEILLE,,,57002,,,,,,,,,,,,,,,,,,,2008-01-01,A,,,,,68.20A,NAFRev2,N,6.339486,48.816138,0.87,housenumber,10 Rue de la Fontaine 57590 Aboncourt-sur-Seille,57002_0008_00010,G,10 RUE DE LA FONTAINE,
444410435,00010,44441043500010,O,2003-01-01,NN,,,2023-03-09T16:15:23,true,5,,10,,RUE,FONTAINE,57590,ABONCOURT-SUR-SEILLE,,,57002,,,,,,,,,,,,,,,,,,,2020-12-31,F,,,,,01.43Z,NAFRev2,O,6.339486,48.816138,0.87,housenumber,10 Rue de la Fontaine 57590 Aboncourt-sur-Seille,57002_0008_00010,G,10 RUE DE LA FONTAINE,
491622767,00011,49162276700011,O,2006-07-24,,,,2019-11-14T14:00:46,true,2,,4,,RUE,DE LA FONTAINE,57590,ABONCOURT-SUR-SEILLE,,,57002,,,,,,,,,,,,,,,,,,,2008-01-01,A,,,,,68.20B,NAFRev2,N,6.340144,48.816523,0.94,housenumber,4 Rue de la Fontaine 57590 Aboncourt-sur-Seille,57002_0008_00004,G,4 RUE DE LA FONTAINE,
492554548,00015,49255454800015,O,2006-11-01,,,,2019-11-14T14:00:46,true,2,,,,,4 RUE DE LA FONTAINE,57590,ABONCOURT-SUR-SEILLE,,,57002,,,,,,,,,,,,,,,,,,,2008-01-01,A,ELEVAGE DES OCRES,,,,01.43Z,NAFRev2,N,6.340144,48.816523,0.94,housenumber,4 Rue de la Fontaine 57590 Aboncourt-sur-Seille,57002_0008_00004,G,4 RUE DE LA FONTAINE,
502053853,00011,50205385300011,O,2008-01-01,,,,2019-11-14T14:00:46,true,2,,5,,RUE,DE LA FONTAINE,57590,ABONCOURT-SUR-SEILLE,,,57002,,,,,,,,,,,,,,,,,,,2010-01-01,F,,,,,53.20Z,NAFRev2,N,6.339447,48.815737,0.94,housenumber,5 Rue de la Fontaine 57590 Aboncourt-sur-Seille,57002_0008_00005,G,5 RUE DE LA FONTAINE,
503459737,00014,50345973700014,O,2006-07-19,,,,2019-11-14T14:00:46,true,1,,10,,RUE,DE LA FONTAINE,57590,ABONCOURT-SUR-SEILLE,,,57002,,,,,,,,,,,,,,,,,,,2006-07-19,A,,,,,68.20B,NAFRev2,N,6.339486,48.816138,0.94,housenumber,10 Rue de la Fontaine 57590 Aboncourt-sur-Seille,57002_0008_00010,G,10 RUE DE LA FONTAINE,
531155745,00023,53115574500023,P,2012-06-01,,,,2023-01-29T20:00:40,false,2,[ND],[ND],[ND],[ND],[ND],[ND],ABONCOURT-SUR-SEILLE,,[ND],57002,[ND],[ND],,,[ND],[ND],[ND],[ND],[ND],[ND],,,[ND],,[ND],[ND],,,2021-08-07,F,[ND],[ND],[ND],[ND],90.03A,NAFRev2,N,,,0,,,,,,
534353602,00020,53435360200020,O,2013-11-01,,,,2019-11-14T14:00:46,true,1,,6,,PL,GENERAL DE GAULLE,57590,ABONCOURT-SUR-SEILLE,,,57002,,,,,,,,,,,,,,,,,,,2013-11-01,F,,,,,10.39B,NAFRev2,N,6.8420578,48.6655754,0.82,poi.park,Place Général De Gaulle (Parc) Réchicourt-le-Château,https://osm.org/way/288438382,G,,
538329236,00011,53832923600011,O,2011-07-15,,,,2019-11-14T14:00:46,true,1,,10,,RUE,DE LA FONTAINE,57590,ABONCOURT-SUR-SEILLE,,,57002,,,,,,,,,,,,,,,,,,,2011-07-15,A,,,,,93.19Z,NAFRev2,N,6.339486,48.816138,0.94,housenumber,10 Rue de la Fontaine 57590 Aboncourt-sur-Seille,57002_0008_00010,G,10 RUE DE LA FONTAINE,
750967325,00010,75096732500010,O,2012-04-02,,,,2019-11-14T14:00:46,true,2,,,,,9 ROUTE DE MANHOUE,57590,ABONCOURT-SUR-SEILLE,,,57002,,,,,,,,,,,,,,,,,,,2013-09-01,F,,,,,66.19B,NAFRev2,N,6.340978,48.817023,0.94,housenumber,9 Route de Manhoue 57590 Aboncourt-sur-Seille,57002_0015_00009,G,9 ROUTE DE MANHOUE,
751169574,00017,75116957400017,O,2012-04-20,,,,2019-11-14T14:00:46,true,2,,4,,RUE,DE LA FONTAINE,57590,ABONCOURT-SUR-SEILLE,,,57002,,,,,,,,,,,,,,,,,,,2017-03-01,F,,,,,43.33Z,NAFRev2,N,6.340144,48.816523,0.94,housenumber,4 Rue de la Fontaine 57590 Aboncourt-sur-Seille,57002_0008_00004,G,4 RUE DE LA FONTAINE,
795000892,00013,79500089200013,O,2013-09-01,,,,2019-11-14T14:00:46,true,2,,5,,RUE,DE L'EGLISE,57590,ABONCOURT-SUR-SEILLE,,,57002,,,,,,,,,,,,,,,,,,,2017-02-01,F,,,,TANTE SARDINE,14.13Z,NAFRev2,N,6.340944,48.816105,0.93,housenumber,5 Rue de l’Eglise 57590 Aboncourt-sur-Seille,57002_0005_00005,G,5 RUE DE L EGLISE,
803737204,00013,80373720400013,O,2014-05-24,01,2020,,2022-08-29T09:58:40,true,3,,10,,RUE,DE LA FONTAINE,57590,ABONCOURT-SUR-SEILLE,,,57002,,,,,,,,,,,,,,,,,,,2020-12-31,F,,,,,64.20Z,NAFRev2,O,6.339486,48.816138,0.94,housenumber,10 Rue de la Fontaine 57590 Aboncourt-sur-Seille,57002_0008_00010,G,10 RUE DE LA FONTAINE,
808357677,00018,80835767700018,O,2014-12-01,,,,2019-11-14T14:00:46,true,2,,,,RTE,DEPARTEMENTALE 77,57590,ABONCOURT-SUR-SEILLE,,,57002,,,,,,,,,,,,,,,,,,,2018-01-04,F,,,,,01.45Z,NAFRev2,N,6.3516305,45.3126388,0.81,poi.track,Ancienne Départementale 77 (Chemin) Le Châtel,https://osm.org/way/165305336,G,,
818959090,00015,81895909000015,O,2016-02-08,,,,2019-11-14T14:00:46,true,1,,,,RTE,DEPARTEMENTALE 77,57590,ABONCOURT-SUR-SEILLE,,,57002,,,,,,,,,,,,,,,,,,,2016-02-08,A,,,,,68.20B,NAFRev2,N,6.3516305,45.3126388,0.81,poi.track,Ancienne Départementale 77 (Chemin) Le Châtel,https://osm.org/way/165305336,G,,
828619510,00013,82861951000013,O,2017-04-01,,,4312BA,2019-11-14T14:00:46,true,1,,5,,RUE,DE LA FONTAINE,57590,ABONCOURT-SUR-SEILLE,,,57002,,,,,,,,,,,,,,,,,,,2017-04-01,A,,,,J-LB TERRASSEMENT,43.12A,NAFRev2,N,6.339447,48.815737,0.94,housenumber,5 Rue de la Fontaine 57590 Aboncourt-sur-Seille,57002_0008_00005,G,5 RUE DE LA FONTAINE,
831994462,00032,83199446200032,O,2019-04-29,,,,2021-02-23T17:52:02,true,1,,8,,RUE,DE LA FONTAINE,57590,ABONCOURT-SUR-SEILLE,,,57002,,,,,,,,,,,,,,,,,,,2019-04-29,A,,,,,74.10Z,NAFRev2,N,6.339661,48.816262,0.94,housenumber,8 Rue de la Fontaine 57590 Aboncourt-sur-Seille,57002_0008_00008,G,8 RUE DE LA FONTAINE,
838974970,00017,83897497000017,O,2018-01-05,,,,2019-11-14T14:00:46,true,1,,,,,ROUTE DEPARTEMENTALE 77,57590,ABONCOURT-SUR-SEILLE,,,57002,,,,,,,,,,,,,,,,,,,2018-01-05,A,,,,,01.45Z,NAFRev2,N,6.340995,48.817003,0.37,street,Route de Manhoue 57590 Aboncourt-sur-Seille,57002_0015,G,ROUTE DE MANHOUE,
840225189,00017,84022518900017,O,2018-05-16,,,4312AZ,2022-10-11T19:38:55,true,2,,11,,RTE,DE MANHOUE,57590,ABONCOURT-SUR-SEILLE,,,57002,,,,,,,,,,,,,,,,,,,2021-07-01,A,,,,,43.12A,NAFRev2,O,6.341147,48.816824,0.84,housenumber,11 Route de Manhoue 57590 Aboncourt-sur-Seille,57002_0015_00011,G,11 ROUTE DE MANHOUE,
851477109,00017,85147710900017,O,2019-05-13,,,,2019-11-14T14:00:46,true,1,,15,,RUE,DE LA FONTAINE,57590,ABONCOURT-SUR-SEILLE,,,57002,,,,,,,,,,,,,,,,,,,2019-05-13,A,,,,,68.20B,NAFRev2,N,6.337418,48.815038,0.94,housenumber,15 Rue de la Fontaine 57590 Aboncourt-sur-Seille,57002_0008_00015,G,15 RUE DE LA FONTAINE,
880815741,00017,88081574100017,O,2019-12-20,,,1071DZ,2020-01-21T19:40:24,true,1,,,,,ROUTE DEPARTEMENTALE 77,57590,ABONCOURT-SUR-SEILLE,,,57002,,,,,,,,,,,,,,,,,,,2019-12-20,A,,,,L'ATELIER SUCRE,10.71D,NAFRev2,N,6.340995,48.817003,0.37,street,Route de Manhoue 57590 Aboncourt-sur-Seille,57002_0015,G,ROUTE DE MANHOUE,
880815758,00011,88081575800011,O,2019-12-20,,,1071CA,2021-09-16T19:32:25,true,2,,,,,ROUTE DEPARTEMENTALE 77,57590,ABONCOURT-SUR-SEILLE,,,57002,,,,,,,,,,,,,,,,,,,2021-09-06,F,,,,L'ATELIER SALE,10.71C,NAFRev2,N,6.340995,48.817003,0.37,street,Route de Manhoue 57590 Aboncourt-sur-Seille,57002_0015,G,ROUTE DE MANHOUE,
948378666,00010,94837866600010,P,2023-01-02,,,,2023-02-04T16:01:58,true,1,[ND],[ND],[ND],[ND],[ND],[ND],ABONCOURT-SUR-SEILLE,,[ND],57002,[ND],[ND],,,[ND],[ND],[ND],[ND],[ND],[ND],,,[ND],,[ND],[ND],,,2023-01-02,A,[ND],[ND],[ND],[ND],68.31Z,NAFRev2,N,,,0,,,,,,
949739585,00014,94973958500014,O,2023-01-27,,,,2023-03-28T14:08:23,true,1,,11,,RTE,DE MANHOUE,57590,ABONCOURT-SUR-SEILLE,,,57002,,,,,,,,,,,,,,,,,,,2023-01-27,A,,,,,68.20B,NAFRev2,N,6.341147,48.816824,0.84,housenumber,11 Route de Manhoue 57590 Aboncourt-sur-Seille,57002_0015_00011,G,11 ROUTE DE MANHOUE,
