siren,nic,siret,statutDiffusionEtablissement,dateCreationEtablissement,trancheEffectifsEtablissement,anneeEffectifsEtablissement,activitePrincipaleRegistreMetiersEtablissement,dateDernierTraitementEtablissement,etablissementSiege,nombrePeriodesEtablissement,complementAdresseEtablissement,numeroVoieEtablissement,indiceRepetitionEtablissement,typeVoieEtablissement,libelleVoieEtablissement,codePostalEtablissement,libelleCommuneEtablissement,libelleCommuneEtrangerEtablissement,distributionSpecialeEtablissement,codeCommuneEtablissement,codeCedexEtablissement,libelleCedexEtablissement,codePaysEtrangerEtablissement,libellePaysEtrangerEtablissement,complementAdresse2Etablissement,numeroVoie2Etablissement,indiceRepetition2Etablissement,typeVoie2Etablissement,libelleVoie2Etablissement,codePostal2Etablissement,libelleCommune2Etablissement,libelleCommuneEtranger2Etablissement,distributionSpeciale2Etablissement,codeCommune2Etablissement,codeCedex2Etablissement,libelleCedex2Etablissement,codePaysEtranger2Etablissement,libellePaysEtranger2Etablissement,dateDebut,etatAdministratifEtablissement,enseigne1Etablissement,enseigne2Etablissement,enseigne3Etablissement,denominationUsuelleEtablissement,activitePrincipaleEtablissement,nomenclatureActivitePrincipaleEtablissement,caractereEmployeurEtablissement,longitude,latitude,geo_score,geo_type,geo_adresse,geo_id,geo_ligne,geo_l4,geo_l5
216006452,00017,21600645200017,O,1983-03-01,02,2020,,2022-08-29T09:08:08,true,3,,9,,RUE,DE LA MAIRIE,60490,VANDELICOURT,,,60654,,,,,,,,,,,,,,,,,,,2008-01-01,A,MAIRIE,,,,84.11Z,NAFRev2,O,2.795177,49.513092,0.94,housenumber,9 Rue de la Mairie 60490 Vandélicourt,60654_5100_00009,G,9 RUE DE LA MAIRIE,
216006452,00025,21600645200025,O,1983-12-21,01,2020,,2022-08-29T09:08:08,false,4,,9,,RUE,DE LA MAIRIE,60490,VANDELICOURT,,,60654,,,,,,,,,,,,,,,,,,,2008-04-22,A,ECOLE ELEMENTAIRE PUBLIQUE,,,,85.20Z,NAFRev2,N,2.795177,49.513092,0.94,housenumber,9 Rue de la Mairie 60490 Vandélicourt,60654_5100_00009,G,9 RUE DE LA MAIRIE,
266006469,00016,26600646900016,O,1983-03-01,NN,,,2016-07-23T12:04:48,true,4,,,,,,60490,VANDELICOURT,,,60654,,,,,,,,,,,,,,,,,,,2016-01-01,F,CCAS,,,,88.99B,NAFRev2,N,,,0,,,,,,
296000979,00017,29600097900017,O,1983-08-10,NN,,,2014-06-13T23:49:13,true,4,MAIRIE,9,,RUE,DE LA MAIRIE,60490,VANDELICOURT,,,60654,,,,,,,,,,,,,,,,,,,2008-01-01,A,,,,,42.99Z,NAFRev2,N,2.795177,49.513092,0.94,housenumber,9 Rue de la Mairie 60490 Vandélicourt,60654_5100_00009,G,9 RUE DE LA MAIRIE,
314126830,00012,31412683000012,O,,,,,,true,1,,,,,,60490,VANDELICOURT,,,60654,,,,,,,,,,,,,,,,,,,1984-12-25,F,,,,,86.07,NAP,N,,,0,,,,,,
318514155,00031,31851415500031,O,1996-01-01,NN,,,2008-11-07T00:34:13,true,3,,13,,RUE,DE VILLERS,60490,VANDELICOURT,,,60654,,,,,,,,,,,,,,,,,,,2003-12-31,F,,,,,60.2L,NAFRev1,N,2.793034,49.509829,0.94,housenumber,13 Rue de Villers 60490 Vandélicourt,60654_9200_00013,G,13 RUE DE VILLERS,
330514563,00023,33051456300023,O,1998-03-01,,,,2015-06-04T08:51:53,false,3,,3,,RUE,CHARLOTTE,60490,VANDELICOURT,,,60654,,,,,,,,,,,,,,,,,,,1999-07-31,F,,,,,51.1R,NAF1993,N,2.792042,49.515113,0.94,housenumber,3 Rue Charlotte 60490 Vandélicourt,60654_1280_00003,G,3 RUE CHARLOTTE,
332503622,00018,33250362200018,O,,NN,,,,true,1,,22,,RUE,DE VIGNEMONT,60490,VANDELICOURT,,,60654,,,,,,,,,,,,,,,,,,,,F,,,,,62.41,NAP,N,2.789904,49.510749,0.94,housenumber,22 Rue de Vignemont 60490 Vandélicourt,60654_9100_00022,G,22 RUE DE VIGNEMONT,
338323389,00019,33832338900019,O,,,,,,true,1,,6,,RUE,DE VILLERS,60490,VANDELICOURT,,,60654,,,,,,,,,,,,,,,,,,,1988-05-03,F,,,,,62.43,NAP,N,2.792859,49.510879,0.94,housenumber,6 Rue de Villers 60490 Vandélicourt,60654_9200_00006,G,6 RUE DE VILLERS,
338418007,00013,33841800700013,O,1986-07-01,,,,,true,3,,21,,RUE,CHARLOTTE,60490,VANDELICOURT,,,60654,,,,,,,,,,,,,,,,,,,1992-12-25,F,,,,,45.1A,NAF1993,N,2.7908,49.513451,0.94,housenumber,21 Rue Charlotte 60490 Vandélicourt,60654_1280_00021,G,21 RUE CHARLOTTE,
340902543,00024,34090254300024,O,2011-03-01,,,,2021-10-27T10:28:18,false,3,,8,,PL,GRANDE RUE,60490,VANDELICOURT,,,60654,,,,,,,,,,,,,,,,,,,2021-01-01,F,,,,,01.13Z,NAFRev2,N,2.79277,49.513456,0.73,housenumber,8 Grande Rue 60490 Vandélicourt,60654_3250_00008,G,8 GRANDE RUE,
340902543,00032,34090254300032,O,2021-01-01,,,,2021-11-04T16:58:50,true,2,,1,,RUE,DU JARDIN DES BOSQUETS,60490,VANDELICOURT,,,60654,,,,,,,,,,,,,,,,,,,2021-11-01,A,,,,,01.11Z,NAFRev2,N,2.796173,49.515054,0.93,housenumber,1 Rue du Jardin des Bosquets 60490 Vandélicourt,60654_4200_00001,G,1 RUE DU JARDIN DES BOSQUETS,
345008825,00019,34500882500019,O,1988-05-04,NN,,1013BZ,2022-05-13T19:43:30,true,4,,6,,RUE,DE VILLERS,60490,VANDELICOURT,,,60654,,,,,,,,,,,,,,,,,,,2022-03-31,F,,,,,47.81Z,NAFRev2,N,2.792859,49.510879,0.94,housenumber,6 Rue de Villers 60490 Vandélicourt,60654_9200_00006,G,6 RUE DE VILLERS,
382242444,00018,38224244400018,O,1991-06-01,NN,,,2008-04-26T11:51:01,false,4,,1,,RUE,DU MAREST,60490,VANDELICOURT,,,60654,,,,,,,,,,,,,,,,,,,1996-09-01,F,,,,,01.1A,NAF1993,N,2.795388,49.513181,0.77,housenumber,1 Rue de Marest 60490 Vandélicourt,60654_5250_00001,G,1 RUE DE MAREST,
382242444,00026,38224244400026,O,1996-09-01,NN,,,2018-09-29T12:11:03,true,3,,3,,RUE,DU JEU D'ARC,60490,VANDELICOURT,,,60654,,,,,,,,,,,,,,,,,,,2008-01-01,A,,,,,01.11Z,NAFRev2,N,2.793238,49.512973,0.94,housenumber,3 Rue du Jeu d’Arc 60490 Vandélicourt,60654_4300_00003,G,3 RUE DU JEU D ARC,
390121218,00015,39012121800015,O,1981-11-01,NN,,,2008-01-04T23:35:27,true,5,,1,,RUE,DU FRENE,60490,VANDELICOURT,,,60654,,,,,,,,,,,,,,,,,,,2008-01-01,A,,,,,68.20B,NAFRev2,N,2.795167,49.513301,0.93,housenumber,1 Rue du Frene 60490 Vandélicourt,60654_2800_00001,G,1 RUE DU FRENE,
390237980,00029,39023798000029,O,2003-11-19,NN,,,2022-12-15T03:55:59,true,3,,1,,RUE,FRESNE,60490,VANDELICOURT,,,60654,,,,,,,,,,,,,,,,,,,2008-01-01,A,,,,,01.11Z,NAFRev2,N,2.795167,49.513301,0.64,housenumber,1 Rue du Frene 60490 Vandélicourt,60654_2800_00001,G,1 RUE DU FRENE,
394458350,00011,39445835000011,O,1994-01-01,NN,,,2021-07-07T03:37:04,true,4,,8,,RUE,DE L'EGLISE,60490,VANDELICOURT,,,60654,,,,,,,,,,,,,,,,,,,2021-01-31,F,,,,,01.13Z,NAFRev2,N,2.794183,49.515524,0.94,housenumber,8 Rue de l’Eglise 60490 Vandélicourt,60654_2250_00008,G,8 RUE DE L EGLISE,
403771827,00017,40377182700017,O,1982-12-31,NN,,,2008-01-04T20:28:45,true,3,,20,,,GRANDE RUE,60490,VANDELICOURT,,,60654,,,,,,,,,,,,,,,,,,,2008-01-01,A,,,,,68.20B,NAFRev2,N,2.79277,49.513456,0.94,street,Grande Rue 60490 Vandélicourt,60654_3250,G,GRANDE RUE,
419282306,00010,41928230600010,O,1998-06-01,NN,,,2019-03-02T03:46:36,true,3,,1,,RUE,DU FRESNE,60490,VANDELICOURT,,,60654,,,,,,,,,,,,,,,,,,,2008-01-01,A,,,,,01.50Z,NAFRev2,N,2.795167,49.513301,0.77,housenumber,1 Rue du Frene 60490 Vandélicourt,60654_2800_00001,G,1 RUE DU FRENE,
419874458,00013,41987445800013,P,1998-07-13,,,,2020-03-12T10:09:10,false,3,[ND],[ND],[ND],[ND],[ND],[ND],VANDELICOURT,,[ND],60654,[ND],[ND],,,[ND],[ND],[ND],[ND],[ND],[ND],,,[ND],,[ND],[ND],,,2000-10-28,F,[ND],[ND],[ND],[ND],85.1C,NAF1993,N,,,0,,,,,,
422250613,00037,42225061300037,O,2012-04-27,,,,2015-05-14T03:48:55,false,2,,10,,RUE,DE LA MAIRIE,60490,VANDELICOURT,,,60654,,,,,,,,,,,,,,,,,,,2013-08-01,F,,,,,01.62Z,NAFRev2,O,2.79424,49.512053,0.94,housenumber,10 Rue de la Mairie 60490 Vandélicourt,60654_5100_00010,G,10 RUE DE LA MAIRIE,
423094275,00017,42309427500017,O,1999-05-01,NN,,,2016-04-26T01:39:14,true,3,,6,,RUE,DU MAREST,60490,VANDELICOURT,,,60654,,,,,,,,,,,,,,,,,,,2008-01-01,A,,,,,01.11Z,NAFRev2,N,2.796273,49.512643,0.77,housenumber,6 Rue de Marest 60490 Vandélicourt,60654_5250_00006,G,6 RUE DE MAREST,
425093705,00027,42509370500027,O,2005-05-25,,,,2021-02-23T11:47:26,false,2,,12,,RUE,DE LA MAIRIE,60490,VANDELICOURT,,,60654,,,,,,,,,,,,,,,,,,,2008-01-01,A,,,,,68.20B,NAFRev2,N,2.794626,49.51221,0.94,housenumber,12 Rue de la Mairie 60490 Vandélicourt,60654_5100_00012,G,12 RUE DE LA MAIRIE,
430755710,00018,43075571000018,O,1977-01-01,NN,,,2016-01-20T03:34:38,true,4,,3,,RUE,DU JEU D ARC,60490,VANDELICOURT,,,60654,,,,,,,,,,,,,,,,,,,2015-10-01,F,,,,,68.20B,NAFRev2,N,2.793238,49.512973,0.94,housenumber,3 Rue du Jeu d’Arc 60490 Vandélicourt,60654_4300_00003,G,3 RUE DU JEU D ARC,
434105185,00012,43410518500012,O,2001-01-05,NN,,,2007-10-10T04:02:43,true,4,,6,,HAM,HAMEAU DE ZOET,60490,VANDELICOURT,,,60654,,,,,,,,,,,,,,,,,,,2007-09-21,F,,,,,55.5D,NAFRev1,N,2.796787,49.498274,0.94,housenumber,6 Hameau de Zoet 60490 Vandélicourt,60654_m4yt83_00006,G,6 HAMEAU DE ZOET,
441927415,00014,44192741500014,O,2002-04-01,NN,,,2008-01-04T21:30:53,true,3,,4,,RUE,DE MARQUEGLISE,60490,VANDELICOURT,,,60654,,,,,,,,,,,,,,,,,,,2008-01-01,A,,,,,01.11Z,NAFRev2,N,2.792029,49.512818,0.94,housenumber,4 Rue de Marquéglise 60490 Vandélicourt,60654_5300_00004,G,4 RUE DE MARQUEGLISE,
448669150,00055,44866915000055,O,2017-10-09,,,,2021-04-03T11:13:42,false,1,,5,,RUE,DE LA MAIRIE,60490,VANDELICOURT,,,60654,,,,,,,,,,,,,,,,,,,2017-10-09,A,,,,,90.03A,NAFRev2,N,2.793958,49.51201,0.94,housenumber,5 Rue de la Mairie 60490 Vandélicourt,60654_5100_00005,G,5 RUE DE LA MAIRIE,
448669150,00063,44866915000063,O,2020-01-01,,,,2021-04-03T11:13:42,true,1,,5,,RUE,DE LA MAIRIE,60490,VANDELICOURT,,,60654,,,,,,,,,,,,,,,,,,,2020-01-01,A,LE RUCHER DU PAYS DES SOURCES,,,,01.49Z,NAFRev2,N,2.793958,49.51201,0.94,housenumber,5 Rue de la Mairie 60490 Vandélicourt,60654_5100_00005,G,5 RUE DE LA MAIRIE,
450628599,00018,45062859900018,O,2003-10-28,NN,,,2006-11-01T00:02:48,false,3,,18,,RUE,DE LA MAIRIE,60490,VANDELICOURT,,,60654,,,,,,,,,,,,,,,,,,,2005-01-01,F,,,,,70.2C,NAFRev1,N,2.79523,49.51265,0.94,housenumber,18 Rue de la Mairie 60490 Vandélicourt,60654_5100_00018,G,18 RUE DE LA MAIRIE,
450628599,00026,45062859900026,O,2005-01-01,,,,2021-02-23T13:33:32,true,2,,2,,RUE,DE MAREST,60490,VANDELICOURT,,,60654,,,,,,,,,,,,,,,,,,,2008-01-01,A,,,,,68.20B,NAFRev2,N,2.795699,49.513105,0.94,housenumber,2 Rue de Marest 60490 Vandélicourt,60654_5250_00002,G,2 RUE DE MAREST,
453232373,00010,45323237300010,O,2004-04-01,NN,,,2008-11-08T02:37:32,true,3,,13,,RUE,DE VILLERS,60490,VANDELICOURT,,,60654,,,,,,,,,,,,,,,,,,,2007-12-31,F,,,,,60.2L,NAFRev1,N,2.793034,49.509829,0.94,housenumber,13 Rue de Villers 60490 Vandélicourt,60654_9200_00013,G,13 RUE DE VILLERS,
454046954,00011,45404695400011,O,2003-02-21,NN,,,2008-01-05T03:18:03,true,3,,2,B,CHE,DU MARAIS DES PUISARDS,60490,VANDELICOURT,,,60654,,,,,,,,,,,,,,,,,,,2008-01-01,A,,,,,90.01Z,NAFRev2,N,2.794364,49.516627,0.82,housenumber,2bis Chemin du Marais des Puisards 60490 Vandélicourt,60654_5200_00002_bis,G,2BIS CHEM DU MARAIS DES PUISARDS,
479503914,00034,47950391400034,O,2009-09-11,NN,,,2011-04-23T13:39:13,true,2,,10,,RUE,DE LA MAIRIE,60490,VANDELICOURT,,,60654,,,,,,,,,,,,,,,,,,,2010-10-15,F,,,,,85.59B,NAFRev2,O,2.79424,49.512053,0.94,housenumber,10 Rue de la Mairie 60490 Vandélicourt,60654_5100_00010,G,10 RUE DE LA MAIRIE,
494173644,00019,49417364400019,O,2007-01-29,,,9602AB,2019-06-13T19:33:59,true,3,,18,,RUE,DE LA MAIRIE,60490,VANDELICOURT,,,60654,,,,,,,,,,,,,,,,,,,2019-03-01,F,,,,,96.02A,NAFRev2,N,2.79523,49.51265,0.94,housenumber,18 Rue de la Mairie 60490 Vandélicourt,60654_5100_00018,G,18 RUE DE LA MAIRIE,
497523092,00037,49752309200037,O,2010-10-25,NN,,4321AA,2015-05-14T08:43:19,false,6,,19,B,RUE,DE VILLERS,60490,VANDELICOURT,,,60654,,,,,,,,,,,,,,,,,,,2014-03-03,F,,,,,43.21A,NAFRev2,N,2.793029,49.509316,0.85,housenumber,19bis Rue de Villers 60490 Vandélicourt,60654_9200_00019_bis,G,19BIS RUE DE VILLERS,
522235670,00034,52223567000034,P,2018-10-01,,,,2021-02-23T15:37:17,true,1,[ND],[ND],[ND],[ND],[ND],[ND],VANDELICOURT,,[ND],60654,[ND],[ND],,,[ND],[ND],[ND],[ND],[ND],[ND],,,[ND],,[ND],[ND],,,2018-10-01,A,[ND],[ND],[ND],[ND],93.29Z,NAFRev2,N,,,0,,,,,,
524338639,00015,52433863900015,O,2010-08-01,,,,2015-01-06T08:24:37,true,2,,5,,RUE,DE LA MAIRIE,60490,VANDELICOURT,,,60654,,,,,,,,,,,,,,,,,,,2012-11-01,F,,,,,74.10Z,NAFRev2,N,2.793958,49.51201,0.94,housenumber,5 Rue de la Mairie 60490 Vandélicourt,60654_5100_00005,G,5 RUE DE LA MAIRIE,
530111202,00012,53011120200012,O,2011-03-01,,,,2013-12-05T11:50:49,true,2,,16,,RUE,DE L'EGLISE,60490,VANDELICOURT,,,60654,,,,,,,,,,,,,,,,,,,2013-12-01,F,,,,,47.81Z,NAFRev2,N,2.794467,49.516279,0.94,housenumber,16 Rue de l’Eglise 60490 Vandélicourt,60654_2250_00016,G,16 RUE DE L EGLISE,
531278109,00024,53127810900024,O,2011-03-08,,,,2021-07-23T19:49:16,true,2,,6,,RUE,DE VILLERS,60490,VANDELICOURT,,,60654,,,,,,,,,,,,,,,,,,,2020-12-31,F,,,,,85.52Z,NAFRev2,N,2.792859,49.510879,0.94,housenumber,6 Rue de Villers 60490 Vandélicourt,60654_9200_00006,G,6 RUE DE VILLERS,
780581559,00017,78058155900017,O,1966-01-01,NN,,,2008-11-08T03:19:25,true,3,,,,,,60490,VANDELICOURT,,,60654,,,,,,,,,,,,,,,,,,,2004-10-30,F,,,,,45.2V,NAFRev1,N,,,0,,,,,,
780581583,00017,78058158300017,O,1900-01-01,NN,,,2008-01-05T03:13:54,true,3,,,,,,60490,VANDELICOURT,,,60654,,,,,,,,,,,,,,,,,,,2008-01-01,A,,,,,94.99Z,NAFRev2,N,,,0,,,,,,
789688546,00017,78968854600017,O,2012-12-01,,,,2012-11-30T19:39:21,true,1,,3,,RUE,CHARLOTTE,60490,VANDELICOURT,,,60654,,,,,,,,,,,,,,,,,,,2012-12-01,A,,,,,90.01Z,NAFRev2,N,2.792042,49.515113,0.94,housenumber,3 Rue Charlotte 60490 Vandélicourt,60654_1280_00003,G,3 RUE CHARLOTTE,
792316002,00015,79231600200015,O,2013-05-06,,,9511ZZ,2021-02-23T16:19:57,true,2,,9,,RUE,DE VIGNEMONT,60490,VANDELICOURT,,,60654,,,,,,,,,,,,,,,,,,,2019-01-01,A,,,,JAIDD - DEPANNAGE INFORMATIQUE,62.09Z,NAFRev2,N,2.790364,49.510788,0.94,housenumber,9 Rue de Vignemont 60490 Vandélicourt,60654_9100_00009,G,9 RUE DE VIGNEMONT,
799779640,00017,79977964000017,O,2014-01-20,,,,2014-10-24T03:17:41,false,2,,4,,RUE,DE LA FORGE,60490,VANDELICOURT,,,60654,,,,,,,,,,,,,,,,,,,2014-08-15,F,,,,SF.AUTO,45.20A,NAFRev2,N,2.792312,49.515739,0.94,housenumber,4 Rue de la Forge 60490 Vandélicourt,60654_2500_00004,G,4 RUE DE LA FORGE,
807811153,00020,80781115300020,O,2022-05-23,,,3213ZZ,2022-06-19T11:55:39,true,1,,8,,RUE,DE LA FORGE,60490,VANDELICOURT,,,60654,,,,,,,,,,,,,,,,,,,2022-05-23,A,,,,S FEE MAIN,32.13Z,NAFRev2,N,2.792669,49.515735,0.94,housenumber,8 Rue de la Forge 60490 Vandélicourt,60654_2500_00008,G,8 RUE DE LA FORGE,
810654178,00013,81065417800013,O,1998-06-25,,,,2015-04-03T15:39:52,true,1,MAIRIE,9,,RUE,DE LA MAIRIE,60490,VANDELICOURT,,,60654,,,,,,,,,,,,,,,,,,,1998-06-25,A,,,,,94.99Z,NAFRev2,N,2.795177,49.513092,0.94,housenumber,9 Rue de la Mairie 60490 Vandélicourt,60654_5100_00009,G,9 RUE DE LA MAIRIE,
810659490,00025,81065949000025,P,2018-05-01,,,,2021-02-23T17:27:36,true,1,[ND],[ND],[ND],[ND],[ND],[ND],VANDELICOURT,,[ND],60654,[ND],[ND],,,[ND],[ND],[ND],[ND],[ND],[ND],,,[ND],,[ND],[ND],,,2018-05-01,A,[ND],[ND],[ND],[ND],47.99A,NAFRev2,N,,,0,,,,,,
815090386,00013,81509038600013,O,2000-09-18,,,,2015-12-07T13:40:32,true,1,,11,,GR,RUE,60490,VANDELICOURT,,,60654,,,,,,,,,,,,,,,,,,,2000-09-18,A,,,,,93.29Z,NAFRev2,N,2.79271,49.513585,0.75,housenumber,11 Grande Rue 60490 Vandélicourt,60654_3250_00011,G,11 GRANDE RUE,
820316867,00010,82031686700010,O,2015-06-01,,,,2016-05-18T04:16:44,true,1,,1,,RUE,DU JEU D ARC,60490,VANDELICOURT,,,60654,,,,,,,,,,,,,,,,,,,2015-06-01,A,,,,,55.20Z,NAFRev2,N,2.792882,49.512931,0.94,housenumber,1 Rue du Jeu d’Arc 60490 Vandélicourt,60654_4300_00001,G,1 RUE DU JEU D ARC,
832234819,00015,83223481900015,O,2017-10-01,,,9529ZC,2021-02-11T08:33:35,true,2,,3,,,GRANDE RUE,60490,VANDELICOURT,,,60654,,,,,,,,,,,,,,,,,,,2020-12-31,F,,,,COUTURE & ROCK N ROLL,95.29Z,NAFRev2,N,2.792632,49.51263,0.94,housenumber,3 Grande Rue 60490 Vandélicourt,60654_3250_00003,G,3 GRANDE RUE,
843684903,00019,84368490300019,O,2018-11-30,,,,2018-11-08T08:42:25,true,1,,2,B,CHE,DU MARAIS DES PUISARDS,60490,VANDELICOURT,,,60654,,,,,,,,,,,,,,,,,,,2018-11-30,A,,,,,85.51Z,NAFRev2,N,2.794364,49.516627,0.82,housenumber,2bis Chemin du Marais des Puisards 60490 Vandélicourt,60654_5200_00002_bis,G,2BIS CHEM DU MARAIS DES PUISARDS,
879922425,00019,87992242500019,O,2020-01-02,,,4321AB,2019-12-18T19:33:34,true,1,,3,,RUE,DE LA MAIRIE,60490,VANDELICOURT,,,60654,,,,,,,,,,,,,,,,,,,2020-01-02,A,,,,Y.ELEC,43.21A,NAFRev2,N,2.79321,49.511671,0.94,housenumber,3 Rue de la Mairie 60490 Vandélicourt,60654_5100_00003,G,3 RUE DE LA MAIRIE,
881292700,00013,88129270000013,O,2020-02-29,,,,2020-02-05T10:10:29,true,1,,3,,RUE,DE VILLERS,60490,VANDELICOURT,,,60654,,,,,,,,,,,,,,,,,,,2020-02-29,A,,,,,70.22Z,NAFRev2,N,2.792978,49.511067,0.94,housenumber,3 Rue de Villers 60490 Vandélicourt,60654_9200_00003,G,3 RUE DE VILLERS,
891219818,00012,89121981800012,O,2020-09-07,,,4391BZ,2020-11-23T09:42:02,true,1,,10,,RUE,DE VILLERS,60490,VANDELICOURT,,,60654,,,,,,,,,,,,,,,,,,,2020-09-07,A,,,,,43.91B,NAFRev2,N,2.79287,49.510594,0.94,housenumber,10 Rue de Villers 60490 Vandélicourt,60654_9200_00010,G,10 RUE DE VILLERS,
892251182,00010,89225118200010,O,2020-07-30,,,,2020-12-22T08:52:37,true,1,,8,,,GRANDE RUE,60490,VANDELICOURT,,,60654,,,,,,,,,,,,,,,,,,,2020-07-30,A,LE JARDIN DES BOSQUETS,,,,01.13Z,NAFRev2,N,2.79277,49.513456,0.94,housenumber,8 Grande Rue 60490 Vandélicourt,60654_3250_00008,G,8 GRANDE RUE,
899943872,00023,89994387200023,O,2022-07-13,,,,2022-09-03T14:50:59,true,1,,20,,RUE,DE VIGNEMONT,60490,VANDELICOURT,,,60654,,,,,,,,,,,,,,,,,,,2022-07-13,A,,,,,96.09Z,NAFRev2,N,2.790101,49.510784,0.94,housenumber,20 Rue de Vignemont 60490 Vandélicourt,60654_9100_00020,G,20 RUE DE VIGNEMONT,
902224096,00013,90222409600013,P,2021-07-01,,,,2021-08-12T03:41:51,true,1,[ND],[ND],[ND],[ND],[ND],[ND],VANDELICOURT,,[ND],60654,[ND],[ND],,,[ND],[ND],[ND],[ND],[ND],[ND],,,[ND],,[ND],[ND],,,2021-07-01,A,[ND],[ND],[ND],[ND],01.13Z,NAFRev2,N,,,0,,,,,,
907829873,00013,90782987300013,O,2021-12-06,,,,2021-12-04T03:43:56,true,1,,22,,RUE,DE VILLERS,60490,VANDELICOURT,,,60654,,,,,,,,,,,,,,,,,,,2021-12-06,A,,,,LES DELICES DES TERROIRS,47.11B,NAFRev2,N,2.792893,49.50954,0.94,housenumber,22 Rue de Villers 60490 Vandélicourt,60654_9200_00022,G,22 RUE DE VILLERS,
910277664,00017,91027766400017,O,2022-03-07,,,,2022-12-21T08:52:18,true,2,,2,,RUE,DE VILLERS,60490,VANDELICOURT,,,60654,,,,,,,,,,,,,,,,,,,2023-01-02,A,,,,APC - CONSEIL ET FORMATION,85.59A,NAFRev2,N,2.792671,49.511191,0.94,housenumber,2 Rue de Villers 60490 Vandélicourt,60654_9200_00002,G,2 RUE DE VILLERS,
911083046,00019,91108304600019,O,2022-02-26,,,,2022-03-08T08:57:07,true,1,2 BIS CHEMIN DU MARRAIS DES PUISARDS,2,B,CHE,CHEMIN DU MARRAIS DES PUISARDS,60490,VANDELICOURT,,,60654,,,,,,,,,,,,,,,,,,,2022-02-26,A,,,,,96.09Z,NAFRev2,N,2.794364,49.516627,0.79,housenumber,2bis Chemin du Marais des Puisards 60490 Vandélicourt,60654_5200_00002_bis,G,2BIS CHEM DU MARAIS DES PUISARDS,
917936171,00011,91793617100011,O,2022-05-31,,,,2022-07-29T10:12:47,true,1,,13,,RUE,GRANDE RUE,60490,VANDELICOURT,,,60654,,,,,,,,,,,,,,,,,,,2022-05-31,A,,,,,35.11Z,NAFRev2,N,2.792717,49.513833,0.83,housenumber,13 Grande Rue 60490 Vandélicourt,60654_3250_00013,G,13 GRANDE RUE,
919048280,00011,91904828000011,O,2022-09-05,,,,2022-11-07T08:54:00,false,2,,3,,RUE,CHARLOTTE,60490,VANDELICOURT,,,60654,,,,,,,,,,,,,,,,,,,2022-10-11,F,,,,ZOE GARDIN,74.90B,NAFRev2,N,2.792042,49.515113,0.94,housenumber,3 Rue Charlotte 60490 Vandélicourt,60654_1280_00003,G,3 RUE CHARLOTTE,
923146500,00015,92314650000015,O,2022-12-08,,,,2023-02-28T19:36:57,true,1,,9,,RUE,DE LA MAIRIE,60490,VANDELICOURT,,,60654,,,,,,,,,,,,,,,,,,,2022-12-08,A,,,,,93.12Z,NAFRev2,N,2.795177,49.513092,0.94,housenumber,9 Rue de la Mairie 60490 Vandélicourt,60654_5100_00009,G,9 RUE DE LA MAIRIE,
926015306,00018,92601530600018,O,,,,,,true,1,,,,,,60490,VANDELICOURT,,,60654,,,,,,,,,,,,,,,,,,,,F,,,,,62.43,NAP,N,,,0,,,,,,
926211871,00013,92621187100013,O,,,,,,true,1,,,,,,60490,VANDELICOURT,,,60654,,,,,,,,,,,,,,,,,,,1984-12-25,F,,,,,64.11,NAP,N,,,0,,,,,,
