siren,nic,siret,statutDiffusionEtablissement,dateCreationEtablissement,trancheEffectifsEtablissement,anneeEffectifsEtablissement,activitePrincipaleRegistreMetiersEtablissement,dateDernierTraitementEtablissement,etablissementSiege,nombrePeriodesEtablissement,complementAdresseEtablissement,numeroVoieEtablissement,indiceRepetitionEtablissement,typeVoieEtablissement,libelleVoieEtablissement,codePostalEtablissement,libelleCommuneEtablissement,libelleCommuneEtrangerEtablissement,distributionSpecialeEtablissement,codeCommuneEtablissement,codeCedexEtablissement,libelleCedexEtablissement,codePaysEtrangerEtablissement,libellePaysEtrangerEtablissement,complementAdresse2Etablissement,numeroVoie2Etablissement,indiceRepetition2Etablissement,typeVoie2Etablissement,libelleVoie2Etablissement,codePostal2Etablissement,libelleCommune2Etablissement,libelleCommuneEtranger2Etablissement,distributionSpeciale2Etablissement,codeCommune2Etablissement,codeCedex2Etablissement,libelleCedex2Etablissement,codePaysEtranger2Etablissement,libellePaysEtranger2Etablissement,dateDebut,etatAdministratifEtablissement,enseigne1Etablissement,enseigne2Etablissement,enseigne3Etablissement,denominationUsuelleEtablissement,activitePrincipaleEtablissement,nomenclatureActivitePrincipaleEtablissement,caractereEmployeurEtablissement,longitude,latitude,geo_score,geo_type,geo_adresse,geo_id,geo_ligne,geo_l4,geo_l5
216205906,00011,21620590600011,O,1983-03-01,01,2020,,2022-08-29T09:08:14,true,3,,,,CHE,DEPARTEMENTAL 103,62130,MONTS-EN-TERNOIS,,,62590,,,,,,,,,,,,,,,,,,,2008-01-01,A,MAIRIE,,,,84.11Z,NAFRev2,N,,,0,,,,,,
216205906,00029,21620590600029,O,1983-12-21,NN,,,2019-11-14T14:00:50,false,4,,,,CHE,DEPARTEMENTAL 103,62130,MONTS-EN-TERNOIS,,,62590,,,,,,,,,,,,,,,,,,,1998-09-01,F,ECOLE PRIMAIRE PUBLIQUE,,,,80.1Z,NAF1993,N,,,0,,,,,,
256201989,00017,25620198900017,O,,,,,2019-11-14T14:00:50,true,1,,,,,MAIRIE,62130,MONTS-EN-TERNOIS,,,62590,,,,,,,,,,,,,,,,,,,,F,,,,,90.11,NAP,N,3.0709671,50.6304695,0.92,poi.townhall,Hôtel de Ville Lille,https://osm.org/way/40917078,G,,
266205905,00018,26620590500018,O,1983-03-01,NN,,,2019-11-14T14:00:50,true,4,MAIRIE,,,CHE,DEPARTEMENTAL 103,62130,MONTS-EN-TERNOIS,,,62590,,,,,,,,,,,,,,,,,,,2017-08-01,F,CCAS,,,,88.99B,NAFRev2,N,,,0,,,,,,
314591264,00010,31459126400010,O,1900-01-01,,,,2019-12-11T08:11:53,true,3,,1,,RUE,DE MONCHEAUX,62130,MONTS-EN-TERNOIS,,,62590,,,,,,,,,,,,,,,,,,,2019-12-10,A,,,,,02.10Z,NAFRev2,N,2.385563,50.319888,0.93,housenumber,1 Rue de Moncheaux 62130 Monts-en-Ternois,62590_0110_00001,G,1 RUE DE MONCHEAUX,
314818733,00011,31481873300011,O,,,,,2020-09-07T11:17:30,true,1,,,,RUE,DU GOUY EN TERNOIS,62130,MONTS-EN-TERNOIS,,,62590,,,,,,,,,,,,,,,,,,,1984-12-25,F,,,,,77.02,NAP,N,2.3866,50.322715,0.77,street,Rue de Gouy 62130 Monts-en-Ternois,62590_0060,G,RUE DE GOUY,
341374007,00019,34137400700019,O,1987-01-01,NN,,,2019-11-14T14:00:50,true,4,,,,,,62130,MONTS-EN-TERNOIS,,,62590,,,,,,,,,,,,,,,,,,,2012-12-31,A,,,,,01.50Z,NAFRev2,O,,,0,,,,,,
348758541,00018,34875854100018,O,1988-12-05,NN,,,2019-11-14T14:00:50,true,3,,,,RTE,GOUY EN TERNOIS,62130,MONTS-EN-TERNOIS,,,62590,,,,,,,,,,,,,,,,,,,2008-01-01,A,,,,,68.20A,NAFRev2,N,2.3866,50.322715,0.75,street,Rue de Gouy 62130 Monts-en-Ternois,62590_0060,G,RUE DE GOUY,
397700352,00016,39770035200016,O,1978-11-21,NN,,,2019-11-14T14:00:50,true,3,,,,,,62130,MONTS-EN-TERNOIS,,,62590,,,,,,,,,,,,,,,,,,,2004-06-30,F,,,,,70.2B,NAFRev1,N,,,0,,,,,,
403913817,00017,40391381700017,O,1996-01-01,NN,,,2019-11-14T14:00:50,false,3,,,,RUE,DE MONCHEAUX,62130,MONTS-EN-TERNOIS,,,62590,,,,,,,,,,,,,,,,,,,2007-04-01,F,,,,,01.1A,NAFRev1,N,2.385563,50.319888,0.93,street,Rue de Moncheaux 62130 Monts-en-Ternois,62590_0110,G,RUE DE MONCHEAUX,
404257412,00019,40425741200019,O,,NN,,,2019-11-14T14:00:50,true,1,,,,,,62130,MONTS-EN-TERNOIS,,,62590,,,,,,,,,,,,,,,,,,,1996-12-31,F,,,,,01.1A,NAF1993,N,,,0,,,,,,
439233834,00019,43923383400019,O,2001-10-03,NN,,,2019-11-14T14:00:50,false,5,,14,,RTE,DE GOUY EN TERNOIS,62130,MONTS-EN-TERNOIS,,,62590,,,,,,,,,,,,,,,,,,,2008-01-01,F,,,,,41.20B,NAFRev2,O,2.388469,50.323152,0.79,housenumber,14 Rue de Gouy 62130 Monts-en-Ternois,62590_0060_00014,G,14 RUE DE GOUY,
451356794,00011,45135679400011,O,2003-12-15,NN,,,2019-11-14T14:00:50,true,3,,14,,RTE,GOUY,62130,MONTS-EN-TERNOIS,,,62590,,,,,,,,,,,,,,,,,,,2008-01-01,A,,,,,68.20A,NAFRev2,N,2.388469,50.323152,0.7,housenumber,14 Rue de Gouy 62130 Monts-en-Ternois,62590_0060_00014,G,14 RUE DE GOUY,
451357024,00012,45135702400012,O,2003-12-15,NN,,,2019-11-14T14:00:50,false,3,,14,,RTE,GOUY,62130,MONTS-EN-TERNOIS,,,62590,,,,,,,,,,,,,,,,,,,2004-04-06,F,,,,,70.2A,NAFRev1,N,2.388469,50.323152,0.7,housenumber,14 Rue de Gouy 62130 Monts-en-Ternois,62590_0060_00014,G,14 RUE DE GOUY,
451606206,00014,45160620600014,O,2004-01-01,NN,,4332AA,2019-11-14T14:00:50,true,4,,7,,RTE,DE GOUY,62130,MONTS-EN-TERNOIS,,,62590,,,,,,,,,,,,,,,,,,,2012-12-28,A,,,,,43.32A,NAFRev2,N,2.386985,50.323172,0.74,housenumber,7 Rue de Gouy 62130 Monts-en-Ternois,62590_0060_00007,G,7 RUE DE GOUY,
451606206,00022,45160620600022,O,2012-01-01,,,,2021-02-23T13:35:04,false,1,,7,,RTE,DE GOUY,62130,MONTS-EN-TERNOIS,,,62590,,,,,,,,,,,,,,,,,,,2012-01-01,A,,,,,01.49Z,NAFRev2,N,2.386985,50.323172,0.74,housenumber,7 Rue de Gouy 62130 Monts-en-Ternois,62590_0060_00007,G,7 RUE DE GOUY,
539606574,00017,53960657400017,O,2012-01-31,,,,2019-11-14T14:00:50,true,1,,17,,RUE,PRINCIPALE,62130,MONTS-EN-TERNOIS,,,62590,,,,,,,,,,,,,,,,,,,2012-01-31,A,,,,,68.20B,NAFRev2,N,2.386534,50.320585,0.94,housenumber,17 Rue Principale 62130 Monts-en-Ternois,62590_0122_00017,G,17 RUE PRINCIPALE,
651910622,00018,65191062200018,O,,NN,,,2019-11-14T14:00:50,true,1,,,,,,62130,MONTS-EN-TERNOIS,,,62590,,,,,,,,,,,,,,,,,,,1989-09-01,F,,,,,45.23,NAP,N,,,0,,,,,,
784047946,00016,78404794600016,O,1969-01-01,NN,,,2019-11-14T14:00:50,true,4,,,,,,62130,MONTS-EN-TERNOIS,,,62590,,,,,,,,,,,,,,,,,,,2003-12-31,F,,,,,45.4C,NAFRev1,O,,,0,,,,,,
803095256,00027,80309525600027,O,2015-04-01,,,,2022-03-09T12:27:11,true,1,,11,,RUE,DE GOUY,62130,MONTS-EN-TERNOIS,,,62590,,,,,,,,,,,,,,,,,,,2015-04-01,A,,,,SOUMDISTRI,47.89Z,NAFRev2,N,2.38794,50.323242,0.93,housenumber,11 Rue de Gouy 62130 Monts-en-Ternois,62590_0060_00011,G,11 RUE DE GOUY,
805279171,00021,80527917100021,O,2015-05-02,,,,2022-11-04T11:39:39,false,2,,17,,RUE,PRINCIPALE,62130,MONTS-EN-TERNOIS,,,62590,,,,,,,,,,,,,,,,,,,2022-10-20,F,,,,,01.43Z,NAFRev2,N,2.386534,50.320585,0.94,housenumber,17 Rue Principale 62130 Monts-en-Ternois,62590_0122_00017,G,17 RUE PRINCIPALE,
805279171,00039,80527917100039,O,2022-10-20,,,,2022-11-04T11:39:39,true,1,,4,,RUE,DE GOUY,62130,MONTS-EN-TERNOIS,,,62590,,,,,,,,,,,,,,,,,,,2022-10-20,A,,,,,01.43Z,NAFRev2,N,2.3866,50.322715,0.82,street,Rue de Gouy 62130 Monts-en-Ternois,62590_0060,G,RUE DE GOUY,
837733427,00012,83773342700012,O,2018-02-21,01,2020,4311ZZ,2022-08-29T10:25:10,true,1,,17,,RUE,PRINCIPALE,62130,MONTS-EN-TERNOIS,,,62590,,,,,,,,,,,,,,,,,,,2018-02-21,A,,,,,43.11Z,NAFRev2,O,2.386534,50.320585,0.94,housenumber,17 Rue Principale 62130 Monts-en-Ternois,62590_0122_00017,G,17 RUE PRINCIPALE,
843221938,00015,84322193800015,O,2019-01-02,,,,2019-11-14T14:00:50,true,1,,10,,RUE,PRINCIPALE,62130,MONTS-EN-TERNOIS,,,62590,,,,,,,,,,,,,,,,,,,2019-01-02,A,,,,,02.10Z,NAFRev2,N,2.388027,50.317839,0.94,housenumber,10 Rue Principale 62130 Monts-en-Ternois,62590_0122_00010,G,10 RUE PRINCIPALE,
848127544,00015,84812754400015,P,2019-03-05,,,,2021-11-30T03:57:39,true,2,[ND],[ND],[ND],[ND],[ND],[ND],MONTS-EN-TERNOIS,,[ND],62590,[ND],[ND],,,[ND],[ND],[ND],[ND],[ND],[ND],,,[ND],,[ND],[ND],,,2021-11-25,A,[ND],[ND],[ND],[ND],69.10Z,NAFRev2,O,,,0,,,,,,
892509498,00010,89250949800010,O,2021-02-01,,,4332AA,2021-01-05T08:47:39,true,1,,5,,RUE,PRINCIPALE,62130,MONTS-EN-TERNOIS,,,62590,,,,,,,,,,,,,,,,,,,2021-02-01,A,,,,EIRL DELATTRE,43.32A,NAFRev2,N,2.382077,50.322662,0.94,housenumber,5 Rue Principale 62130 Monts-en-Ternois,62590_0122_00005,G,5 RUE PRINCIPALE,
911542157,00019,91154215700019,O,2022-03-07,,,,2022-03-21T19:37:42,true,1,,5,,RUE,PRINCIPALE,62130,MONTS-EN-TERNOIS,,,62590,,,,,,,,,,,,,,,,,,,2022-03-07,A,,,,,46.19B,NAFRev2,N,2.382077,50.322662,0.94,housenumber,5 Rue Principale 62130 Monts-en-Ternois,62590_0122_00005,G,5 RUE PRINCIPALE,
912310117,00011,91231011700011,O,2022-03-17,,,,2022-06-02T04:01:28,true,1,,3,,RUE,DE LA PLACETTE LASSUS,62130,MONTS-EN-TERNOIS,,,62590,,,,,,,,,,,,,,,,,,,2022-03-17,A,,,,,68.20B,NAFRev2,N,2.38156,50.325279,0.77,housenumber,3 Rue de la Placette 62130 Monts-en-Ternois,62590_0120_00003,G,3 RUE DE LA PLACETTE,
949406474,00013,94940647400013,O,2023-02-21,,,,2023-03-15T13:58:11,true,1,,4,,RUE,DE GOUY,62130,MONTS-EN-TERNOIS,,,62590,,,,,,,,,,,,,,,,,,,2023-02-21,A,,,,,45.11Z,NAFRev2,N,2.3866,50.322715,0.82,street,Rue de Gouy 62130 Monts-en-Ternois,62590_0060,G,RUE DE GOUY,
