siren,nic,siret,statutDiffusionEtablissement,dateCreationEtablissement,trancheEffectifsEtablissement,anneeEffectifsEtablissement,activitePrincipaleRegistreMetiersEtablissement,dateDernierTraitementEtablissement,etablissementSiege,nombrePeriodesEtablissement,complementAdresseEtablissement,numeroVoieEtablissement,indiceRepetitionEtablissement,typeVoieEtablissement,libelleVoieEtablissement,codePostalEtablissement,libelleCommuneEtablissement,libelleCommuneEtrangerEtablissement,distributionSpecialeEtablissement,codeCommuneEtablissement,codeCedexEtablissement,libelleCedexEtablissement,codePaysEtrangerEtablissement,libellePaysEtrangerEtablissement,complementAdresse2Etablissement,numeroVoie2Etablissement,indiceRepetition2Etablissement,typeVoie2Etablissement,libelleVoie2Etablissement,codePostal2Etablissement,libelleCommune2Etablissement,libelleCommuneEtranger2Etablissement,distributionSpeciale2Etablissement,codeCommune2Etablissement,codeCedex2Etablissement,libelleCedex2Etablissement,codePaysEtranger2Etablissement,libellePaysEtranger2Etablissement,dateDebut,etatAdministratifEtablissement,enseigne1Etablissement,enseigne2Etablissement,enseigne3Etablissement,denominationUsuelleEtablissement,activitePrincipaleEtablissement,nomenclatureActivitePrincipaleEtablissement,caractereEmployeurEtablissement,longitude,latitude,geo_score,geo_type,geo_adresse,geo_id,geo_ligne,geo_l4,geo_l5
217704345,00016,21770434500016,O,1983-03-01,02,2020,,2022-08-29T09:08:59,true,4,,,,,,77480,SAINT-SAUVEUR-LES-BRAY,,,77434,,,,,,,,,,,,,,,,,,,2008-01-01,A,MAIRIE,,,,84.11Z,NAFRev2,O,,,0,,,,,,
267709533,00017,26770953300017,O,1986-01-06,NN,,,2019-11-14T14:00:59,true,4,,,,,MAIRIE SAINT-SAUVEUR-LES-B,77480,SAINT-SAUVEUR-LES-BRAY,,,77434,,,,,,,,,,,,,,,,,,,2016-01-01,F,CCAS,,,,88.99B,NAFRev2,N,3.208947,48.43901,0.89,street,Rue de la Mairie 77480 Saint-Sauveur-lès-Bray,77434_0060,G,RUE DE LA MAIRIE,
300710589,00015,30071058900015,O,,NN,,,2019-11-14T14:00:59,true,1,,15,,RUE,DU MOULIN,77480,SAINT-SAUVEUR-LES-BRAY,,,77434,,,,,,,,,,,,,,,,,,,1987-12-31,F,,,,,66.01,NAP,N,3.213137,48.437204,0.94,housenumber,15 Rue du Moulin 77480 Saint-Sauveur-lès-Bray,77434_0062_00015,G,15 RUE DU MOULIN,
301181780,00018,30118178000018,O,,,,,2019-11-14T14:00:59,true,1,,,,RTE,DES ORMES,77480,SAINT-SAUVEUR-LES-BRAY,,,77434,,,,,,,,,,,,,,,,,,,1984-12-25,F,,,,,62.43,NAP,N,3.210187,48.438178,0.38,street,Rue des Chaudronniers 77480 Saint-Sauveur-lès-Bray,77434_0008,G,RUE DES CHAUDRONNIERS,
309529311,00024,30952931100024,O,1900-01-01,NN,,,2019-11-14T14:00:59,false,3,,,,,LES GRAVIERS,77480,SAINT-SAUVEUR-LES-BRAY,,,77434,,,,,,,,,,,,,,,,,,,2008-01-01,A,,,,,68.20A,NAFRev2,N,3.210187,48.438178,0.51,street,Rue des Chaudronniers 77480 Saint-Sauveur-lès-Bray,77434_0008,G,RUE DES CHAUDRONNIERS,
310479092,00036,31047909200036,O,,NN,,,2019-11-14T14:00:59,true,1,,18,,RUE,GRANDE,77480,SAINT-SAUVEUR-LES-BRAY,,,77434,,,,,,,,,,,,,,,,,,,,F,,,,,67.01,NAP,N,3.20975,48.436507,0.94,housenumber,18 Rue Grande 77480 Saint-Sauveur-lès-Bray,77434_0052_00018,G,18 RUE GRANDE,
311186258,00027,31118625800027,O,,NN,,,2019-11-14T14:00:59,true,1,,,,CHE,LUISETAINES,77480,SAINT-SAUVEUR-LES-BRAY,,,77434,,,,,,,,,,,,,,,,,,,2000-01-31,F,,,,,60.2L,NAF1993,N,3.202343,48.439308,0.87,street,Chemin de Luisetaines 77480 Saint-Sauveur-lès-Bray,77434_0058,G,CHEMIN DE LUISETAINES,
311889406,00030,31188940600030,O,2007-02-02,,,,2019-11-14T14:00:59,true,1,,1,,IMP,ALBERT THOMAS,77480,SAINT-SAUVEUR-LES-BRAY,,,77434,,,,,,,,,,,,,,,,,,,2006-12-31,F,,,,,,,,3.206525,48.44045,0.84,housenumber,1 Impasse Albert Thomas 77480 Saint-Sauveur-lès-Bray,77434_0001_00001,G,1 IMPASSE ALBERT THOMAS,
315601278,00031,31560127800031,O,2013-03-01,,,,2019-11-14T14:00:59,true,3,,51,,,DOMAINE DE LA GOUJONNE,77480,SAINT-SAUVEUR-LES-BRAY,,,77434,,,,,,,,,,,,,,,,,,,2015-06-30,F,,,,,43.21A,NAFRev2,N,3.213493,48.426377,0.95,housenumber,51 Domaine de la Goujonne 77480 Saint-Sauveur-lès-Bray,77434_0050_00051,G,51 DOMAINE DE LA GOUJONNE,
315865709,00036,31586570900036,O,,,,,2019-11-14T14:00:59,true,1,,141,,,DOMAINE DE LA GOUJEONNE,77480,SAINT-SAUVEUR-LES-BRAY,,,77434,,,,,,,,,,,,,,,,,,,1988-12-15,F,,,,,55.40,NAP,N,3.218415,48.427021,0.86,housenumber,141 Domaine de la Goujonne 77480 Saint-Sauveur-lès-Bray,77434_0050_00141,G,141 DOMAINE DE LA GOUJONNE,
316094291,00036,31609429100036,O,,NN,,,2019-11-14T14:00:59,true,1,,20,,,DOMAINE DE LA GOUJONNE,77480,SAINT-SAUVEUR-LES-BRAY,,,77434,,,,,,,,,,,,,,,,,,,1989-03-01,F,,,,,51.1T,NAF1993,N,3.216209,48.428512,0.95,housenumber,20 Domaine de la Goujonne 77480 Saint-Sauveur-lès-Bray,77434_0050_00020,G,20 DOMAINE DE LA GOUJONNE,
320389265,00028,32038926500028,O,1980-10-07,11,2020,,2022-08-29T09:16:42,true,4,,,,RTE,DE DONNEMARIE,77480,SAINT-SAUVEUR-LES-BRAY,,,77434,,,,,,,,,,,,,,,,,,,2008-01-01,A,,,,,08.12Z,NAFRev2,O,3.199442,48.439126,0.83,street,Route de Donnemarie 77480 Saint-Sauveur-lès-Bray,77434_d1ger5,G,ROUTE DE DONNEMARIE,
320389265,00051,32038926500051,O,2006-12-29,NN,,,2019-11-14T14:00:59,false,3,,,,,LA GRANDE PRAIRIE,77480,SAINT-SAUVEUR-LES-BRAY,,,77434,,,,,,,,,,,,,,,,,,,2011-12-31,F,,,,,08.12Z,NAFRev2,O,3.208947,48.43901,0.43,street,Rue de la Mairie 77480 Saint-Sauveur-lès-Bray,77434_0060,G,RUE DE LA MAIRIE,
323023457,00019,32302345700019,O,,NN,,,2019-11-14T14:00:59,true,1,,18,,,GRANDE RUE,77480,SAINT-SAUVEUR-LES-BRAY,,,77434,,,,,,,,,,,,,,,,,,,,F,,,,,67.01,NAP,N,3.209581,48.43645,0.95,housenumber,18 Grande Rue 77480 Saint-Sauveur-lès-Bray,77434_fy9wpk_00018,G,18 GRANDE RUE,
324988559,00021,32498855900021,O,,NN,,,2019-11-14T14:00:59,true,1,,45,,,DOMAINE DE LA GOUJONNE,77480,SAINT-SAUVEUR-LES-BRAY,,,77434,,,,,,,,,,,,,,,,,,,1995-09-30,F,,,,,60.2E,NAF1993,N,3.211594,48.427413,0.95,housenumber,45 Domaine de la Goujonne 77480 Saint-Sauveur-lès-Bray,77434_0050_00045,G,45 DOMAINE DE LA GOUJONNE,
327084281,00028,32708428100028,O,2021-03-15,,,,2022-01-24T03:42:01,true,2,,147,,,DOMAINE DE LA GOUJONNE,77480,SAINT-SAUVEUR-LES-BRAY,,,77434,,,,,,,,,,,,,,,,,,,2021-10-31,F,,,,,70.22Z,NAFRev2,N,3.217804,48.426806,0.95,housenumber,147 Domaine de la Goujonne 77480 Saint-Sauveur-lès-Bray,77434_0050_00147,G,147 DOMAINE DE LA GOUJONNE,
331909887,00019,33190988700019,O,,NN,,,2019-11-14T14:00:59,true,1,,45,,,DOMAINE DE LA GOUJONNE,77480,SAINT-SAUVEUR-LES-BRAY,,,77434,,,,,,,,,,,,,,,,,,,,F,,,,,69.23,NAP,N,3.211594,48.427413,0.95,housenumber,45 Domaine de la Goujonne 77480 Saint-Sauveur-lès-Bray,77434_0050_00045,G,45 DOMAINE DE LA GOUJONNE,
334009230,00015,33400923000015,O,,,,,2019-11-14T14:00:59,true,1,,,,CHE,LUISETAINES,77480,SAINT-SAUVEUR-LES-BRAY,,,77434,,,,,,,,,,,,,,,,,,,1986-10-21,F,,,,,55.10,NAP,N,3.202343,48.439308,0.87,street,Chemin de Luisetaines 77480 Saint-Sauveur-lès-Bray,77434_0058,G,CHEMIN DE LUISETAINES,
339922445,00012,33992244500012,O,,NN,,,2019-11-14T14:00:59,true,1,,18,,RUE,GRANDE,77480,SAINT-SAUVEUR-LES-BRAY,,,77434,,,,,,,,,,,,,,,,,,,1987-03-14,F,,,,,67.01,NAP,N,3.20975,48.436507,0.94,housenumber,18 Rue Grande 77480 Saint-Sauveur-lès-Bray,77434_0052_00018,G,18 RUE GRANDE,
340812254,00019,34081225400019,O,,NN,,,2019-11-14T14:00:59,true,1,,14,,,GRANDE RUE,77480,SAINT-SAUVEUR-LES-BRAY,,,77434,,,,,,,,,,,,,,,,,,,1988-06-30,F,,,,,59.13,NAP,N,3.209731,48.436041,0.95,housenumber,14 Grande Rue 77480 Saint-Sauveur-lès-Bray,77434_fy9wpk_00014,G,14 GRANDE RUE,
341048783,00011,34104878300011,O,1987-02-14,,,,2019-11-14T14:00:59,true,4,,18,,RUE,GRANDE,77480,SAINT-SAUVEUR-LES-BRAY,,,77434,,,,,,,,,,,,,,,,,,,1995-12-25,F,,,,,55.3A,NAF1993,N,3.20975,48.436507,0.94,housenumber,18 Rue Grande 77480 Saint-Sauveur-lès-Bray,77434_0052_00018,G,18 RUE GRANDE,
346470180,00024,34647018000024,O,,NN,,,2019-11-14T14:00:59,true,1,,,,,DOMAINE DE LA GOUJONNE BRA,77480,SAINT-SAUVEUR-LES-BRAY,,,77434,,,,,,,,,,,,,,,,,,,1992-06-16,F,,,,,00.0Z,NAF1993,N,3.217618,48.426802,0.87,street,Domaine de la Goujonne 77480 Saint-Sauveur-lès-Bray,77434_0050,G,DOMAINE DE LA GOUJONNE,
346480114,00013,34648011400013,O,1900-01-01,12,2020,,2022-10-05T14:46:18,true,6,,,,,GRANDE PRAIRIE,77480,SAINT-SAUVEUR-LES-BRAY,,BP 12,77434,,,,,,,,,,,,,,,,,,,2009-12-31,A,,,,,70.10Z,NAFRev2,O,3.209383,48.436475,0.48,street,Grande Rue 77480 Saint-Sauveur-lès-Bray,77434_fy9wpk,G,GRANDE RUE,
346480114,00047,34648011400047,O,1996-12-25,NN,,,2019-11-14T14:00:59,false,2,,,,,GRANDE PRAIRIE,77480,SAINT-SAUVEUR-LES-BRAY,,,77434,,,,,,,,,,,,,,,,,,,2006-12-29,F,,,,,14.2A,NAFRev1,N,3.209383,48.436475,0.48,street,Grande Rue 77480 Saint-Sauveur-lès-Bray,77434_fy9wpk,G,GRANDE RUE,
348909102,00025,34890910200025,O,2004-06-29,01,2020,0812ZZ,2022-08-29T09:30:53,true,4,,,,RTE,DE DONNEMARIE DONTILLY,77480,SAINT-SAUVEUR-LES-BRAY,,,77434,,,,,,,,,,,,,,,,,,,2014-11-10,A,,,,,08.12Z,NAFRev2,O,3.199442,48.439126,0.63,street,Route de Donnemarie 77480 Saint-Sauveur-lès-Bray,77434_d1ger5,G,ROUTE DE DONNEMARIE,
349220418,00017,34922041800017,O,1988-11-23,NN,,,2019-11-14T14:00:59,true,3,,,,,DOMAINE DE LA GOUJONNE,77480,SAINT-SAUVEUR-LES-BRAY,,,77434,,,,,,,,,,,,,,,,,,,2008-01-01,A,,,,,64.20Z,NAFRev2,N,3.217618,48.426802,0.95,street,Domaine de la Goujonne 77480 Saint-Sauveur-lès-Bray,77434_0050,G,DOMAINE DE LA GOUJONNE,
350188272,00016,35018827200016,O,1989-03-30,NN,,,2019-11-14T14:00:59,false,4,,3,,RUE,ALBERT THOMAS,77480,SAINT-SAUVEUR-LES-BRAY,,,77434,,,,,,,,,,,,,,,,,,,2016-06-07,F,,,,,68.20B,NAFRev2,N,3.20825,48.439475,0.94,housenumber,3 Rue Albert Thomas 77480 Saint-Sauveur-lès-Bray,77434_0002_00003,G,3 RUE ALBERT THOMAS,
350188272,00024,35018827200024,O,2016-06-07,,,,2021-02-23T11:02:57,true,1,,,,,CHAMPLOT,77480,SAINT-SAUVEUR-LES-BRAY,,,77434,,,,,,,,,,,,,,,,,,,2016-06-07,A,,,,,68.20B,NAFRev2,N,3.200013,48.440066,0.5,street,Le Champ de l’Epine 77480 Saint-Sauveur-lès-Bray,77434_B011,G,LE CHAMP DE L EPINE,
351447289,00015,35144728900015,O,1989-07-05,NN,,,2019-11-14T14:00:59,true,1,,,,RTE,DU CLOSEAU,77480,SAINT-SAUVEUR-LES-BRAY,,,77434,,,,,,,,,,,,,,,,,,,2000-12-15,F,,,,,51.4S,NAF1993,O,3.210045,48.440488,0.82,street,Route du Closeau 77480 Saint-Sauveur-lès-Bray,77434_0010,G,ROUTE DU CLOSEAU,
351713920,00020,35171392000020,O,2003-10-01,NN,,,2019-11-14T14:00:59,true,4,,73,,,DOMAINE DE LA GOUJONNE,77480,SAINT-SAUVEUR-LES-BRAY,,,77434,,,,,,,,,,,,,,,,,,,2008-09-30,F,,,,,49.32Z,NAFRev2,N,3.215032,48.42606,0.95,housenumber,73 Domaine de la Goujonne 77480 Saint-Sauveur-lès-Bray,77434_0050_00073,G,73 DOMAINE DE LA GOUJONNE,
352890768,00034,35289076800034,O,2004-01-01,NN,,,2019-11-14T14:00:59,true,3,,2,,PL,DU CHATEAU,77480,SAINT-SAUVEUR-LES-BRAY,,,77434,,,,,,,,,,,,,,,,,,,2008-01-01,A,,,,,41.10D,NAFRev2,N,3.208775,48.437824,0.82,housenumber,2 Place du Château 77480 Saint-Sauveur-lès-Bray,77434_0006_00002,G,2 PLACE DU CHATEAU,
353544893,00020,35354489300020,O,,NN,,,2019-11-14T14:00:59,true,1,,1,B,RTE,DES FRENES,77480,SAINT-SAUVEUR-LES-BRAY,,,77434,,,,,,,,,,,,,,,,,,,1994-12-31,F,,,,,45.3A,NAF1993,O,3.203785,48.436914,0.4,housenumber,1bis Les Fresnes 77480 Saint-Sauveur-lès-Bray,77434_950i8j_00001_bis,G,1BIS LES FRESNES,
379419237,00027,37941923700027,O,2001-05-11,NN,,,2019-11-14T14:00:59,true,4,,105,,DOM,DE LA GOUJONNE,77480,SAINT-SAUVEUR-LES-BRAY,,,77434,,,,,,,,,,,,,,,,,,,2017-06-12,F,,,,,68.20B,NAFRev2,N,3.218835,48.42532,0.87,housenumber,105 Domaine de la Goujonne 77480 Saint-Sauveur-lès-Bray,77434_0050_00105,G,105 DOMAINE DE LA GOUJONNE,
381828425,00011,38182842500011,O,1991-04-15,NN,,,2019-11-14T14:00:59,true,3,,,,,DOMAINE DE LA GOUJONNE,77480,SAINT-SAUVEUR-LES-BRAY,,,77434,,,,,,,,,,,,,,,,,,,2008-01-01,A,,,,,94.20Z,NAFRev2,N,3.217618,48.426802,0.95,street,Domaine de la Goujonne 77480 Saint-Sauveur-lès-Bray,77434_0050,G,DOMAINE DE LA GOUJONNE,
382285617,00033,38228561700033,O,2021-09-17,,,,2021-09-30T11:34:30,true,1,,27,,,GRANDE RUE,77480,SAINT-SAUVEUR-LES-BRAY,,,77434,,,,,,,,,,,,,,,,,,,2021-09-17,A,,,,,46.19B,NAFRev2,N,3.209215,48.436838,0.95,housenumber,27 Grande Rue 77480 Saint-Sauveur-lès-Bray,77434_fy9wpk_00027,G,27 GRANDE RUE,
383671005,00031,38367100500031,O,1998-07-20,NN,,,2019-11-14T14:00:59,true,4,,,,RTE,DONNEMARIE DONTILLY,77480,SAINT-SAUVEUR-LES-BRAY,,,77434,,,,,,,,,,,,,,,,,,,2007-12-23,F,,,,,26.6A,NAFRev1,N,3.199442,48.439126,0.58,street,Route de Donnemarie 77480 Saint-Sauveur-lès-Bray,77434_d1ger5,G,ROUTE DE DONNEMARIE,
385098199,00016,38509819900016,O,,NN,,,2019-11-14T14:00:59,true,1,,2,,RUE,ALBERT THOMAS,77480,SAINT-SAUVEUR-LES-BRAY,,,77434,,,,,,,,,,,,,,,,,,,1992-07-31,F,,,,,52.7H,NAF1993,N,3.208417,48.439283,0.94,housenumber,2 Rue Albert Thomas 77480 Saint-Sauveur-lès-Bray,77434_0002_00002,G,2 RUE ALBERT THOMAS,
389914607,00020,38991460700020,O,2001-04-04,NN,,,2019-11-14T14:00:59,true,3,,16,,DOM,DE LA GOUJONNE,77480,SAINT-SAUVEUR-LES-BRAY,,,77434,,,,,,,,,,,,,,,,,,,2004-01-22,F,,,,,52.4L,NAFRev1,N,3.216049,48.428659,0.87,housenumber,16 Domaine de la Goujonne 77480 Saint-Sauveur-lès-Bray,77434_0050_00016,G,16 DOMAINE DE LA GOUJONNE,
395164379,00038,39516437900038,O,2018-09-14,,,,2021-02-23T11:20:56,true,1,,36,,,DOMAINE DE LA GOUJONNE,77480,SAINT-SAUVEUR-LES-BRAY,,,77434,,,,,,,,,,,,,,,,,,,2018-09-14,A,,,,,46.19B,NAFRev2,N,3.213351,48.42772,0.95,housenumber,36 Domaine de la Goujonne 77480 Saint-Sauveur-lès-Bray,77434_0050_00036,G,36 DOMAINE DE LA GOUJONNE,
398995191,00028,39899519100028,O,1998-05-18,,,,2019-12-03T09:28:23,true,4,,10,B,RTE,DU CLOSEAU,77480,SAINT-SAUVEUR-LES-BRAY,,,77434,,,,,,,,,,,,,,,,,,,2009-06-10,A,,,,,96.04Z,NAFRev2,N,3.209856,48.440588,0.75,housenumber,10bis Route du Closeau 77480 Saint-Sauveur-lès-Bray,77434_0010_00010_bis,G,10BIS ROUTE DU CLOSEAU,
399214576,00015,39921457600015,O,1994-11-14,NN,,,2019-11-14T14:00:59,true,3,,67,,,DOMAINE DE LA GOUJONNE,77480,SAINT-SAUVEUR-LES-BRAY,,,77434,,,,,,,,,,,,,,,,,,,2008-01-01,A,,,,,47.81Z,NAFRev2,N,3.217392,48.425688,0.95,housenumber,67 Domaine de la Goujonne 77480 Saint-Sauveur-lès-Bray,77434_0050_00067,G,67 DOMAINE DE LA GOUJONNE,
401425640,00018,40142564000018,O,1995-04-12,NN,,,2020-11-13T03:38:41,true,3,,,,,LE PRIEURE,77480,SAINT-SAUVEUR-LES-BRAY,,,77434,,,,,,,,,,,,,,,,,,,2008-01-01,A,,,,,66.19A,NAFRev2,N,3.208947,48.43901,0.35,street,Rue de la Mairie 77480 Saint-Sauveur-lès-Bray,77434_0060,G,RUE DE LA MAIRIE,
401426077,00012,40142607700012,O,1995-07-01,NN,,,2019-11-14T14:00:59,false,4,,131,,DOM,DE LA GOUJONNE,77480,SAINT-SAUVEUR-LES-BRAY,,,77434,,,,,,,,,,,,,,,,,,,1998-05-01,F,,,,,45.4C,NAF1993,O,3.220378,48.427574,0.87,housenumber,131 Domaine de la Goujonne 77480 Saint-Sauveur-lès-Bray,77434_0050_00131,G,131 DOMAINE DE LA GOUJONNE,
401426077,00020,40142607700020,O,1998-05-01,NN,,,2019-11-14T14:00:59,false,4,,18,B,RUE,GRANDE RUE,77480,SAINT-SAUVEUR-LES-BRAY,,,77434,,,,,,,,,,,,,,,,,,,2003-12-25,F,,,,,70.2C,NAFRev1,N,3.209502,48.436556,0.77,housenumber,18bis Grande Rue 77480 Saint-Sauveur-lès-Bray,77434_fy9wpk_00018_bis,G,18BIS GRANDE RUE,
402115364,00018,40211536400018,O,,NN,,,2019-11-14T14:00:59,true,1,,17,,RUE,ALBERT THOMAS,77480,SAINT-SAUVEUR-LES-BRAY,,,77434,,,,,,,,,,,,,,,,,,,1996-09-27,F,,,,,52.6E,NAF1993,N,3.208049,48.440602,0.94,housenumber,17 Rue Albert Thomas 77480 Saint-Sauveur-lès-Bray,77434_0002_00017,G,17 RUE ALBERT THOMAS,
402166383,00032,40216638300032,O,2002-11-21,NN,,,2019-11-14T14:00:59,false,3,,34,,DOM,DE LA GOUJONNE,77480,SAINT-SAUVEUR-LES-BRAY,,,77434,,,,,,,,,,,,,,,,,,,2003-12-25,F,,,,,70.3E,NAFRev1,O,3.213535,48.427803,0.87,housenumber,34 Domaine de la Goujonne 77480 Saint-Sauveur-lès-Bray,77434_0050_00034,G,34 DOMAINE DE LA GOUJONNE,
402993489,00010,40299348900010,O,1995-11-27,NN,,,2019-11-14T14:00:59,false,3,,112,,DOM,GORGEONNE,77480,SAINT-SAUVEUR-LES-BRAY,,,77434,,,,,,,,,,,,,,,,,,,2004-09-01,F,,,,,70.2C,NAFRev1,N,3.221523,48.426846,0.59,housenumber,112 Domaine de la Goujonne 77480 Saint-Sauveur-lès-Bray,77434_0050_00112,G,112 DOMAINE DE LA GOUJONNE,
403182793,00014,40318279300014,O,,NN,,,2019-11-14T14:00:59,true,1,,20,,,DOMAINE DE LA GOUJONNE,77480,SAINT-SAUVEUR-LES-BRAY,,,77434,,,,,,,,,,,,,,,,,,,1997-02-20,F,,,,,51.6K,NAF1993,N,3.216209,48.428512,0.95,housenumber,20 Domaine de la Goujonne 77480 Saint-Sauveur-lès-Bray,77434_0050_00020,G,20 DOMAINE DE LA GOUJONNE,
403521834,00016,40352183400016,O,1995-12-01,NN,,,2019-11-14T14:00:59,true,1,,18,,,GRANDE RUE,77480,SAINT-SAUVEUR-LES-BRAY,,,77434,,,,,,,,,,,,,,,,,,,1998-12-31,F,,,,,55.1A,NAF1993,N,3.209581,48.43645,0.95,housenumber,18 Grande Rue 77480 Saint-Sauveur-lès-Bray,77434_fy9wpk_00018,G,18 GRANDE RUE,
412431199,00014,41243119900014,O,1997-05-15,NN,,,2019-11-14T14:00:59,true,4,SABLIERES ST SAUVEUR BRAY,,,,SABLIERES,77480,SAINT-SAUVEUR-LES-BRAY,,,77434,,,,,,,,,,,,,,,,,,,2009-09-11,F,,,,,68.10Z,NAFRev2,N,3.210187,48.438178,0.38,street,Rue des Chaudronniers 77480 Saint-Sauveur-lès-Bray,77434_0008,G,RUE DES CHAUDRONNIERS,
412619967,00018,41261996700018,O,1997-06-12,NN,,,2021-02-23T11:34:56,true,3,,148,,DOM,DE LA GOUJONNE,77480,SAINT-SAUVEUR-LES-BRAY,,,77434,,,,,,,,,,,,,,,,,,,2008-01-01,A,,,,,68.20B,NAFRev2,N,3.217704,48.426996,0.87,housenumber,148 Domaine de la Goujonne 77480 Saint-Sauveur-lès-Bray,77434_0050_00148,G,148 DOMAINE DE LA GOUJONNE,
413379561,00017,41337956100017,O,1997-08-01,NN,,,2019-11-14T14:00:59,true,3,,,,,,77480,SAINT-SAUVEUR-LES-BRAY,,BP 12,77434,,,,,,,,,,,,,,,,,,,2006-12-29,F,,,,,74.1J,NAFRev1,N,,,0,,,,,,
413394438,00019,41339443800019,O,1997-07-07,,,,2019-11-14T14:00:59,true,1,,112,,,DOMAINE DE LA GOUJONNE,77480,SAINT-SAUVEUR-LES-BRAY,,,77434,,,,,,,,,,,,,,,,,,,2000-12-31,F,,,,,74.2C,NAF1993,N,3.221523,48.426846,0.95,housenumber,112 Domaine de la Goujonne 77480 Saint-Sauveur-lès-Bray,77434_0050_00112,G,112 DOMAINE DE LA GOUJONNE,
413588765,00011,41358876500011,O,1997-04-01,NN,,,2019-11-14T14:00:59,false,3,,1,B,RUE,DES FRENES,77480,SAINT-SAUVEUR-LES-BRAY,,,77434,,,,,,,,,,,,,,,,,,,1998-12-25,F,,,,,01.2J,NAF1993,N,3.203785,48.436914,0.4,housenumber,1bis Les Fresnes 77480 Saint-Sauveur-lès-Bray,77434_950i8j_00001_bis,G,1BIS LES FRESNES,
418313227,00013,41831322700013,O,1998-04-08,,,,2019-11-14T14:00:59,true,1,,3,,RUE,DE LA MAIRIE,77480,SAINT-SAUVEUR-LES-BRAY,,,77434,,,,,,,,,,,,,,,,,,,1999-12-31,F,,,,,52.6D,NAF1993,N,3.20891,48.438435,0.94,housenumber,3 Rue de la Mairie 77480 Saint-Sauveur-lès-Bray,77434_0060_00003,G,3 RUE DE LA MAIRIE,
420835597,00022,42083559700022,O,2002-10-14,NN,,,2019-11-14T14:00:59,true,3,,,,,,77480,SAINT-SAUVEUR-LES-BRAY,,,77434,,,,,,,,,,,,,,,,,,,2008-01-01,A,,,,,68.20B,NAFRev2,N,,,0,,,,,,
422118018,00015,42211801800015,O,1999-02-01,NN,,,2019-11-14T14:00:59,false,4,,18,,,GRANDE RUE,77480,SAINT-SAUVEUR-LES-BRAY,,,77434,,,,,,,,,,,,,,,,,,,2002-10-05,F,LE SAINT SAUVEUR,,,,55.1A,NAF1993,N,3.209581,48.43645,0.95,housenumber,18 Grande Rue 77480 Saint-Sauveur-lès-Bray,77434_fy9wpk_00018,G,18 GRANDE RUE,
429099278,00013,42909927800013,O,2000-01-01,NN,,9529ZF,2019-11-14T14:00:59,true,4,,115,,,DOMAINE LA GOUJONNE,77480,SAINT-SAUVEUR-LES-BRAY,,,77434,,,,,,,,,,,,,,,,,,,2003-02-27,F,,,,,51.1T,NAFRev1,O,3.222041,48.427191,0.95,housenumber,115 Domaine de la Goujonne 77480 Saint-Sauveur-lès-Bray,77434_0050_00115,G,115 DOMAINE DE LA GOUJONNE,
432539112,00016,43253911200016,O,1955-09-17,NN,,,2019-11-14T14:00:59,true,3,,,,,,77480,SAINT-SAUVEUR-LES-BRAY,,,77434,,,,,,,,,,,,,,,,,,,2008-01-01,A,,,,,68.20A,NAFRev2,N,,,0,,,,,,
432543429,00018,43254342900018,O,1982-01-01,NN,,,2019-11-14T14:00:59,true,3,,,,,LE PRIEURE,77480,SAINT-SAUVEUR-LES-BRAY,,,77434,,,,,,,,,,,,,,,,,,,2008-01-01,A,,,,,68.20A,NAFRev2,N,3.208947,48.43901,0.35,street,Rue de la Mairie 77480 Saint-Sauveur-lès-Bray,77434_0060,G,RUE DE LA MAIRIE,
432781532,00010,43278153200010,O,1982-01-01,NN,,,2021-06-30T05:02:34,true,3,,,,,LE BOURG,77480,SAINT-SAUVEUR-LES-BRAY,,,77434,,,,,,,,,,,,,,,,,,,2008-01-01,A,,,,,68.20A,NAFRev2,N,3.213953,48.430356,0.31,street,Route de Bray sur Seine 77480 Saint-Sauveur-lès-Bray,77434_0004,G,ROUTE DE BRAY SUR SEINE,
435348107,00010,43534810700010,O,2001-03-02,NN,,,2022-07-27T04:10:16,true,3,,,,RTE,DE DONNEMARIE EN MONTOIS,77480,SAINT-SAUVEUR-LES-BRAY,,,77434,,,,,,,,,,,,,,,,,,,2008-01-01,A,,,,,41.10D,NAFRev2,N,3.199442,48.439126,0.54,street,Route de Donnemarie 77480 Saint-Sauveur-lès-Bray,77434_d1ger5,G,ROUTE DE DONNEMARIE,
440095339,00030,44009533900030,O,2020-10-29,,,4391BZ,2021-02-23T13:21:04,true,1,,21,,RUE,ALBERT THOMAS,77480,SAINT-SAUVEUR-LES-BRAY,,,77434,,,,,,,,,,,,,,,,,,,2020-10-29,A,,,,,43.91B,NAFRev2,N,3.209021,48.440724,0.94,housenumber,21 Rue Albert Thomas 77480 Saint-Sauveur-lès-Bray,77434_0002_00021,G,21 RUE ALBERT THOMAS,
442729646,00012,44272964600012,O,2002-07-01,NN,,,2019-11-14T14:00:59,true,4,,107,,,DOMAINE DE LA GOUJONNE,77480,SAINT-SAUVEUR-LES-BRAY,,,77434,,,,,,,,,,,,,,,,,,,2008-10-30,F,,,,,68.31Z,NAFRev2,N,3.219261,48.425155,0.95,housenumber,107 Domaine de la Goujonne 77480 Saint-Sauveur-lès-Bray,77434_0050_00107,G,107 DOMAINE DE LA GOUJONNE,
444147375,00018,44414737500018,O,2002-10-15,NN,,,2019-11-14T14:00:59,true,4,,18,,,GRANDE RUE,77480,SAINT-SAUVEUR-LES-BRAY,,,77434,,,,,,,,,,,,,,,,,,,2010-09-30,F,,,,,55.10Z,NAFRev2,O,3.209581,48.43645,0.95,housenumber,18 Grande Rue 77480 Saint-Sauveur-lès-Bray,77434_fy9wpk_00018,G,18 GRANDE RUE,
449026707,00017,44902670700017,O,2003-06-01,NN,,,2019-11-14T14:00:59,false,3,,18,B,,GRANDE RUE,77480,SAINT-SAUVEUR-LES-BRAY,,,77434,,,,,,,,,,,,,,,,,,,2005-05-01,F,,,,,45.4C,NAFRev1,O,3.209502,48.436556,0.82,housenumber,18bis Grande Rue 77480 Saint-Sauveur-lès-Bray,77434_fy9wpk_00018_bis,G,18BIS GRANDE RUE,
450422563,00012,45042256300012,O,2003-09-22,NN,,,2022-07-23T03:54:27,true,3,,,,,,77480,SAINT-SAUVEUR-LES-BRAY,,,77434,,,,,,,,,,,,,,,,,,,2008-01-01,A,,,,,68.32A,NAFRev2,N,,,0,,,,,,
453511750,00011,45351175000011,O,2004-05-03,,,,2019-11-14T14:00:59,true,3,,31,,,DOMAINE DE LA GOUJONNE,77480,SAINT-SAUVEUR-LES-BRAY,,,77434,,,,,,,,,,,,,,,,,,,2006-11-30,F,,,,,74.1J,NAFRev1,N,3.21336,48.427914,0.95,housenumber,31 Domaine de la Goujonne 77480 Saint-Sauveur-lès-Bray,77434_0050_00031,G,31 DOMAINE DE LA GOUJONNE,
478994759,00023,47899475900023,O,2008-01-01,NN,,4321AB,2019-11-14T14:00:59,false,4,,7,,RUE,DE LA MAIRIE,77480,SAINT-SAUVEUR-LES-BRAY,,,77434,,,,,,,,,,,,,,,,,,,2014-08-31,F,CAMUS,,,,43.21A,NAFRev2,N,3.208511,48.439124,0.94,housenumber,7 Rue de la Mairie 77480 Saint-Sauveur-lès-Bray,77434_0060_00007,G,7 RUE DE LA MAIRIE,
482046919,00015,48204691900015,O,2005-04-01,NN,,,2023-01-07T03:57:57,true,2,,2,,,GRANDE RUE,77480,SAINT-SAUVEUR-LES-BRAY,,,77434,,,,,,,,,,,,,,,,,,,2008-01-01,A,,,,,01.11Z,NAFRev2,O,3.212283,48.43403,0.95,housenumber,2 Grande Rue 77480 Saint-Sauveur-lès-Bray,77434_fy9wpk_00002,G,2 GRANDE RUE,
484802335,00014,48480233500014,O,2005-10-27,01,2020,2363ZZ,2022-08-29T09:18:26,true,5,,,,,,77480,SAINT-SAUVEUR-LES-BRAY,,,77434,,,,,,,,,,,,,,,,,,,2008-02-10,A,,,,,23.63Z,NAFRev2,O,,,0,,,,,,
495194268,00027,49519426800027,O,2009-11-20,,,,2022-08-12T04:06:36,true,1,,,,RTE,DE DONNEMARIE DONTILLY,77480,SAINT-SAUVEUR-LES-BRAY,,,77434,,,,,,,,,,,,,,,,,,,2009-11-20,A,,,,,68.20B,NAFRev2,N,3.199442,48.439126,0.63,street,Route de Donnemarie 77480 Saint-Sauveur-lès-Bray,77434_d1ger5,G,ROUTE DE DONNEMARIE,
507531879,00025,50753187900025,O,2022-01-01,,,,2022-02-01T11:38:01,false,1,,80,,DOM,DE LA GOUJONNE,77480,SAINT-SAUVEUR-LES-BRAY,,,77434,,,,,,,,,,,,,,,,,,,2022-01-01,A,,,,,70.22Z,NAFRev2,N,3.213309,48.426357,0.87,housenumber,80 Domaine de la Goujonne 77480 Saint-Sauveur-lès-Bray,77434_0050_00080,G,80 DOMAINE DE LA GOUJONNE,
509530960,00012,50953096000012,O,2008-12-08,,,,2019-11-14T14:00:59,true,1,,,,RTE,DE DONNEMARIE DONTILLY,77480,SAINT-SAUVEUR-LES-BRAY,,,77434,,,,,,,,,,,,,,,,,,,2008-12-08,A,,,,,68.20B,NAFRev2,N,3.199442,48.439126,0.63,street,Route de Donnemarie 77480 Saint-Sauveur-lès-Bray,77434_d1ger5,G,ROUTE DE DONNEMARIE,
510371875,00020,51037187500020,O,2019-09-17,,,8121ZZ,2022-10-10T15:49:27,false,2,,133,,DOM,DE LA GOUJONNE,77480,SAINT-SAUVEUR-LES-BRAY,,,77434,,,,,,,,,,,,,,,,,,,2021-12-31,F,,,,,95.29Z,NAFRev2,N,3.220041,48.42773,0.87,housenumber,133 Domaine de la Goujonne 77480 Saint-Sauveur-lès-Bray,77434_0050_00133,G,133 DOMAINE DE LA GOUJONNE,