siren,nic,siret,statutDiffusionEtablissement,dateCreationEtablissement,trancheEffectifsEtablissement,anneeEffectifsEtablissement,activitePrincipaleRegistreMetiersEtablissement,dateDernierTraitementEtablissement,etablissementSiege,nombrePeriodesEtablissement,complementAdresseEtablissement,numeroVoieEtablissement,indiceRepetitionEtablissement,typeVoieEtablissement,libelleVoieEtablissement,codePostalEtablissement,libelleCommuneEtablissement,libelleCommuneEtrangerEtablissement,distributionSpecialeEtablissement,codeCommuneEtablissement,codeCedexEtablissement,libelleCedexEtablissement,codePaysEtrangerEtablissement,libellePaysEtrangerEtablissement,complementAdresse2Etablissement,numeroVoie2Etablissement,indiceRepetition2Etablissement,typeVoie2Etablissement,libelleVoie2Etablissement,codePostal2Etablissement,libelleCommune2Etablissement,libelleCommuneEtranger2Etablissement,distributionSpeciale2Etablissement,codeCommune2Etablissement,codeCedex2Etablissement,libelleCedex2Etablissement,codePaysEtranger2Etablissement,libellePaysEtranger2Etablissement,dateDebut,etatAdministratifEtablissement,enseigne1Etablissement,enseigne2Etablissement,enseigne3Etablissement,denominationUsuelleEtablissement,activitePrincipaleEtablissement,nomenclatureActivitePrincipaleEtablissement,caractereEmployeurEtablissement,longitude,latitude,geo_score,geo_type,geo_adresse,geo_id,geo_ligne,geo_l4,geo_l5
006710115,00012,00671011500012,O,,,,,2019-11-14T14:01:00,true,1,,430,,RTE,DU VAL DE SOMME,80580,EAUCOURT-SUR-SOMME,,,80262,,,,,,,,,,,,,,,,,,,1995-01-31,F,,,,,50.2Z,NAF1993,N,1.884749,50.065602,0.88,housenumber,430 Route du Val de Somme 80580 Eaucourt-sur-Somme,80262_0104_00430,G,430 ROUTE DU VAL DE SOMME,
006710123,00024,00671012300024,O,1981-07-01,NN,,,2019-11-14T14:01:00,true,3,,,,RUE,DU 11 NOVEMBRE,80580,EAUCOURT-SUR-SOMME,,,80262,,,,,,,,,,,,,,,,,,,2008-01-01,A,,,,,68.20B,NAFRev2,N,1.88417,50.064943,0.94,street,Rue du 11 Novembre 80580 Eaucourt-sur-Somme,80262_0065,G,RUE DU 11 NOVEMBRE,
218002517,00017,21800251700017,O,1983-03-01,03,2020,,2022-08-29T09:09:07,true,4,,,,RUE,DU 11 NOVEMBRE 1918,80580,EAUCOURT-SUR-SOMME,,,80262,,,,,,,,,,,,,,,,,,,2008-01-01,A,MAIRIE,,,,84.11Z,NAFRev2,O,1.88417,50.064943,0.78,street,Rue du 11 Novembre 80580 Eaucourt-sur-Somme,80262_0065,G,RUE DU 11 NOVEMBRE,
218002517,00025,21800251700025,O,1983-12-21,02,2020,,2022-08-29T09:09:07,false,3,,46,,RUE,DE LA FONTAINE,80580,EAUCOURT-SUR-SOMME,,,80262,,,,,,,,,,,,,,,,,,,2008-01-01,A,ECOLE PRIMAIRE PUBLIQUE,,,,85.20Z,NAFRev2,N,1.883176,50.064563,0.94,housenumber,46 Rue de la Fontaine 80580 Eaucourt-sur-Somme,80262_0032_00046,G,46 RUE DE LA FONTAINE,
268003175,00018,26800317500018,O,1983-03-01,NN,,,2019-11-14T14:01:00,true,3,MAIRIE,,,RUE,DU 11 NOVEMBRE 1918,80580,EAUCOURT-SUR-SOMME,,,80262,,,,,,,,,,,,,,,,,,,2008-01-01,A,CCAS,,,,88.99B,NAFRev2,N,1.88417,50.064943,0.78,street,Rue du 11 Novembre 80580 Eaucourt-sur-Somme,80262_0065,G,RUE DU 11 NOVEMBRE,
298002916,00013,29800291600013,O,1983-08-10,NN,,,2019-11-14T14:01:00,true,3,MAIRIE,,,RUE,DU 11 NOVEMBRE 1918,80580,EAUCOURT-SUR-SOMME,,,80262,,,,,,,,,,,,,,,,,,,2008-01-01,A,,,,,42.99Z,NAFRev2,N,1.88417,50.064943,0.78,street,Rue du 11 Novembre 80580 Eaucourt-sur-Somme,80262_0065,G,RUE DU 11 NOVEMBRE,
309973600,00021,30997360000021,O,,NN,,,2019-11-14T14:01:00,true,1,,,,RTE,NATIONALE,80580,EAUCOURT-SUR-SOMME,,,80262,,,,,,,,,,,,,,,,,,,,F,,,,,13.14,NAP,N,1.2279812,49.230352,0.77,poi,Route Nationale (Pont) Saint-Pierre-du-Vauvray,https://osm.org/way/95838375,G,,
310320007,00027,31032000700027,O,1997-06-02,NN,,,2019-11-14T14:01:00,false,3,,430,,RUE,DU VAL DE SOMME,80580,EAUCOURT-SUR-SOMME,,,80262,,,,,,,,,,,,,,,,,,,2004-04-07,F,LE ROI DU PNEU,,,,50.3B,NAFRev1,O,1.884749,50.065602,0.84,housenumber,430 Route du Val de Somme 80580 Eaucourt-sur-Somme,80262_0104_00430,G,430 ROUTE DU VAL DE SOMME,
315328567,00013,31532856700013,O,,NN,,,2019-11-14T14:01:00,true,1,,,,RUE,DU MEILLIER,80580,EAUCOURT-SUR-SOMME,,,80262,,,,,,,,,,,,,,,,,,,1985-03-04,F,,,,,01.00,NAP,N,1.886929,50.061985,0.95,street,Rue du Meillier 80580 Eaucourt-sur-Somme,80262_0040,G,RUE DU MEILLIER,
319735809,00083,31973580900083,O,2010-06-15,NN,,,2019-11-14T14:01:00,false,5,LA PENICHE,215,,RUE,DU PONT,80580,EAUCOURT-SUR-SOMME,,,80262,,,,,,,,,,,,,,,,,,,2013-10-22,F,LE VIEUX MURIER,,,,56.10A,NAFRev2,O,1.881884,50.062766,0.94,housenumber,215 Rue du Pont 80580 Eaucourt-sur-Somme,80262_0024_00215,G,215 RUE DU PONT,
320617012,00028,32061701200028,O,2004-01-02,NN,,,2019-11-14T14:01:00,false,3,,430,B,RTE,DU VAL DE SOMME,80580,EAUCOURT-SUR-SOMME,,,80262,,,,,,,,,,,,,,,,,,,2005-09-01,F,,,,,50.2Z,NAFRev1,N,1.884837,50.065689,0.81,housenumber,430bis Route du Val de Somme 80580 Eaucourt-sur-Somme,80262_0104_00430_bis,G,430BIS ROUTE DU VAL DE SOMME,
325970119,00013,32597011900013,O,,NN,,,2019-11-14T14:01:00,true,1,,255,,RUE,DES JONGLEURS,80580,EAUCOURT-SUR-SOMME,,,80262,,,,,,,,,,,,,,,,,,,,F,,,,,55.60,NAP,N,1.886053,50.063885,0.94,housenumber,255 Rue des Jongleurs 80580 Eaucourt-sur-Somme,80262_0036_00255,G,255 RUE DES JONGLEURS,
330538232,00027,33053823200027,O,1988-11-01,NN,,,2019-11-14T14:01:00,true,1,,470,,RUE,DU VAL DE SOMME,80580,EAUCOURT-SUR-SOMME,,,80262,,,,,,,,,,,,,,,,,,,1999-09-24,F,,,,,45.4F,NAF1993,O,1.885311,50.065452,0.84,housenumber,470 Route du Val de Somme 80580 Eaucourt-sur-Somme,80262_0104_00470,G,470 ROUTE DU VAL DE SOMME,
331136945,00010,33113694500010,O,1984-09-18,NN,,,2021-06-05T03:43:53,true,4,,,,RUE,DU 11 NOVEMBRE,80580,EAUCOURT-SUR-SOMME,,,80262,,,,,,,,,,,,,,,,,,,2020-12-31,F,,,,,56.30Z,NAFRev2,N,1.88417,50.064943,0.94,street,Rue du 11 Novembre 80580 Eaucourt-sur-Somme,80262_0065,G,RUE DU 11 NOVEMBRE,
334549045,00014,33454904500014,O,,NN,,,2019-11-14T14:01:00,true,1,,500,,RUE,DU VAL DE SOMME,80580,EAUCOURT-SUR-SOMME,,,80262,,,,,,,,,,,,,,,,,,,1994-05-13,F,,,,,85.1G,NAF1993,N,1.885669,50.065231,0.84,housenumber,500 Route du Val de Somme 80580 Eaucourt-sur-Somme,80262_0104_00500,G,500 ROUTE DU VAL DE SOMME,
343871901,00017,34387190100017,O,,NN,,,2019-11-14T14:01:00,true,1,,,,,,80580,EAUCOURT-SUR-SOMME,,,80262,,,,,,,,,,,,,,,,,,,1989-10-01,F,,,,,01.1A,NAF1993,N,,,0,,,,,,
353133325,00012,35313332500012,O,1989-10-01,NN,,,2019-11-14T14:01:00,true,4,,,,,,80580,EAUCOURT-SUR-SOMME,,,80262,,,,,,,,,,,,,,,,,,,2016-02-29,F,,,,,01.50Z,NAFRev2,N,,,0,,,,,,
378909980,00021,37890998000021,O,,,,,2019-11-14T14:01:00,true,1,,610,,RUE,DU MEILLIER,80580,EAUCOURT-SUR-SOMME,,,80262,,,,,,,,,,,,,,,,,,,1997-02-28,F,,,,,52.4H,NAF1993,N,1.8871,50.06003,0.95,housenumber,610 Rue du Meillier 80580 Eaucourt-sur-Somme,80262_0040_00610,G,610 RUE DU MEILLIER,
381076793,00011,38107679300011,O,1991-01-01,NN,,,2019-11-14T14:01:00,true,3,,,,RUE,DES JONGLEURS,80580,EAUCOURT-SUR-SOMME,,,80262,,,,,,,,,,,,,,,,,,,2008-01-01,A,,,,,01.50Z,NAFRev2,N,1.886034,50.063899,0.94,street,Rue des Jongleurs 80580 Eaucourt-sur-Somme,80262_0036,G,RUE DES JONGLEURS,
388576191,00018,38857619100018,O,1992-08-17,NN,,,2019-11-14T14:01:00,true,3,MAIRIE,,,RUE,11 NOVEMBRE,80580,EAUCOURT-SUR-SOMME,,,80262,,,,,,,,,,,,,,,,,,,2008-01-01,A,,,,,93.12Z,NAFRev2,N,1.88417,50.064943,0.81,street,Rue du 11 Novembre 80580 Eaucourt-sur-Somme,80262_0065,G,RUE DU 11 NOVEMBRE,
393745690,00031,39374569000031,O,2006-10-16,,,,2021-02-23T11:19:29,true,2,,200,,RUE,DU MELLIER,80580,EAUCOURT-SUR-SOMME,,,80262,,,,,,,,,,,,,,,,,,,2008-01-01,A,,,,,68.20B,NAFRev2,N,1.885507,50.063008,0.86,housenumber,200 Rue du Meillier 80580 Eaucourt-sur-Somme,80262_0040_00200,G,200 RUE DU MEILLIER,
394795348,00017,39479534800017,O,1982-10-01,NN,,,2019-11-14T14:01:00,true,3,,230,,RUE,DU MELLIER,80580,EAUCOURT-SUR-SOMME,,,80262,,,,,,,,,,,,,,,,,,,2008-01-01,A,,,,,01.42Z,NAFRev2,N,1.885678,50.062872,0.86,housenumber,230 Rue du Meillier 80580 Eaucourt-sur-Somme,80262_0040_00230,G,230 RUE DU MEILLIER,
399725654,00012,39972565400012,O,1995-01-01,NN,,,2019-11-14T14:01:00,true,3,,64,,RUE,DU MEILLIER,80580,EAUCOURT-SUR-SOMME,,,80262,,,,,,,,,,,,,,,,,,,2008-01-01,A,,,,,01.41Z,NAFRev2,N,1.884205,50.06396,0.95,housenumber,64 Rue du Meillier 80580 Eaucourt-sur-Somme,80262_0040_00064,G,64 RUE DU MEILLIER,
399940147,00016,39994014700016,O,1995-02-01,NN,,,2019-11-14T14:01:00,true,1,,,,RTE,NATIONALE,80580,EAUCOURT-SUR-SOMME,,,80262,,,,,,,,,,,,,,,,,,,1999-03-31,F,,,,,55.4A,NAF1993,N,1.2279812,49.230352,0.77,poi,Route Nationale (Pont) Saint-Pierre-du-Vauvray,https://osm.org/way/95838375,G,,
412194375,00017,41219437500017,O,1983-11-07,03,2020,,2022-08-29T09:28:56,true,4,MAIRIE,,,,,80580,EAUCOURT-SUR-SOMME,,,80262,,,,,,,,,,,,,,,,,,,2008-01-01,A,,,,,91.03Z,NAFRev2,O,1.886314,50.066622,0.38,street,Rue du 8 Mai 80580 Eaucourt-sur-Somme,80262_0034,D,RUE DU 8 MAI,
414991513,00014,41499151300014,O,1998-01-03,NN,,,2019-11-14T14:01:00,true,3,,610,,RUE,DU MEILLIER,80580,EAUCOURT-SUR-SOMME,,,80262,,,,,,,,,,,,,,,,,,,2008-01-01,A,,,,,68.20A,NAFRev2,N,1.8871,50.06003,0.95,housenumber,610 Rue du Meillier 80580 Eaucourt-sur-Somme,80262_0040_00610,G,610 RUE DU MEILLIER,
418086641,00036,41808664100036,O,2013-07-01,,,,2021-04-13T19:41:17,true,2,,650,,RUE,DU MEILLIER,80580,EAUCOURT-SUR-SOMME,,,80262,,,,,,,,,,,,,,,,,,,2017-10-23,A,,,,,47.81Z,NAFRev2,N,1.887528,50.059794,0.95,housenumber,650 Rue du Meillier 80580 Eaucourt-sur-Somme,80262_0040_00650,G,650 RUE DU MEILLIER,
422369553,00017,42236955300017,O,1999-04-01,NN,,,2019-11-14T14:01:00,true,1,,,,RTE,NATIONALE,80580,EAUCOURT-SUR-SOMME,,,80262,,,,,,,,,,,,,,,,,,,2001-02-15,F,,,,,55.4B,NAF1993,N,1.2279812,49.230352,0.77,poi,Route Nationale (Pont) Saint-Pierre-du-Vauvray,https://osm.org/way/95838375,G,,
429116981,00011,42911698100011,O,1969-01-01,NN,,,2019-11-14T14:01:00,true,3,,64,,RUE,DU MEILLIER,80580,EAUCOURT-SUR-SOMME,,,80262,,,,,,,,,,,,,,,,,,,2008-01-01,A,,,,,01.11Z,NAFRev2,N,1.884205,50.06396,0.95,housenumber,64 Rue du Meillier 80580 Eaucourt-sur-Somme,80262_0040_00064,G,64 RUE DU MEILLIER,
429274459,00016,42927445900016,O,1982-01-01,NN,,,2019-11-14T14:01:00,true,1,,,,RUE,DU VAL DE SOMME,80580,EAUCOURT-SUR-SOMME,,,80262,,,,,,,,,,,,,,,,,,,2000-11-16,F,,,,,93.0N,NAF1993,N,1.884749,50.065602,0.82,street,Route du Val de Somme 80580 Eaucourt-sur-Somme,80262_0104,G,ROUTE DU VAL DE SOMME,
433578044,00029,43357804400029,O,2008-06-30,,,,2021-02-23T13:15:09,true,1,,650,,RUE,DU VAL DE SOMME,80580,EAUCOURT-SUR-SOMME,,,80262,,,,,,,,,,,,,,,,,,,2008-06-30,A,,,,,01.50Z,NAFRev2,N,1.887091,50.064342,0.84,housenumber,650 Route du Val de Somme 80580 Eaucourt-sur-Somme,80262_0104_00650,G,650 ROUTE DU VAL DE SOMME,
435132295,00013,43513229500013,O,2001-02-15,NN,,,2019-11-14T14:01:00,true,1,,,,RTE,NATIONALE,80580,EAUCOURT-SUR-SOMME,,,80262,,,,,,,,,,,,,,,,,,,2002-12-15,F,,,,,55.4A,NAF1993,N,1.2279812,49.230352,0.77,poi,Route Nationale (Pont) Saint-Pierre-du-Vauvray,https://osm.org/way/95838375,G,,
437554009,00021,43755400900021,O,2003-10-01,NN,,,2019-11-14T14:01:00,false,4,,430,,RUE,DU VAL DE SOMME,80580,EAUCOURT-SUR-SOMME,,,80262,,,,,,,,,,,,,,,,,,,2006-07-31,F,,,,,55.4B,NAFRev1,N,1.884749,50.065602,0.84,housenumber,430 Route du Val de Somme 80580 Eaucourt-sur-Somme,80262_0104_00430,G,430 ROUTE DU VAL DE SOMME,
438012254,00019,43801225400019,O,2001-01-01,NN,,,2019-11-14T14:01:00,true,5,,415,,RUE,DU MEILLIER,80580,EAUCOURT-SUR-SOMME,,,80262,,,,,,,,,,,,,,,,,,,2012-09-09,A,,,,,90.01Z,NAFRev2,O,1.887346,50.061629,0.95,housenumber,415 Rue du Meillier 80580 Eaucourt-sur-Somme,80262_0040_00415,G,415 RUE DU MEILLIER,
444791503,00014,44479150300014,O,2002-12-16,,,,2019-11-14T14:01:00,true,3,,430,,RUE,DU VAL DE SOMME,80580,EAUCOURT-SUR-SOMME,,,80262,,,,,,,,,,,,,,,,,,,2003-10-01,F,,,,,55.4A,NAFRev1,,1.884749,50.065602,0.84,housenumber,430 Route du Val de Somme 80580 Eaucourt-sur-Somme,80262_0104_00430,G,430 ROUTE DU VAL DE SOMME,
453118812,00016,45311881200016,O,2004-03-19,NN,,,2019-11-14T14:01:00,true,3,,415,,RUE,DU MEILLIER,80580,EAUCOURT-SUR-SOMME,,,80262,,,,,,,,,,,,,,,,,,,2008-01-01,A,,,,,68.20A,NAFRev2,N,1.887346,50.061629,0.95,housenumber,415 Rue du Meillier 80580 Eaucourt-sur-Somme,80262_0040_00415,G,415 RUE DU MEILLIER,
482511771,00024,48251177100024,O,2006-07-21,,,,2019-11-14T14:01:00,false,2,ZD 161,,,RUE,DU 8 MAI 1945,80580,EAUCOURT-SUR-SOMME,,,80262,,,,,,,,,,,,,,,,,,,2008-01-01,A,,,,,35.11Z,NAFRev2,N,1.886314,50.066622,0.72,street,Rue du 8 Mai 80580 Eaucourt-sur-Somme,80262_0034,G,RUE DU 8 MAI,
483115044,00024,48311504400024,O,2010-02-01,,,,2019-11-14T14:01:00,true,2,,430,,RTE,DU VAL DE SOMME,80580,EAUCOURT-SUR-SOMME,,,80262,,,,,,,,,,,,,,,,,,,2011-01-12,F,,,,,53.20Z,NAFRev2,N,1.884749,50.065602,0.88,housenumber,430 Route du Val de Somme 80580 Eaucourt-sur-Somme,80262_0104_00430,G,430 ROUTE DU VAL DE SOMME,
495173700,00016,49517370000016,O,2007-03-20,,,,2021-11-26T14:30:15,true,3,,430,,RUE,DU VAL DE SOMME,80580,EAUCOURT-SUR-SOMME,,,80262,,,,,,,,,,,,,,,,,,,2021-11-25,F,,,,,68.20B,NAFRev2,N,1.884749,50.065602,0.84,housenumber,430 Route du Val de Somme 80580 Eaucourt-sur-Somme,80262_0104_00430,G,430 ROUTE DU VAL DE SOMME,
498432467,00021,49843246700021,O,2009-04-01,,,,2019-11-14T14:01:00,true,2,,,,,RUE DU PONT,80580,EAUCOURT-SUR-SOMME,,,80262,,,,,,,,,,,,,,,,,,,2014-06-10,F,,,,,96.09Z,NAFRev2,N,1.882545,50.063526,0.94,street,Rue du Pont 80580 Eaucourt-sur-Somme,80262_0024,G,RUE DU PONT,
499120624,00014,49912062400014,O,2007-07-14,,,,2019-11-14T14:01:00,true,3,,430,,RUE,DU VAL DE SOMME,80580,EAUCOURT-SUR-SOMME,,,80262,,,,,,,,,,,,,,,,,,,2008-08-31,F,LE VAL DE SOMME,,,,56.10A,NAFRev2,N,1.884749,50.065602,0.84,housenumber,430 Route du Val de Somme 80580 Eaucourt-sur-Somme,80262_0104_00430,G,430 ROUTE DU VAL DE SOMME,
508553955,00016,50855395500016,O,2008-10-08,,,,2019-11-14T14:01:00,true,3,,585,,RES,DE LA FERME DE COUPIGNY,80580,EAUCOURT-SUR-SOMME,,,80262,,,,,,,,,,,,,,,,,,,2010-01-01,A,,,,,90.03A,NAFRev2,N,1.888287,50.065432,0.94,housenumber,585 Res de la Ferme de Coupigny 80580 Eaucourt-sur-Somme,80262_a001_00585,G,585 RES DE LA FERME DE COUPIGNY,
512185349,00028,51218534900028,O,2011-07-29,,,,2019-11-14T14:01:00,false,2,,430,,RTE,DU VAL DE  SOMME,80580,EAUCOURT-SUR-SOMME,,,80262,,,,,,,,,,,,,,,,,,,2011-10-31,F,LE VAL DE SOMME,,,,56.30Z,NAFRev2,N,1.884749,50.065602,0.88,housenumber,430 Route du Val de Somme 80580 Eaucourt-sur-Somme,80262_0104_00430,G,430 ROUTE DU VAL DE SOMME,
512193434,00036,51219343400036,O,2015-06-23,,,5610CR,2022-04-25T19:35:24,false,2,,650,,RUE,DU MEILLIER,80580,EAUCOURT-SUR-SOMME,,,80262,,,,,,,,,,,,,,,,,,,2022-03-26,F,,,,,93.21Z,NAFRev2,N,1.887528,50.059794,0.95,housenumber,650 Rue du Meillier 80580 Eaucourt-sur-Somme,80262_0040_00650,G,650 RUE DU MEILLIER,
512977984,00016,51297798400016,O,1987-07-30,,,,2019-11-14T14:01:00,true,1,ECOLE PRIMAIRE PUBLIQUE,46,,RUE,DE LA FONTAINE,80580,EAUCOURT-SUR-SOMME,,,80262,,,,,,,,,,,,,,,,,,,1987-07-30,A,,,,,93.12Z,NAFRev2,N,1.883176,50.064563,0.94,housenumber,46 Rue de la Fontaine 80580 Eaucourt-sur-Somme,80262_0032_00046,G,46 RUE DE LA FONTAINE,
517408480,00013,51740848000013,O,2009-10-01,,,,2019-11-14T14:01:00,false,2,,487,,,RESIDENCE DE LA FERME DE COUPIGN,80580,EAUCOURT-SUR-SOMME,,,80262,,,,,,,,,,,,,,,,,,,2019-05-31,F,,,,,62.09Z,NAFRev2,N,1.88831,50.066359,0.75,housenumber,487 Res de la Ferme de Coupigny 80580 Eaucourt-sur-Somme,80262_a001_00487,G,487 RES DE LA FERME DE COUPIGNY,
518928387,00019,51892838700019,O,2009-12-04,,,,2019-11-14T14:01:00,true,2,,40,,RUE,DU 11 NOVEMBRE,80580,EAUCOURT-SUR-SOMME,,,80262,,,,,,,,,,,,,,,,,,,2011-10-01,F,,,,,66.19B,NAFRev2,N,1.883774,50.064486,0.94,housenumber,40 Rue du 11 Novembre 80580 Eaucourt-sur-Somme,80262_0065_00040,G,40 RUE DU 11 NOVEMBRE,
519069298,00023,51906929800023,O,2013-01-01,,,,2021-02-23T15:31:04,true,1,APPARTEMENT 1,430,,RTE,DU VAL DE SOMME,80580,EAUCOURT-SUR-SOMME,,,80262,,,,,,,,,,,,,,,,,,,2013-01-01,A,,,,,38.32Z,NAFRev2,N,1.884749,50.065602,0.88,housenumber,430 Route du Val de Somme 80580 Eaucourt-sur-Somme,80262_0104_00430,G,430 ROUTE DU VAL DE SOMME,
528205206,00022,52820520600022,P,2019-07-06,,,,2021-02-23T15:44:44,false,1,[ND],[ND],[ND],[ND],[ND],[ND],EAUCOURT-SUR-SOMME,,[ND],80262,[ND],[ND],,,[ND],[ND],[ND],[ND],[ND],[ND],,,[ND],,[ND],[ND],,,2019-07-06,A,[ND],[ND],[ND],[ND],01.49Z,NAFRev2,N,,,0,,,,,,
530580323,00018,53058032300018,O,2011-03-19,NN,,1085ZZ,2021-10-27T08:37:50,false,4,,,,,LIEUDIT DU MOULIN,80580,EAUCOURT-SUR-SOMME,,,80262,,,,,,,,,,,,,,,,,,,2019-11-14,F,AUBERGE DU MOULIN D'EAUCOURT,,,,56.10A,NAFRev2,N,1.887551,50.071299,0.73,locality,Au Moulin d’Eaucourt 80580 Eaucourt-sur-Somme,80262_B015,G,AU MOULIN D EAUCOURT,
533127882,00025,53312788200025,O,2020-09-14,,,5610CR,2021-02-23T15:53:41,true,1,,1150,,RUE,DU PONT,80580,EAUCOURT-SUR-SOMME,,,80262,,,,,,,,,,,,,,,,,,,2020-09-14,A,PIZZA JEJE,,,,56.10C,NAFRev2,N,1.881762,50.056268,0.94,housenumber,1150 Rue du Pont 80580 Eaucourt-sur-Somme,80262_0024_01150,G,1150 RUE DU PONT,
751292145,00016,75129214500016,O,2012-04-30,,,,2019-11-14T14:01:00,true,1,,230,,RUE,DU MEILLIER,80580,EAUCOURT-SUR-SOMME,,,80262,,,,,,,,,,,,,,,,,,,2012-04-30,A,,,,,43.39Z,NAFRev2,N,1.885678,50.062872,0.95,housenumber,230 Rue du Meillier 80580 Eaucourt-sur-Somme,80262_0040_00230,G,230 RUE DU MEILLIER,
753237080,00027,75323708000027,O,2013-01-01,,,,2019-11-14T14:01:00,false,2,APPARTEMENT 2,430,,RTE,DU VAL DE SOMME,80580,EAUCOURT-SUR-SOMME,,,80262,,,,,,,,,,,,,,,,,,,2014-10-13,F,,,,,38.32Z,NAFRev2,N,1.884749,50.065602,0.88,housenumber,430 Route du Val de Somme 80580 Eaucourt-sur-Somme,80262_0104_00430,G,430 ROUTE DU VAL DE SOMME,
753459197,00020,75345919700020,O,2020-08-26,,,,2021-02-23T16:10:34,true,1,,690,,RUE,DU MELLIER,80580,EAUCOURT-SUR-SOMME,,,80262,,,,,,,,,,,,,,,,,,,2020-08-26,A,,,,,90.03A,NAFRev2,N,1.887977,50.059584,0.86,housenumber,690 Rue du Meillier 80580 Eaucourt-sur-Somme,80262_0040_00690,G,690 RUE DU MEILLIER,
780633145,00013,78063314500013,O,1900-01-01,NN,,,2019-11-14T14:01:00,true,3,,,,,,80580,EAUCOURT-SUR-SOMME,,,80262,,,,,,,,,,,,,,,,,,,2008-01-01,A,,,,,93.12Z,NAFRev2,N,,,0,,,,,,
780633152,00019,78063315200019,O,,,,,2019-11-14T14:01:00,true,1,,,,RUE,DES JONGLEURS,80580,EAUCOURT-SUR-SOMME,,,80262,,,,,,,,,,,,,,,,,,,1984-12-25,F,,,,,55.60,NAP,N,1.886034,50.063899,0.94,street,Rue des Jongleurs 80580 Eaucourt-sur-Somme,80262_0036,G,RUE DES JONGLEURS,
780633160,00012,78063316000012,O,,,,,2019-11-14T14:01:00,true,1,,,,RUE,DU MEILLIER,80580,EAUCOURT-SUR-SOMME,,,80262,,,,,,,,,,,,,,,,,,,1984-12-25,F,,,,,55.71,NAP,N,1.886929,50.061985,0.95,street,Rue du Meillier 80580 Eaucourt-sur-Somme,80262_0040,G,RUE DU MEILLIER,
780633178,00014,78063317800014,O,,NN,,,2019-11-14T14:01:00,true,1,,,,RUE,JONGLEURS,80580,EAUCOURT-SUR-SOMME,,,80262,,,,,,,,,,,,,,,,,,,,F,,,,,55.72,NAP,N,1.886034,50.063899,0.87,street,Rue des Jongleurs 80580 Eaucourt-sur-Somme,80262_0036,G,RUE DES JONGLEURS,
780633186,00017,78063318600017,O,,,,,2019-11-14T14:01:00,true,1,,,,RTE,NATIONALE,80580,EAUCOURT-SUR-SOMME,,,80262,,,,,,,,,,,,,,,,,,,1992-04-30,F,,,,,67.2Z,NAF1993,N,1.2279812,49.230352,0.77,poi,Route Nationale (Pont) Saint-Pierre-du-Vauvray,https://osm.org/way/95838375,G,,
788766954,00036,78876695400036,O,2018-05-04,,,,2020-10-19T09:13:10,false,2,,430,,RTE,DU VAL DE SOMME,80580,EAUCOURT-SUR-SOMME,,,80262,,,,,,,,,,,,,,,,,,,2020-09-24,F,,,,,45.11Z,NAFRev2,N,1.884749,50.065602,0.88,housenumber,430 Route du Val de Somme 80580 Eaucourt-sur-Somme,80262_0104_00430,G,430 ROUTE DU VAL DE SOMME,
793083387,00019,79308338700019,O,2013-04-10,,,5610CQ,2019-11-14T14:01:00,true,3,,430,,RUE,DU VAL DE SOMME,80580,EAUCOURT-SUR-SOMME,,,80262,,,,,,,,,,,,,,,,,,,2015-01-09,A,LE MIX,,,,56.30Z,NAFRev2,N,1.884749,50.065602,0.84,housenumber,430 Route du Val de Somme 80580 Eaucourt-sur-Somme,80262_0104_00430,G,430 ROUTE DU VAL DE SOMME,
795207042,00016,79520704200016,O,2013-08-01,NN,,,2019-11-14T14:01:00,false,2,,215,,RUE,DU PONT,80580,EAUCOURT-SUR-SOMME,,,80262,,,,,,,,,,,,,,,,,,,2013-10-20,F,LES VIEUX MURIERS,,,LES VIEUX MURIERS,56.10A,NAFRev2,N,1.881884,50.062766,0.94,housenumber,215 Rue du Pont 80580 Eaucourt-sur-Somme,80262_0024_00215,G,215 RUE DU PONT,
803026798,00014,80302679800014,O,2012-03-02,,,,2019-11-14T14:01:00,true,1,,500,,,ROUTE DU VAL DE SOMME,80580,EAUCOURT-SUR-SOMME,,,80262,,,,,,,,,,,,,,,,,,,2012-03-02,A,,,,,94.99Z,NAFRev2,N,1.885669,50.065231,0.95,housenumber,500 Route du Val de Somme 80580 Eaucourt-sur-Somme,80262_0104_00500,G,500 ROUTE DU VAL DE SOMME,
810595819,00014,81059581900014,O,2015-04-01,,,,2019-11-14T14:01:00,true,2,,170,,RUE,DU VAL DE SOMME,80580,EAUCOURT-SUR-SOMME,,,80262,,,,,,,,,,,,,,,,,,,2016-04-01,F,,,,,47.78B,NAFRev2,N,1.881849,50.066982,0.84,housenumber,170 Route du Val de Somme 80580 Eaucourt-sur-Somme,80262_0104_00170,G,170 ROUTE DU VAL DE SOMME,
810903484,00022,81090348400022,O,2015-09-10,,,,2019-11-14T14:01:00,true,2,RESIDENCE FERME DE COUPIGNY,570,,RUE,DU 8 MAI,80580,EAUCOURT-SUR-SOMME,,,80262,,,,,,,,,,,,,,,,,,,2015-11-30,F,,,,,86.90F,NAFRev2,N,1.886314,50.066622,0.75,street,Rue du 8 Mai 80580 Eaucourt-sur-Somme,80262_0034,G,RUE DU 8 MAI,
811150978,00021,81115097800021,O,2018-02-01,,,8129AZ,2019-11-14T14:01:00,false,2,,690,,RUE,DU MEILLIER,80580,EAUCOURT-SUR-SOMME,,,80262,,,,,,,,,,,,,,,,,,,2019-05-10,F,,,,ARRETE PIC PIC,81.29A,NAFRev2,N,1.887977,50.059584,0.95,housenumber,690 Rue du Meillier 80580 Eaucourt-sur-Somme,80262_0040_00690,G,690 RUE DU MEILLIER,
811922442,00017,81192244200017,O,2015-06-01,,,,2019-11-14T14:01:00,true,1,,487,,RES,DE LA FERME DE COUPIGNY,80580,EAUCOURT-SUR-SOMME,,,80262,,,,,,,,,,,,,,,,,,,2015-06-01,A,,,,,90.03A,NAFRev2,N,1.88831,50.066359,0.94,housenumber,487 Res de la Ferme de Coupigny 80580 Eaucourt-sur-Somme,80262_a001_00487,G,487 RES DE LA FERME DE COUPIGNY,
812280915,00024,81228091500024,O,2019-12-05,00,2020,4329BA,2022-08-29T10:05:01,true,2,,275,,RUE,DU MELLIER,80580,EAUCOURT-SUR-SOMME,,,80262,,,,,,,,,,,,,,,,,,,2020-05-15,A,,,,FD AUTOMATISMES,43.29B,NAFRev2,N,1.886184,50.062555,0.86,housenumber,275 Rue du Meillier 80580 Eaucourt-sur-Somme,80262_0040_00275,G,275 RUE DU MEILLIER,
814517975,00011,81451797500011,O,2015-10-09,,,,2019-11-14T14:01:00,true,1,,150,,RUE,DU VAL DE SOMME,80580,EAUCOURT-SUR-SOMME,,,80262,,,,,,,,,,,,,,,,,,,2015-10-09,A,,,,,68.20B,NAFRev2,N,1.881582,50.06693,0.84,housenumber,150 Route du Val de Somme 80580 Eaucourt-sur-Somme,80262_0104_00150,G,150 ROUTE DU VAL DE SOMME,
814818316,00014,81481831600014,O,2015-11-09,,,,2019-11-14T14:01:00,true,1,,150,,RTE,DU VAL DE SOMME,80580,EAUCOURT-SUR-SOMME,,,80262,,,,,,,,,,,,,,,,,,,2015-11-09,A,,,,,68.20B,NAFRev2,N,1.881582,50.06693,0.88,housenumber,150 Route du Val de Somme 80580 Eaucourt-sur-Somme,80262_0104_00150,G,150 ROUTE DU VAL DE SOMME,
819671355,00017,81967135500017,O,2016-03-01,01,2020,,2022-08-29T10:10:32,true,1,,820,,RUE,DU MEILLIER,80580,EAUCOURT-SUR-SOMME,,,80262,,,,,,,,,,,,,,,,,,,2016-03-01,A,,,,,01.50Z,NAFRev2,N,1.889284,50.05905,0.95,housenumber,820 Rue du Meillier 80580 Eaucourt-sur-Somme,80262_0040_00820,G,820 RUE DU MEILLIER,
819826819,00016,81982681900016,O,2016-04-19,,,,2019-11-14T14:01:00,true,1,,610,,RUE,DU MEILLIER,80580,EAUCOURT-SUR-SOMME,,,80262,,,,,,,,,,,,,,,,,,,2016-04-19,A,,,,,90.03A,NAFRev2,N,1.8871,50.06003,0.95,housenumber,610 Rue du Meillier 80580 Eaucourt-sur-Somme,80262_0040_00610,G,610 RUE DU MEILLIER,
821751898,00015,82175189800015,O,2016-08-15,00,2020,4312AZ,2022-08-29T10:12:38,false,3,,170,,RTE,DU VAL DE SOMME,80580,EAUCOURT-SUR-SOMME,,,80262,,,,,,,,,,,,,,,,,,,2020-11-01,F,EURL JULES,,,EURL JULES,43.12A,NAFRev2,O,1.881849,50.066982,0.88,housenumber,170 Route du Val de Somme 80580 Eaucourt-sur-Somme,80262_0104_00170,G,170 ROUTE DU VAL DE SOMME,
821751898,00023,82175189800023,O,2020-11-01,11,2020,4312AZ,2022-08-29T10:12:38,true,1,,660,,RUE,DU 8 MAI 1945,80580,EAUCOURT-SUR-SOMME,,,80262,,,,,,,,,,,,,,,,,,,2020-11-01,A,EURL JULES,,,EURL JULES,43.12A,NAFRev2,O,-0.5013015,47.4615876,0.9,poi,Rue du 8 Mai 1945 (Pont) Saint-Barthélemy-d'Anjou,https://osm.org/way/47353438,G,,