siren,nic,siret,statutDiffusionEtablissement,dateCreationEtablissement,trancheEffectifsEtablissement,anneeEffectifsEtablissement,activitePrincipaleRegistreMetiersEtablissement,dateDernierTraitementEtablissement,etablissementSiege,nombrePeriodesEtablissement,complementAdresseEtablissement,numeroVoieEtablissement,indiceRepetitionEtablissement,typeVoieEtablissement,libelleVoieEtablissement,codePostalEtablissement,libelleCommuneEtablissement,libelleCommuneEtrangerEtablissement,distributionSpecialeEtablissement,codeCommuneEtablissement,codeCedexEtablissement,libelleCedexEtablissement,codePaysEtrangerEtablissement,libellePaysEtrangerEtablissement,complementAdresse2Etablissement,numeroVoie2Etablissement,indiceRepetition2Etablissement,typeVoie2Etablissement,libelleVoie2Etablissement,codePostal2Etablissement,libelleCommune2Etablissement,libelleCommuneEtranger2Etablissement,distributionSpeciale2Etablissement,codeCommune2Etablissement,codeCedex2Etablissement,libelleCedex2Etablissement,codePaysEtranger2Etablissement,libellePaysEtranger2Etablissement,dateDebut,etatAdministratifEtablissement,enseigne1Etablissement,enseigne2Etablissement,enseigne3Etablissement,denominationUsuelleEtablissement,activitePrincipaleEtablissement,nomenclatureActivitePrincipaleEtablissement,caractereEmployeurEtablissement,longitude,latitude,geo_score,geo_type,geo_adresse,geo_id,geo_ligne,geo_l4,geo_l5
086310281,00018,08631028100018,O,,,,,,true,1,,,,,,81150,FLORENTIN,,,81093,,,,,,,,,,,,,,,,,,,1984-12-25,F,,,,,62.11,NAP,N,,,0,,,,,,
087012167,00018,08701216700018,O,1970-01-01,NN,,,2012-11-09T00:11:08,true,5,LIEU DIT ROQUES,,,,,81150,FLORENTIN,,,81093,,,,,,,,,,,,,,,,,,,2010-08-29,F,,,,,56.21Z,NAFRev2,N,,,0,,,,,,
218100931,00011,21810093100011,O,1983-03-01,NN,,,2018-09-29T12:06:42,true,4,,,,,LE BOURG,81150,FLORENTIN,,,81093,,,,,,,,,,,,,,,,,,,2008-01-01,A,MAIRIE,,,,84.11Z,NAFRev2,O,2.026811,43.898811,0.31,street,Chemin de Bosc Crémat 81150 Florentin,81093_0008,G,CHEMIN DE BOSC CREMAT,
218100931,00029,21810093100029,O,1983-12-21,02,2020,,2022-08-29T09:09:11,false,3,,,,,BOURG,81150,FLORENTIN,,,81093,,,,,,,,,,,,,,,,,,,2008-01-01,A,ECOLE PRIMAIRE PUBLIQUE,,,,85.20Z,NAFRev2,N,-1.229143,44.2011043,0.89,poi.school,École du bourg Mimizan,https://osm.org/way/35215942,G,,
218100931,00037,21810093100037,O,1996-12-25,NN,,,2020-06-25T16:45:17,false,3,MAIRIE,,,,LE BOURG,81150,FLORENTIN,,,81093,,,,,,,,,,,,,,,,,,,2019-12-31,F,SERVICE D'ASSAINISSEMENT,,,,37.00Z,NAFRev2,N,2.026811,43.898811,0.31,street,Chemin de Bosc Crémat 81150 Florentin,81093_0008,G,CHEMIN DE BOSC CREMAT,
258100080,00039,25810008000039,O,2003-09-29,NN,,,2010-08-26T04:53:39,false,4,MAIRIE,,,,LE BOURG,81150,FLORENTIN,,,81093,,,,,,,,,,,,,,,,,,,2008-10-10,F,,,,,38.11Z,NAFRev2,N,2.026811,43.898811,0.31,street,Chemin de Bosc Crémat 81150 Florentin,81093_0008,G,CHEMIN DE BOSC CREMAT,
268102142,00018,26810214200018,O,1984-11-20,NN,,,2017-08-06T14:19:12,true,5,MAIRIE,,,,LE BOURG,81150,FLORENTIN,,,81093,,,,,,,,,,,,,,,,,,,2017-08-01,F,,,,,88.99B,NAFRev2,N,2.026811,43.898811,0.31,street,Chemin de Bosc Crémat 81150 Florentin,81093_0008,G,CHEMIN DE BOSC CREMAT,
298101007,00011,29810100700011,O,1983-09-14,NN,,,2021-02-03T15:56:50,true,4,MAIRIE,,,,LE BOURG,81150,FLORENTIN,,,81093,,,,,,,,,,,,,,,,,,,2016-01-20,F,,,,,42.99Z,NAFRev2,N,2.026811,43.898811,0.31,street,Chemin de Bosc Crémat 81150 Florentin,81093_0008,G,CHEMIN DE BOSC CREMAT,
298101551,00018,29810155100018,O,1984-10-24,NN,,,2008-01-04T19:08:05,true,4,MAIRIE,,,,LE BOURG,81150,FLORENTIN,,,81093,,,,,,,,,,,,,,,,,,,2008-01-01,A,,,,,42.99Z,NAFRev2,N,2.026811,43.898811,0.31,street,Chemin de Bosc Crémat 81150 Florentin,81093_0008,G,CHEMIN DE BOSC CREMAT,
306189721,00013,30618972100013,O,,,,,2006-11-25T09:20:22,true,1,,,,,MAIRIE,81150,FLORENTIN,,,81093,,,,,,,,,,,,,,,,,,,,F,,,,,67.12,NAP,N,2.033488,43.887413,0.92,street,Place de la Mairie 81150 Florentin,81093_0045,G,PLACE DE LA MAIRIE,
306279092,00044,30627909200044,O,1995-10-01,NN,,,,false,4,,,,,DOUARRE,81150,FLORENTIN,,,81093,,,,,,,,,,,,,,,,,,,1999-06-01,F,,,,,85.2Z,NAF1993,N,-4.0723065,47.9802073,0.77,poi.bus_stop,Ty Douar (Arrêt de bus) Quimper,https://osm.org/node/1112385013,G,,
308992387,00016,30899238700016,O,1900-01-01,NN,,,2008-11-05T05:32:02,true,4,,,,LD,ST SALVY,81150,FLORENTIN,,,81093,,,,,,,,,,,,,,,,,,,2008-09-30,F,,,,,86.90D,NAFRev2,N,2.03632,43.886569,0.72,street,Chemin de Saint-Salvy 81150 Florentin,81093_0125,G,CHEMIN DE SAINT SALVY,
311601967,00020,31160196700020,O,1994-07-01,NN,,,2008-01-04T20:08:48,false,3,,,,,GAUCHINE,81150,FLORENTIN,,,81093,,,,,,,,,,,,,,,,,,,2008-01-01,A,,,,,68.20B,NAFRev2,N,2.016732,43.895879,0.3,street,Chemin de la Garenne 81150 Florentin,81093_0029,G,CHEMIN DE LA GARENNE,
312207251,00017,31220725100017,O,,NN,,,2007-01-18T09:12:29,true,1,,,,,CHATEAU LABASTIDIE-BLANCHE,81150,FLORENTIN,,,81093,,,,,,,,,,,,,,,,,,,1987-05-15,F,,,,,01.17,NAP,N,2.040709,43.895418,0.42,street,Route de Labastidié 81150 Florentin,81093_0032,G,ROUTE DE LABASTIDIE,
312256837,00013,31225683700013,O,1900-01-01,,,,2007-01-18T09:12:30,true,3,,,,,,81150,FLORENTIN,,,81093,,,,,,,,,,,,,,,,,,,1994-12-25,F,,,,,01.1G,NAF1993,N,,,0,,,,,,
313398083,00011,31339808300011,O,,NN,,,,true,1,,,,,,81150,FLORENTIN,,,81093,,,,,,,,,,,,,,,,,,,1996-07-31,F,,,,,45.2V,NAF1993,O,,,0,,,,,,
314283557,00010,31428355700010,O,1978-01-01,NN,,,2008-01-04T20:28:29,true,3,,,,,METAIRIE DU BOIS,81150,FLORENTIN,,,81093,,,,,,,,,,,,,,,,,,,2008-01-01,A,,,,,01.11Z,NAFRev2,N,2.033488,43.887413,0.36,street,Place de la Mairie 81150 Florentin,81093_0045,G,PLACE DE LA MAIRIE,
314571134,00019,31457113400019,O,,NN,,,,true,1,,,,,,81150,FLORENTIN,,,81093,,,,,,,,,,,,,,,,,,,1990-06-30,F,,,,,01.17,NAP,N,,,0,,,,,,
316861616,00027,31686161600027,O,,NN,,,,true,1,,,,LD,PRAT PETEAU,81150,FLORENTIN,,,81093,,,,,,,,,,,,,,,,,,,1996-06-30,F,,,,,74.1A,NAF1993,N,2.00684,43.880708,0.92,street,Chemin de Prat Péteau 81150 Florentin,81093_0095,G,CHEMIN DE PRAT PETEAU,
316861699,00015,31686169900015,O,1979-01-01,,,,,true,3,,,,,,81150,FLORENTIN,,,81093,,,,,,,,,,,,,,,,,,,1997-01-04,F,,,,,55.4B,NAF1993,N,,,0,,,,,,
316912948,00015,31691294800015,O,2004-01-16,NN,,,2013-02-26T08:46:00,true,5,INTERNAT MEDIATION CONSULT,,,,LAUDUGARIE,81150,FLORENTIN,,,81093,,,,,,,,,,,,,,,,,,,2012-12-31,F,,,,,70.22Z,NAFRev2,N,2.02529,43.873624,0.92,street,Route de Laudugarié 81150 Florentin,81093_0039,G,ROUTE DE LAUDUGARIE,
317753580,00016,31775358000016,O,1980-01-01,NN,,,,true,1,,,,LD,PRAT DEL VERDIER,81150,FLORENTIN,,,81093,,,,,,,,,,,,,,,,,,,1999-05-31,F,,,,,45.1A,NAF1993,N,2.030037,43.889007,0.93,street,Chemin de Prat Del Verdier 81150 Florentin,81093_0090,G,CHEMIN DE PRAT DEL VERDIER,
320897929,00057,32089792900057,O,2004-04-01,,,,2014-07-08T00:24:50,true,4,,,,LD,MAGUELONNE,81150,FLORENTIN,,,81093,,,,,,,,,,,,,,,,,,,2009-12-31,F,,,,,93.29Z,NAFRev2,N,2.041959,43.872728,0.92,street,Chemin de Maguelonne 81150 Florentin,81093_0042,G,CHEMIN DE MAGUELONNE,
322074196,00013,32207419600013,O,,,,,,true,1,,,,,LAUDUGARIE,81150,FLORENTIN,,,81093,,,,,,,,,,,,,,,,,,,1985-12-25,F,,,,,62.45,NAP,N,2.02529,43.873624,0.92,street,Route de Laudugarié 81150 Florentin,81093_0039,G,ROUTE DE LAUDUGARIE,
325939296,00027,32593929600027,O,,NN,,,,true,1,,,,,,81150,FLORENTIN,,,81093,,,,,,,,,,,,,,,,,,,1989-08-31,F,,,,,64.49,NAP,N,,,0,,,,,,
326898632,00046,32689863200046,O,,NN,,,,true,1,,,,,LA PELISSERIE BASSE,81150,FLORENTIN,,,81093,,,,,,,,,,,,,,,,,,,1995-09-12,F,,,,,64.1C,NAF1993,N,,,0,,,,,,
327068094,00017,32706809400017,O,1983-04-12,NN,,,2008-01-04T19:23:50,true,3,,,,,,81150,FLORENTIN,,,81093,,,,,,,,,,,,,,,,,,,2008-01-01,A,,,,,68.20B,NAFRev2,N,,,0,,,,,,
331876862,00011,33187686200011,O,,NN,,,,true,1,,,,,GAUCHINE,81150,FLORENTIN,,,81093,,,,,,,,,,,,,,,,,,,1994-01-29,F,,,,,74.1J,NAF1993,N,2.016732,43.895879,0.3,street,Chemin de la Garenne 81150 Florentin,81093_0029,G,CHEMIN DE LA GARENNE,
334144805,00028,33414480500028,O,1987-09-01,NN,,,2017-01-03T16:33:49,true,4,,,,LD,ROSIES,81150,FLORENTIN,,,81093,,,,,,,,,,,,,,,,,,,2016-12-31,F,,,,,49.41B,NAFRev2,N,2.01352,43.89706,0.91,street,Chemin de Rosies 81150 Florentin,81093_0120,G,CHEMIN DE ROSIES,
341054195,00019,34105419500019,O,1987-05-04,NN,,,2008-11-07T01:01:30,false,4,,,,LD,LA SAUSSIE,81150,FLORENTIN,,,81093,,,,,,,,,,,,,,,,,,,2001-09-30,F,,,,,45.4J,NAF1993,O,2.038038,43.886686,0.92,street,Impasse de la Saussié 81150 Florentin,81093_sp85ui,G,IMPASSE DE LA SAUSSIE,
343484705,00011,34348470500011,O,1987-12-25,NN,,,2023-02-04T13:22:59,true,3,,,,,PEYSSOU,81150,FLORENTIN,,,81093,,,,,,,,,,,,,,,,,,,2008-01-01,A,,,,,01.41Z,NAFRev2,N,2.040145,43.885045,0.92,street,Chemin de Peyssou 81150 Florentin,81093_0085,G,CHEMIN DE PEYSSOU,
343688065,00014,34368806500014,O,,NN,,,,true,1,,,,,LABASTIDE BLANCHE,81150,FLORENTIN,,,81093,,,,,,,,,,,,,,,,,,,1989-12-31,F,,,,,55.10,NAP,N,-1.0197136,43.4526175,0.75,poi.2,La Tour Carrée (Monument historique) Labastide-Villefranche,https://osm.org/way/72418568,G,,
344247770,00011,34424777000011,O,,NN,,,,true,1,,,,LD,AL BOSC,81150,FLORENTIN,,,81093,,,,,,,,,,,,,,,,,,,1988-09-01,F,,,,,92.6A,NAF1993,N,2.026811,43.898811,0.56,street,Chemin de Bosc Crémat 81150 Florentin,81093_0008,G,CHEMIN DE BOSC CREMAT,
344910237,00017,34491023700017,O,1988-04-29,NN,,,,true,3,,,,LD,AL BOSC,81150,FLORENTIN,,,81093,,,,,,,,,,,,,,,,,,,1998-12-31,F,,,,,92.6A,NAF1993,O,2.026811,43.898811,0.56,street,Chemin de Bosc Crémat 81150 Florentin,81093_0008,G,CHEMIN DE BOSC CREMAT,
347461733,00011,34746173300011,O,1988-07-05,NN,,4399CZ,2017-10-26T19:29:06,true,9,,,,LD,FONLABOUR,81150,FLORENTIN,,,81093,,,,,,,,,,,,,,,,,,,2017-11-01,A,,,,,43.99C,NAFRev2,N,2.1019809,43.9193374,0.88,poi.school,Campus Lycée Agricole de Fonlabour (École) Albi,https://osm.org/way/378459810,G,,
350691135,00015,35069113500015,O,1966-07-01,NN,,,,false,4,,,,,LA PELISSERIE,81150,FLORENTIN,,,81093,,,,,,,,,,,,,,,,,,,1995-12-25,F,,,,,01.1G,NAF1993,N,2.033488,43.887413,0.36,street,Place de la Mairie 81150 Florentin,81093_0045,G,PLACE DE LA MAIRIE,
377749890,00036,37774989000036,O,1996-04-01,NN,,,,true,1,,,,,LE BOSC,81150,FLORENTIN,,,81093,,,,,,,,,,,,,,,,,,,1999-01-15,F,,,,,92.6C,NAF1993,N,3.0325751,43.3501976,0.9,poi.peak,Le Bosc (Pic) Capestang,https://osm.org/node/4102662097,G,,
377905732,00014,37790573200014,O,1990-04-02,NN,,,2008-01-04T21:09:35,true,3,GOLF DU TILBURY,,,ALL,BOSC,81150,FLORENTIN,,,81093,,,,,,,,,,,,,,,,,,,2008-01-01,A,,,,,68.20A,NAFRev2,N,2.026811,43.898811,0.51,street,Chemin de Bosc Crémat 81150 Florentin,81093_0008,G,CHEMIN DE BOSC CREMAT,
378000236,00018,37800023600018,O,1990-04-01,NN,,,2019-11-15T04:11:11,true,3,,,,,LAUDUGARIE,81150,FLORENTIN,,,81093,,,,,,,,,,,,,,,,,,,2008-01-01,A,,,,,01.21Z,NAFRev2,N,2.02529,43.873624,0.92,street,Route de Laudugarié 81150 Florentin,81093_0039,G,ROUTE DE LAUDUGARIE,
378611115,00015,37861111500015,O,1990-06-01,,,,,true,4,LE GOLF DU TILBURY,,,ALL,BOSC,81150,FLORENTIN,,,81093,,,,,,,,,,,,,,,,,,,1993-01-01,F,,,,,55.1A,NAF1993,N,2.026811,43.898811,0.51,street,Chemin de Bosc Crémat 81150 Florentin,81093_0008,G,CHEMIN DE BOSC CREMAT,
378685879,00017,37868587900017,O,1990-07-16,NN,,,,true,1,,,,LD,LABASTIDIE BLANCHE,81150,FLORENTIN,,,81093,,,,,,,,,,,,,,,,,,,2000-12-31,F,,,,,45.1A,NAF1993,N,2.040709,43.895418,0.56,street,Route de Labastidié 81150 Florentin,81093_0032,G,ROUTE DE LABASTIDIE,
379239981,00036,37923998100036,O,2002-07-01,NN,,4399CZ,2019-03-25T08:44:33,false,5,,,,LD,LA SAUSSIE,81150,FLORENTIN,,,81093,,,,,,,,,,,,,,,,,,,2018-12-31,F,,,,,43.99C,NAFRev2,N,2.038038,43.886686,0.92,street,Impasse de la Saussié 81150 Florentin,81093_sp85ui,G,IMPASSE DE LA SAUSSIE,
379239981,00051,37923998100051,O,2019-03-22,,,8121ZZ,2021-02-23T11:07:51,true,1,,257,,RTE,DE MARSSAC,81150,FLORENTIN,,,81093,,,,,,,,,,,,,,,,,,,2019-03-22,A,,,,,81.21Z,NAFRev2,N,2.039322,43.885736,0.85,housenumber,257 Route de Marssac 81150 Florentin,81093_0051_00257,G,257 ROUTE DE MARSSAC,
379786106,00011,37978610600011,O,1990-09-28,02,2020,9511ZZ,2022-08-29T09:06:50,true,4,,,,,GRANDE RUE,81150,FLORENTIN,,,81093,,,,,,,,,,,,,,,,,,,2008-01-01,A,,,,,62.02B,NAFRev2,O,2.6167712,49.8237911,0.9,poi.forest,Grande Rue (Forêt) Cayeux-en-Santerre,https://osm.org/way/42197994,G,,
380050146,00014,38005014600014,O,,NN,,,2006-11-25T11:28:43,true,1,,,,,GRAND RUE,81150,FLORENTIN,,,81093,,,,,,,,,,,,,,,,,,,1992-01-31,F,,,,,72.2Z,NAF1993,N,0.3581999,46.278333,0.89,poi,Grand Rue (Pont) Sommières-du-Clain,https://osm.org/way/42873870,G,,
380050211,00016,38005021100016,O,,NN,,,2006-11-25T11:28:44,true,1,,,,,GRAND RUE,81150,FLORENTIN,,,81093,,,,,,,,,,,,,,,,,,,1991-01-18,F,,,,,29.14,NAP,N,0.3581999,46.278333,0.89,poi,Grand Rue (Pont) Sommières-du-Clain,https://osm.org/way/42873870,G,,
380050302,00013,38005030200013,O,1900-01-01,NN,,,2012-10-10T09:29:56,false,3,,,,,GRAND RUE,81150,FLORENTIN,,,81093,,,,,,,,,,,,,,,,,,,1991-09-30,F,,,,,,,N,0.3581999,46.278333,0.89,poi,Grand Rue (Pont) Sommières-du-Clain,https://osm.org/way/42873870,G,,
380050369,00012,38005036900012,O,,NN,,,2006-11-25T11:28:44,true,1,,,,,GRAND RUE,81150,FLORENTIN,,,81093,,,,,,,,,,,,,,,,,,,1991-09-30,F,,,,,29.14,NAP,N,0.3581999,46.278333,0.89,poi,Grand Rue (Pont) Sommières-du-Clain,https://osm.org/way/42873870,G,,
380318113,00012,38031811300012,O,1990-10-30,NN,,,2022-09-03T13:56:00,true,3,,,,,CHATEAU DE LABASTIDIE,81150,FLORENTIN,,,81093,,,,,,,,,,,,,,,,,,,2008-01-01,A,,,,,68.20B,NAFRev2,N,2.040709,43.895418,0.62,street,Route de Labastidié 81150 Florentin,81093_0032,G,ROUTE DE LABASTIDIE,
380389403,00011,38038940300011,O,1990-10-30,NN,,,,true,4,,,,,CHATEAU DE LABASTIDIE,81150,FLORENTIN,,,81093,,,,,,,,,,,,,,,,,,,2003-08-25,F,,,,,01.1A,NAFRev1,N,2.040709,43.895418,0.62,street,Route de Labastidié 81150 Florentin,81093_0032,G,ROUTE DE LABASTIDIE,
380522235,00015,38052223500015,O,1991-01-02,NN,,,,true,1,,,,,,81150,FLORENTIN,,,81093,,,,,,,,,,,,,,,,,,,1995-03-07,F,,,,,67.1E,NAF1993,N,,,0,,,,,,
385310107,00011,38531010700011,O,1992-04-01,00,2020,,2022-08-29T09:12:15,true,5,,,,,GAUCHINE,81150,FLORENTIN,,,81093,,,,,,,,,,,,,,,,,,,2020-03-21,F,,,,,45.11Z,NAFRev2,O,2.016732,43.895879,0.3,street,Chemin de la Garenne 81150 Florentin,81093_0029,G,CHEMIN DE LA GARENNE,
388185563,00011,38818556300011,O,1992-07-01,NN,,,2008-01-04T23:05:40,true,3,,,,LD,CANTALAUZE,81150,FLORENTIN,,,81093,,,,,,,,,,,,,,,,,,,2008-01-01,A,,,,,01.21Z,NAFRev2,N,1.562075,43.614948,0.88,poi.bus_stop,Cantalauze (Arrêt de bus) Mons,https://osm.org/node/2482937576,G,,
388777609,00024,38877760900024,O,,NN,,,,true,1,,,,,MONTMIRAIL,81150,FLORENTIN,,,81093,,,,,,,,,,,,,,,,,,,1995-05-23,F,,,,,74.4B,NAF1993,N,3.543169,48.8729509,0.9,poi.park,(Parc) Montmirail,https://osm.org/way/333091325,G,,
389559055,00014,38955905500014,O,,,,,,true,1,,,,,CARRE,81150,FLORENTIN,,,81093,,,,,,,,,,,,,,,,,,,1997-12-31,F,,,,,01.1A,NAF1993,N,7.1272717,43.5903349,0.89,poi.fort,Fort-Carré Antibes,https://osm.org/relation/1074429,G,,
390252419,00010,39025241900010,O,1992-01-01,NN,,,,true,1,,,,,,81150,FLORENTIN,,,81093,,,,,,,,,,,,,,,,,,,1999-12-31,F,,,,,01.1A,NAF1993,N,,,0,,,,,,
391213626,00032,39121362600032,O,2014-05-01,,,9524ZZ,2023-01-09T11:01:33,true,3,,4,,CHE,DE SAINT SALVY,81150,FLORENTIN,,,81093,,,,,,,,,,,,,,,,,,,2022-11-03,A,,,,NADECO,95.24Z,NAFRev2,N,2.034745,43.887448,0.86,housenumber,4 Chemin de Saint-Salvy 81150 Florentin,81093_0125_00004,G,4 CHEMIN DE SAINT SALVY,
391712007,00015,39171200700015,O,1993-06-01,NN,,,2018-12-04T09:29:18,true,3,,,,,VILLAGE,81150,FLORENTIN,,,81093,,,,,,,,,,,,,,,,,,,2008-01-01,A,,,,,01.61Z,NAFRev2,N,4.39087,45.4547668,0.89,poi.cafe,Village Café Saint-Étienne,https://osm.org/node/5321738834,G,,
392074514,00010,39207451400010,O,1993-05-01,,,,2017-07-19T09:05:44,true,4,LE GOLF DE FLORENTIN,,,,LE BOSC,81150,FLORENTIN,,,81093,,,,,,,,,,,,,,,,,,,2000-05-16,F,,,,,55.3A,NAF1993,N,3.0325751,43.3501976,0.9,poi.peak,Le Bosc (Pic) Capestang,https://osm.org/node/4102662097,G,,
392309563,00014,39230956300014,O,1993-07-15,,,,2006-11-25T12:11:36,false,3,,,,,LORMIERO NAUTO,81150,FLORENTIN,,,81093,,,,,,,,,,,,,,,,,,,1996-10-01,F,,,,,92.3B,NAF1993,N,,,0,,,,,,
398145557,00060,39814555700060,O,2015-01-01,,,,2021-02-23T11:21:54,true,1,,16,,PL,DE LA MAIRIE,81150,FLORENTIN,,,81093,,,,,,,,,,,,,,,,,,,2015-01-01,A,,,,,86.90E,NAFRev2,N,2.032744,43.887251,0.85,housenumber,16 Place de la Mairie 81150 Florentin,81093_0045_00016,G,16 PLACE DE LA MAIRIE,
398498204,00013,39849820400013,O,1994-07-12,NN,,,2015-05-14T06:48:46,true,5,MR CLAUDE SEGUIER,,,ALL,BOSC,81150,FLORENTIN,,,81093,,,,,,,,,,,,,,,,,,,2012-12-31,A,,,,,93.12Z,NAFRev2,N,2.026811,43.898811,0.51,street,Chemin de Bosc Crémat 81150 Florentin,81093_0008,G,CHEMIN DE BOSC CREMAT,
402249445,00014,40224944500014,O,1995-08-31,NN,,,,true,3,,,,,LA PELISSERIE,81150,FLORENTIN,,,81093,,,,,,,,,,,,,,,,,,,2002-01-31,F,,,,,70.2B,NAF1993,N,2.033488,43.887413,0.36,street,Place de la Mairie 81150 Florentin,81093_0045,G,PLACE DE LA MAIRIE,
402277503,00023,40227750300023,O,2000-07-04,NN,,,2012-08-02T04:57:11,false,4,,,,RTE,DE LAGRAVE,81150,FLORENTIN,,,81093,,,,,,,,,,,,,,,,,,,2012-01-05,F,,,,,46.16Z,NAFRev2,N,2.022614,43.889224,0.82,street,Route de Lagrave 81150 Florentin,81093_0033,G,ROUTE DE LAGRAVE,
403852445,00010,40385244500010,O,1996-01-01,NN,,,2014-07-08T01:36:11,true,4,,,,,TROIS PILIERS,81150,FLORENTIN,,,81093,,,,,,,,,,,,,,,,,,,2011-12-13,F,,,,,45.20A,NAFRev2,N,-0.9262488,46.7942659,0.89,poi.hotel,Les Trois Piliers (Hôtel) Le Boupère,https://osm.org/node/1866368809,G,,
404060592,00015,40406059200015,O,1996-02-01,NN,,,2016-03-23T03:41:34,true,3,,,,,METAIRIE GRANDE,81150,FLORENTIN,,,81093,,,,,,,,,,,,,,,,,,,2008-01-01,A,,,,,01.41Z,NAFRev2,N,-3.0590145,47.5958186,0.83,poi.camp_site,La Grande Métairie 5* (Camping) Carnac,https://osm.org/way/75731840,G,,
404195521,00012,40419552100012,O,1990-11-01,NN,,,,true,1,,,,,FONTLABOUR,81150,FLORENTIN,,,81093,,,,,,,,,,,,,,,,,,,2001-12-31,F,,,,,01.3Z,NAF1993,N,,,0,,,,,,
404222598,00017,40422259800017,O,1996-02-01,NN,,,2008-01-04T20:36:55,true,3,,,,,METAIRIE GRANDE,81150,FLORENTIN,,,81093,,,,,,,,,,,,,,,,,,,2008-01-01,A,,,,,68.20B,NAFRev2,N,-3.0590145,47.5958186,0.83,poi.camp_site,La Grande Métairie 5* (Camping) Carnac,https://osm.org/way/75731840,G,,
404343097,00014,40434309700014,O,1990-01-01,NN,,,2006-10-28T03:20:43,true,3,,,,,GAYRIC,81150,FLORENTIN,,,81093,,,,,,,,,,,,,,,,,,,2004-12-31,F,,,,,01.3Z,NAFRev1,N,,,0,,,,,,
404943730,00014,40494373000014,O,1989-10-01,NN,,,2008-01-04T20:48:09,true,3,,,,,CHATEAU CLAUS,81150,FLORENTIN,,,81093,,,,,,,,,,,,,,,,,,,2008-01-01,A,,,,,01.11Z,NAFRev2,N,2.3267305,44.5284744,0.82,poi.bus_stop,Château du Claux (Arrêt de bus) Firmi,https://osm.org/node/2012494504,G,,
405072109,00011,40507210900011,O,1990-04-01,NN,,,2006-10-28T03:26:06,true,3,AL VERDIER,,,,,81150,FLORENTIN,,,81093,,,,,,,,,,,,,,,,,,,2005-11-22,F,,,,,01.3Z,NAFRev1,N,2.030037,43.889007,0.76,street,Chemin de Prat Del Verdier 81150 Florentin,81093_0090,D,CHEMIN DE PRAT DEL VERDIER,
405072117,00014,40507211700014,O,1961-01-01,NN,,,2008-01-04T20:50:06,true,3,,,,,MAGUELONNE,81150,FLORENTIN,,,81093,,,,,,,,,,,,,,,,,,,2008-01-01,A,,,,,01.50Z,NAFRev2,N,2.041959,43.872728,0.92,street,Chemin de Maguelonne 81150 Florentin,81093_0042,G,CHEMIN DE MAGUELONNE,
405072125,00017,40507212500017,O,1982-01-01,NN,,,,true,4,,,,,MRIE BOIS,81150,FLORENTIN,,,81093,,,,,,,,,,,,,,,,,,,1998-12-31,F,,,,,01.3Z,NAF1993,N,,,0,,,,,,
405072133,00011,40507213300011,O,1982-10-29,NN,,,2008-01-04T20:50:06,true,4,,,,,CASTELVERT,81150,FLORENTIN,,,81093,,,,,,,,,,,,,,,,,,,2008-01-01,A,,,,,68.20B,NAFRev2,N,2.1230829,43.8294301,0.89,poi.aerodrome,ULM Albi / Castelvert (Aérodrome) Lombers,https://osm.org/node/3792268868,G,,
405072141,00014,40507214100014,O,1981-04-28,NN,,,,true,1,,,,,LAS CROUZES,81150,FLORENTIN,,,81093,,,,,,,,,,,,,,,,,,,1998-02-28,F,,,,,01.2A,NAF1993,N,2.003301,43.877963,0.32,street,Chemin de Las Loungos 81150 Florentin,81093_0041,G,CHEMIN DE LAS LOUNGOS,
405072158,00018,40507215800018,O,1989-08-30,NN,,,2021-12-10T15:38:19,true,3,,,,,LE PARADIS,81150,FLORENTIN,,,81093,,,,,,,,,,,,,,,,,,,2008-01-01,A,,,,,01.41Z,NAFRev2,N,-0.8735157,47.0625327,0.9,poi.school,École Le Paradis Cholet,https://osm.org/way/480840566,G,,
405072166,00011,40507216600011,P,1987-05-01,NN,,,2019-12-10T10:55:36,true,3,[ND],[ND],[ND],[ND],[ND],[ND],FLORENTIN,,[ND],81093,[ND],[ND],,,[ND],[ND],[ND],[ND],[ND],[ND],,,[ND],,[ND],[ND],,,2008-01-01,A,[ND],[ND],[ND],[ND],01.42Z,NAFRev2,N,,,0,,,,,,
405072174,00015,40507217400015,O,1991-01-01,NN,,,2008-01-04T20:50:06,true,3,,,,,BERNINE,81150,FLORENTIN,,,81093,,,,,,,,,,,,,,,,,,,2008-01-01,A,,,,,01.21Z,NAFRev2,N,5.8412834,45.2707416,0.87,poi.information,Fontaine Bonnet (Informations) Bernin,https://osm.org/node/676938632,G,,
405072182,00018,40507218200018,O,1990-07-27,NN,,,2008-01-04T20:50:06,true,4,,,,,FLORENTIN,81150,FLORENTIN,,,81093,,,,,,,,,,,,,,,,,,,2008-01-01,A,,,,,68.20B,NAFRev2,N,2.028314,43.888894,0.93,municipality,Florentin,81093,G,FLORENTIN,
405165929,00028,40516592900028,O,2009-12-01,,,,2016-09-22T19:25:35,false,2,,,,,LA LANDE,81150,FLORENTIN,,,81093,,,,,,,,,,,,,,,,,,,2016-09-22,F,,,,,96.02B,NAFRev2,N,2.03679,43.889959,0.92,street,Chemin de la Lande 81150 Florentin,81093_0038,G,CHEMIN DE LA LANDE,
408029130,00015,40802913000015,O,,NN,,,,true,1,,,,LD,BERNINE,81150,FLORENTIN,,,81093,,,,,,,,,,,,,,,,,,,1997-02-02,F,,,,,52.2P,NAF1993,N,5.8412834,45.2707416,0.87,poi.information,Fontaine Bonnet (Informations) Bernin,https://osm.org/node/676938632,G,,
408438349,00016,40843834900016,O,1965-01-01,NN,,,2008-01-04T21:10:22,true,4,,,,,AU CAUSSE,81150,FLORENTIN,,,81093,,,,,,,,,,,,,,,,,,,2008-01-01,A,,,,,01.11Z,NAFRev2,N,2.2081797,43.6335581,0.88,poi.track,Chemin Rural de la Sicardie au Causse Castres,https://osm.org/way/60894877,G,,
408438356,00011,40843835600011,O,1983-10-31,NN,,,2012-10-24T04:48:07,true,5,,,,,BORIE HAUTE,81150,FLORENTIN,,,81093,,,,,,,,,,,,,,,,,,,2012-12-31,F,,,,,01.45Z,NAFRev2,N,2.02529,43.873624,0.4,street,Route de Laudugarié 81150 Florentin,81093_0039,G,ROUTE DE LAUDUGARIE,
409606589,00011,40960658900011,O,,NN,,,2006-11-25T15:21:49,true,1,,,,ALL,BOSC,81150,FLORENTIN,,,81093,,,,,,,,,,,,,,,,,,,1996-06-30,F,,,,,55.3A,NAF1993,N,2.026811,43.898811,0.51,street,Chemin de Bosc Crémat 81150 Florentin,81093_0008,G,CHEMIN DE BOSC CREMAT,
411028616,00018,41102861600018,O,1996-07-20,NN,,,2008-01-04T21:52:30,true,3,,,,ALL,RUDELS,81150,FLORENTIN,,,81093,,,,,,,,,,,,,,,,,,,2008-01-01,A,,,,,01.50Z,NAFRev2,N,,,0,,,,,,
411398407,00030,41139840700030,O,2011-10-01,,,4520AB,2022-05-09T19:38:25,true,3,ROUTE DE BRENS,,,LD,LES TROIS PILIERS,81150,FLORENTIN,,,81093,,,,,,,,,,,,,,,,,,,2022-04-01,A,,,,GARAGE TROIS PILIERS,45.20A,NAFRev2,N,-0.9262488,46.7942659,0.9,poi.hotel,Les Trois Piliers (Hôtel) Le Boupère,https://osm.org/node/1866368809,G,,
411774839,00012,41177483900012,O,1997-04-01,00,2020,4332AA,2022-09-21T20:29:43,true,4,LIEU DIT GRABAS,42,,CHE,DE L'ESPITAL,81150,FLORENTIN,,,81093,,,,,,,,,,,,,,,,,,,2021-06-01,A,,,,,43.32A,NAFRev2,N,2.034669,43.884096,0.86,housenumber,42 Chemin de l’Espital 81150 Florentin,81093_0025_00042,G,42 CHEMIN DE L ESPITAL,
411845043,00032,41184504300032,O,2022-03-01,,,,2022-06-04T12:46:50,true,1,,10,,,CHE DES TROUBADOURS,81150,FLORENTIN,,,81093,,,,,,,,,,,,,,,,,,,2022-03-01,A,,,,AUX PLAISIRS D'AUTREFOIS,47.79Z,NAFRev2,N,2.034076,43.886067,0.87,housenumber,10 Chemin des Troubadours 81150 Florentin,81093_0150_00010,G,10 CHEMIN DES TROUBADOURS,
413460320,00059,41346032000059,O,2008-12-01,,,,2010-05-10T11:59:37,false,2,,,,,SAINT SALVY,81150,FLORENTIN,,,81093,,,,,,,,,,,,,,,,,,,2010-04-09,F,,,,,86.90D,NAFRev2,N,2.03632,43.886569,0.92,street,Chemin de Saint-Salvy 81150 Florentin,81093_0125,G,CHEMIN DE SAINT SALVY,
413460320,00067,41346032000067,O,2010-04-09,,,,2017-09-11T02:57:35,true,2,,,,PL,DE LA MAIRIE,81150,FLORENTIN,,,81093,,,,,,,,,,,,,,,,,,,2017-04-03,F,,,,,86.90D,NAFRev2,N,2.033488,43.887413,0.83,street,Place de la Mairie 81150 Florentin,81093_0045,G,PLACE DE LA MAIRIE,