siren,nic,siret,statutDiffusionEtablissement,dateCreationEtablissement,trancheEffectifsEtablissement,anneeEffectifsEtablissement,activitePrincipaleRegistreMetiersEtablissement,dateDernierTraitementEtablissement,etablissementSiege,nombrePeriodesEtablissement,complementAdresseEtablissement,numeroVoieEtablissement,indiceRepetitionEtablissement,typeVoieEtablissement,libelleVoieEtablissement,codePostalEtablissement,libelleCommuneEtablissement,libelleCommuneEtrangerEtablissement,distributionSpecialeEtablissement,codeCommuneEtablissement,codeCedexEtablissement,libelleCedexEtablissement,codePaysEtrangerEtablissement,libellePaysEtrangerEtablissement,complementAdresse2Etablissement,numeroVoie2Etablissement,indiceRepetition2Etablissement,typeVoie2Etablissement,libelleVoie2Etablissement,codePostal2Etablissement,libelleCommune2Etablissement,libelleCommuneEtranger2Etablissement,distributionSpeciale2Etablissement,codeCommune2Etablissement,codeCedex2Etablissement,libelleCedex2Etablissement,codePaysEtranger2Etablissement,libellePaysEtranger2Etablissement,dateDebut,etatAdministratifEtablissement,enseigne1Etablissement,enseigne2Etablissement,enseigne3Etablissement,denominationUsuelleEtablissement,activitePrincipaleEtablissement,nomenclatureActivitePrincipaleEtablissement,caractereEmployeurEtablissement,longitude,latitude,geo_score,geo_type,geo_adresse,geo_id,geo_ligne,geo_l4,geo_l5
217902568,00013,21790256800013,O,1983-03-01,02,2020,,2022-08-29T09:09:05,true,4,,,,,,79340,SAINT-GERMIER,,,79256,,,,,,,,,,,,,,,,,,,2008-01-01,A,MAIRIE,,,,84.11Z,NAFRev2,O,,,0,,,,,,
217902568,00021,21790256800021,O,1995-12-25,NN,,,2019-11-14T14:01:00,false,3,MAIRIE,,,,,79340,SAINT-GERMIER,,,79256,,,,,,,,,,,,,,,,,,,2003-03-11,F,LOCATION DE BATIMENTS COMMERCIAUX,,,,70.2C,NAFRev1,N,-0.035567,46.462125,0.91,street,Rue de la Mairie 79340 Saint-Germier,79256_0040,D,RUE DE LA MAIRIE,
267900793,00014,26790079300014,O,1983-08-10,NN,,,2019-11-14T14:01:00,true,3,,,,,MAIRIE,79340,SAINT-GERMIER,,,79256,,,,,,,,,,,,,,,,,,,2008-01-01,A,CCAS,,,,88.99B,NAFRev2,N,-0.035567,46.462125,0.91,street,Rue de la Mairie 79340 Saint-Germier,79256_0040,G,RUE DE LA MAIRIE,
297901795,00015,29790179500015,O,1990-01-01,NN,,,2019-11-14T14:01:00,true,5,MAIRIE,3,,RUE,DE LA MAIRIE,79340,SAINT-GERMIER,,,79256,,,,,,,,,,,,,,,,,,,2013-06-10,F,,,,,42.99Z,NAFRev2,O,-0.035835,46.461875,0.94,housenumber,3 Rue de la Mairie 79340 Saint-Germier,79256_0040_00003,G,3 RUE DE LA MAIRIE,
306442468,00030,30644246800030,O,1985-01-01,NN,,,2019-11-14T14:01:00,true,4,,,,,LE BREUIL,79340,SAINT-GERMIER,,,79256,,,,,,,,,,,,,,,,,,,2008-01-01,A,,,,,68.20B,NAFRev2,N,-0.05352,46.465327,0.94,street,Le Breuil 79340 Saint-Germier,79256_liaf2f,G,LE BREUIL,
311830970,00027,31183097000027,O,1997-12-31,NN,,,2019-11-14T14:01:00,true,5,,,,,LA BERTRANDIERE,79340,SAINT-GERMIER,,,79256,,,,,,,,,,,,,,,,,,,2013-10-01,F,,,,,01.11Z,NAFRev2,N,4.3647607,45.4849469,0.89,poi.bus_stop,La Bertrandière (Arrêt de bus) L'Étrat,https://osm.org/node/3507249905,G,,
322050691,00011,32205069100011,O,,NN,,,2019-11-14T14:01:00,true,1,,,,,CD 521 LA CURE,79340,SAINT-GERMIER,,,79256,,,,,,,,,,,,,,,,,,,1995-12-31,F,,,,,55.4B,NAF1993,N,,,0,,,,,,
323622241,00020,32362224100020,O,2008-08-01,11,2020,,2023-01-24T03:37:25,true,1,LE CLOUDY ET L'EPINE,,,,LE CLOUDY ET L'EPINE,79340,SAINT-GERMIER,,,79256,,,,,,,,,,,,,,,,,,,2008-08-01,A,,,,,46.32A,NAFRev2,O,,,0,,,,,,
324331610,00026,32433161000026,O,,NN,,9999ZZ,2019-11-14T14:01:00,true,1,,,,LD,LA FONCLOUSE,79340,SAINT-GERMIER,,,79256,,,,,,,,,,,,,,,,,,,1991-09-30,F,,,,,29.11,NAP,N,-0.057722,46.447605,0.74,street,Fonclouse 79340 Saint-Germier,79256_c5zz3j,G,FONCLOUSE,
327699484,00025,32769948400025,O,2001-07-04,,,,2019-11-14T14:01:00,false,3,,,,,LE BREUIL,79340,SAINT-GERMIER,,,79256,,,,,,,,,,,,,,,,,,,2001-12-31,F,,,,,52.6D,NAF1993,N,-0.05352,46.465327,0.94,street,Le Breuil 79340 Saint-Germier,79256_liaf2f,G,LE BREUIL,
329703474,00018,32970347400018,O,1984-04-01,NN,,,2019-11-14T14:01:00,true,3,MAIRIE DE ST GERMIER,3,,RUE,DE LA MAIRIE,79340,SAINT-GERMIER,,,79256,,,,,,,,,,,,,,,,,,,2008-01-01,A,,,,,77.31Z,NAFRev2,N,-0.035835,46.461875,0.94,housenumber,3 Rue de la Mairie 79340 Saint-Germier,79256_0040_00003,G,3 RUE DE LA MAIRIE,
331810150,00010,33181015000010,O,1985-01-01,NN,,,2019-11-14T14:01:00,true,4,,,,,,79340,SAINT-GERMIER,,,79256,,,,,,,,,,,,,,,,,,,1994-12-25,F,,,,,01.3Z,NAF1993,N,,,0,,,,,,
331810168,00012,33181016800012,O,1985-01-01,NN,,,2019-11-14T14:01:00,true,1,,,,,,79340,SAINT-GERMIER,,,79256,,,,,,,,,,,,,,,,,,,2002-09-01,F,,,,,01.3Z,NAF1993,N,,,0,,,,,,
333729788,00013,33372978800013,O,,NN,,9999ZZ,2019-11-14T14:01:00,true,1,,,,,LE BREUIL,79340,SAINT-GERMIER,,,79256,,,,,,,,,,,,,,,,,,,1990-05-31,F,,,,,55.73,NAP,N,-0.05352,46.465327,0.94,street,Le Breuil 79340 Saint-Germier,79256_liaf2f,G,LE BREUIL,
335109245,00019,33510924500019,O,,NN,,,2019-11-14T14:01:00,true,1,,,,LD,LA CHAUVINIERE,79340,SAINT-GERMIER,,,79256,,,,,,,,,,,,,,,,,,,1992-09-30,F,,,,,70.2C,NAF1993,N,-0.06822,46.450281,0.94,street,La Chauvinière 79340 Saint-Germier,79256_v1a19r,G,LA CHAUVINIERE,
337734313,00030,33773431300030,O,1995-03-15,NN,,,2019-11-14T14:01:00,false,4,,,,,LE BOURG,79340,SAINT-GERMIER,,,79256,,,,,,,,,,,,,,,,,,,1998-02-28,F,,,,,52.5Z,NAF1993,N,2.212915,47.9910304,0.9,poi.bar,Le Bourg (Bar) Ingrannes,https://osm.org/node/1718543174,G,,
339986945,00014,33998694500014,O,1987-01-01,,,,2019-12-17T03:39:00,true,4,LA VICLAIRE,,,,LA VICHAIRE,79340,SAINT-GERMIER,,,79256,,,,,,,,,,,,,,,,,,,2008-10-31,A,,,,,68.20B,NAFRev2,N,-0.06822,46.450281,0.4,street,La Chauvinière 79340 Saint-Germier,79256_v1a19r,G,LA CHAUVINIERE,
343284071,00069,34328407100069,P,2004-04-07,NN,,1089ZZ,2019-11-14T14:01:00,false,3,[ND],[ND],[ND],[ND],[ND],[ND],SAINT-GERMIER,,[ND],79256,[ND],[ND],,,[ND],[ND],[ND],[ND],[ND],[ND],,,[ND],,[ND],[ND],,,2005-11-03,F,[ND],[ND],[ND],[ND],15.8B,NAFRev1,N,,,0,,,,,,
344207295,00017,34420729500017,O,1988-01-29,NN,,,2019-11-14T14:01:00,true,4,,,,,LA CHAUVINIERE,79340,SAINT-GERMIER,,,79256,,,,,,,,,,,,,,,,,,,2003-05-31,F,,,,,01.2A,NAFRev1,N,-0.06822,46.450281,0.94,street,La Chauvinière 79340 Saint-Germier,79256_v1a19r,G,LA CHAUVINIERE,
347661522,00016,34766152200016,O,1988-07-18,NN,,,2019-11-14T14:01:00,false,3,,,,,LE PETIT BOURG GAILLARD,79340,SAINT-GERMIER,,,79256,,,,,,,,,,,,,,,,,,,2006-12-31,F,,,,,01.3Z,NAFRev1,N,-0.036127,46.460493,0.63,locality,Bourg Gaillard 79340 Saint-Germier,79256_B011,G,BOURG GAILLARD,
347661522,00024,34766152200024,O,2006-12-31,01,2020,,2023-02-04T13:18:50,true,2,,10,,RTE,DE MENIGOUTE,79340,SAINT-GERMIER,,,79256,,,,,,,,,,,,,,,,,,,2008-01-01,A,,,,,01.42Z,NAFRev2,N,-0.038777,46.463099,0.85,housenumber,10 Route de Ménigoute 79340 Saint-Germier,79256_0045_00010,G,10 ROUTE DE MENIGOUTE,
349410860,00010,34941086000010,O,,NN,,,2019-11-14T14:01:00,true,1,,,,,LA REMIGERE,79340,SAINT-GERMIER,,,79256,,,,,,,,,,,,,,,,,,,1993-09-13,F,,,,,01.3Z,NAF1993,N,-0.040478,46.463352,0.54,locality,La Riviere de St Germier 79340 Saint-Germier,79256_B043,G,LA RIVIERE DE ST GERMIER,
379350192,00017,37935019200017,O,1900-01-01,NN,,,2019-11-14T14:01:00,false,3,,,,,LA BOULINIERE,79340,SAINT-GERMIER,,,79256,,,,,,,,,,,,,,,,,,,1993-06-14,F,,,,,01.1A,NAF1993,N,-0.031804,46.469799,0.94,street,La Boulinière 79340 Saint-Germier,79256_60qgpl,G,LA BOULINIERE,
381474360,00017,38147436000017,O,1991-04-01,NN,,,2019-11-14T14:01:00,true,4,,,,LD,LE BOURG,79340,SAINT-GERMIER,,,79256,,,,,,,,,,,,,,,,,,,2019-07-01,F,,,,,01.50Z,NAFRev2,N,2.212915,47.9910304,0.9,poi.bar,Le Bourg (Bar) Ingrannes,https://osm.org/node/1718543174,G,,
381997287,00036,38199728700036,O,2013-07-01,,,,2019-11-14T14:01:00,true,4,,7,,RUE,DU PRESBYTERE,79340,SAINT-GERMIER,,,79256,,,,,,,,,,,,,,,,,,,2019-07-26,F,,,,,95.29Z,NAFRev2,N,-0.038768,46.461796,0.94,housenumber,7 Rue du Presbytère 79340 Saint-Germier,79256_0060_00007,G,7 RUE DU PRESBYTERE,
384065041,00012,38406504100012,O,1992-01-02,NN,,,2019-11-14T14:01:00,true,3,,,,,COUSSAY,79340,SAINT-GERMIER,,,79256,,,,,,,,,,,,,,,,,,,2007-03-31,F,,,,,01.3Z,NAFRev1,N,-0.047896,46.453614,0.91,locality,Coussay Ouest 79340 Saint-Germier,79256_B024,G,COUSSAY OUEST,
384294336,00035,38429433600035,O,2020-01-24,,,,2020-03-20T17:29:45,false,1,,,,LD,L'ARCHERIE,79340,SAINT-GERMIER,,,79256,,,,,,,,,,,,,,,,,,,2020-01-24,F,,,,,35.11Z,NAFRev2,N,-0.025909,46.47215,0.94,street,L’Archerie 79340 Saint-Germier,79256_1gfh9s,G,L ARCHERIE,
389005935,00017,38900593500017,O,1992-10-01,NN,,,2019-11-14T14:01:00,true,3,,,,LD,LA CHAUVINIERE,79340,SAINT-GERMIER,,,79256,,,,,,,,,,,,,,,,,,,2008-01-01,A,,,,,01.43Z,NAFRev2,N,-0.06822,46.450281,0.94,street,La Chauvinière 79340 Saint-Germier,79256_v1a19r,G,LA CHAUVINIERE,
392058459,00018,39205845900018,O,,NN,,,2019-11-14T14:01:00,true,1,,,,,LA BOULINIERE,79340,SAINT-GERMIER,,,79256,,,,,,,,,,,,,,,,,,,1996-08-31,F,,,,,01.1C,NAF1993,N,-0.031804,46.469799,0.94,street,La Boulinière 79340 Saint-Germier,79256_60qgpl,G,LA BOULINIERE,
394573596,00019,39457359600019,O,1994-04-02,NN,,,2019-11-14T14:01:00,true,3,,,,,LA BOULINIERE,79340,SAINT-GERMIER,,,79256,,,,,,,,,,,,,,,,,,,2008-01-01,A,,,,,56.10A,NAFRev2,N,-0.031804,46.469799,0.94,street,La Boulinière 79340 Saint-Germier,79256_60qgpl,G,LA BOULINIERE,
395132566,00013,39513256600013,O,1994-01-01,NN,,,2021-02-23T11:20:54,true,3,,,,,LA TUILERIE,79340,SAINT-GERMIER,,,79256,,,,,,,,,,,,,,,,,,,2008-01-01,A,,,,,01.42Z,NAFRev2,N,-0.068732,46.468573,0.47,street,Lieu Dit la Boucherie 79340 Saint-Germier,79256_09yafv,G,LIEU DIT LA BOUCHERIE,
408020162,00041,40802016200041,O,2009-06-01,,,,2019-11-14T14:01:00,true,2,,,,LD,COUSSAY,79340,SAINT-GERMIER,,,79256,,,,,,,,,,,,,,,,,,,2016-12-31,F,,,,,88.99B,NAFRev2,N,-0.047896,46.453614,0.91,locality,Coussay Ouest 79340 Saint-Germier,79256_B024,G,COUSSAY OUEST,
414825943,00015,41482594300015,O,1977-09-29,NN,,,2019-11-14T14:01:00,true,3,,,,,LA BOUCHERIE,79340,SAINT-GERMIER,,,79256,,,,,,,,,,,,,,,,,,,2007-12-31,F,,,,,01.1A,NAFRev1,N,-0.068732,46.468573,0.92,street,Lieu Dit la Boucherie 79340 Saint-Germier,79256_09yafv,G,LIEU DIT LA BOUCHERIE,
414825950,00010,41482595000010,O,1979-05-14,NN,,,2019-11-14T14:01:00,true,4,,,,,L ARCHERIE,79340,SAINT-GERMIER,,,79256,,,,,,,,,,,,,,,,,,,2008-01-01,A,,,,,01.50Z,NAFRev2,N,-0.025909,46.47215,0.94,street,L’Archerie 79340 Saint-Germier,79256_1gfh9s,G,L ARCHERIE,
418363065,00016,41836306500016,O,1998-04-29,,,,2022-11-04T09:28:10,false,3,,,,,LE BOURG,79340,SAINT-GERMIER,,,79256,,,,,,,,,,,,,,,,,,,1998-12-31,F,,,,,55.3A,NAF1993,N,2.212915,47.9910304,0.9,poi.bar,Le Bourg (Bar) Ingrannes,https://osm.org/node/1718543174,G,,
419602685,00010,41960268500010,O,1983-01-01,NN,,,2019-11-14T14:01:00,true,3,,30,,,LA MONEGRIERE,79340,SAINT-GERMIER,,,79256,,,,,,,,,,,,,,,,,,,2006-12-15,F,,,,,01.2A,NAFRev1,N,-0.026937,46.458071,0.48,street,La Terriere 79340 Saint-Germier,79256_37g47t,G,LA TERRIERE,
421932849,00019,42193284900019,O,1999-02-16,NN,,,2019-11-14T14:01:00,true,3,CHEZ MR ET MME BOUQUET,,,,LA BOUCHERIE,79340,SAINT-GERMIER,,,79256,,,,,,,,,,,,,,,,,,,2008-01-01,A,,,,,68.20A,NAFRev2,N,-0.068732,46.468573,0.92,street,Lieu Dit la Boucherie 79340 Saint-Germier,79256_09yafv,G,LIEU DIT LA BOUCHERIE,
422423137,00013,42242313700013,O,1999-04-02,NN,,,2019-11-14T14:01:00,true,4,,,,,LE GERMIER,79340,SAINT-GERMIER,,,79256,,,,,,,,,,,,,,,,,,,2003-04-26,F,,,,,55.3A,NAFRev1,O,-0.05352,46.465327,0.83,street,Le Breuil 79340 Saint-Germier,79256_liaf2f,G,LE BREUIL,
427926068,00011,42792606800011,O,1971-11-01,NN,,,2019-11-14T14:01:00,true,3,,,,,LE GRAND BOURG GAILLARD,79340,SAINT-GERMIER,,,79256,,,,,,,,,,,,,,,,,,,2008-01-01,A,,,,,68.20B,NAFRev2,N,-0.036127,46.460493,0.63,locality,Bourg Gaillard 79340 Saint-Germier,79256_B011,G,BOURG GAILLARD,
433249448,00013,43324944800013,O,2000-10-04,NN,,4332AA,2019-11-14T14:01:00,true,1,,,,,LE BOURG,79340,SAINT-GERMIER,,,79256,,,,,,,,,,,,,,,,,,,2001-12-23,F,,,,,45.4A,NAF1993,O,2.212915,47.9910304,0.9,poi.bar,Le Bourg (Bar) Ingrannes,https://osm.org/node/1718543174,G,,
438324253,00014,43832425300014,O,2001-07-01,,,,2019-11-14T14:01:00,true,3,,,,,LA BOUCHERIE,79340,SAINT-GERMIER,,,79256,,,,,,,,,,,,,,,,,,,2003-12-31,F,,,,,01.2G,NAFRev1,N,-0.068732,46.468573,0.92,street,Lieu Dit la Boucherie 79340 Saint-Germier,79256_09yafv,G,LIEU DIT LA BOUCHERIE,
443908553,00011,44390855300011,O,2002-09-01,NN,,,2019-11-14T14:01:00,true,3,,,,,LES TOUCHES,79340,SAINT-GERMIER,,,79256,,,,,,,,,,,,,,,,,,,2008-01-01,A,,,,,01.50Z,NAFRev2,N,-0.015313,46.468804,0.94,street,Les Touches 79340 Saint-Germier,79256_8p3sr2,G,LES TOUCHES,
448254524,00011,44825452400011,O,2003-04-25,NN,,,2019-11-14T14:01:00,true,3,,,,,LA TUILERIE,79340,SAINT-GERMIER,,,79256,,,,,,,,,,,,,,,,,,,2008-01-01,A,,,,,01.11Z,NAFRev2,N,-0.068732,46.468573,0.47,street,Lieu Dit la Boucherie 79340 Saint-Germier,79256_09yafv,G,LIEU DIT LA BOUCHERIE,
449300375,00010,44930037500010,O,2003-06-01,NN,,,2019-11-14T14:01:00,true,4,LA CHAUVINIERE,,,,,79340,SAINT-GERMIER,,,79256,,,,,,,,,,,,,,,,,,,2008-10-01,A,,,,,01.11Z,NAFRev2,N,-0.06822,46.450281,0.94,street,La Chauvinière 79340 Saint-Germier,79256_v1a19r,D,LA CHAUVINIERE,
450982616,00028,45098261600028,O,2013-01-01,,,,2020-10-28T08:32:30,false,2,,6,,RUE,DE L'EGLISE,79340,SAINT-GERMIER,,,79256,,,,,,,,,,,,,,,,,,,2020-10-26,F,,,,,90.03B,NAFRev2,N,-0.040179,46.461464,0.94,housenumber,6 Rue de l’Eglise 79340 Saint-Germier,79256_0010_00006,G,6 RUE DE L EGLISE,
452041155,00014,45204115500014,O,2004-02-09,NN,,4399CZ,2021-10-27T08:08:16,true,5,,2,,IMP,DE LA FORGE,79340,SAINT-GERMIER,,,79256,,,,,,,,,,,,,,,,,,,2019-12-31,F,,,,,43.99C,NAFRev2,O,-0.040325,46.461028,0.83,housenumber,2 Impasse de la Forge 79340 Saint-Germier,79256_0020_00002,G,2 IMPASSE DE LA FORGE,
482718814,00023,48271881400023,O,2013-05-16,,,,2019-11-14T14:01:00,false,2,,1,B,,LA BOULINIERE,79340,SAINT-GERMIER,,,79256,,,,,,,,,,,,,,,,,,,2015-05-01,F,,,,,81.10Z,NAFRev2,N,-0.031804,46.469799,0.94,street,La Boulinière 79340 Saint-Germier,79256_60qgpl,G,LA BOULINIERE,
484880489,00030,48488048900030,O,2018-04-13,,,,2021-02-23T13:50:28,true,1,,,,,FONCLOUSE,79340,SAINT-GERMIER,,,79256,,,,,,,,,,,,,,,,,,,2018-04-13,A,,,,,96.09Z,NAFRev2,N,-0.057722,46.447605,0.94,street,Fonclouse 79340 Saint-Germier,79256_c5zz3j,G,FONCLOUSE,
488318098,00016,48831809800016,O,2005-11-01,01,2020,,2022-08-29T09:20:18,true,2,LE BREUIL,,,,,79340,SAINT-GERMIER,,,79256,,,,,,,,,,,,,,,,,,,2008-01-01,A,,,,,01.42Z,NAFRev2,N,-0.05352,46.465327,0.94,street,Le Breuil 79340 Saint-Germier,79256_liaf2f,D,LE BREUIL,
488343138,00019,48834313800019,O,2006-01-01,,,,2019-11-14T14:01:00,true,2,LES TOUCHES,,,,,79340,SAINT-GERMIER,,,79256,,,,,,,,,,,,,,,,,,,2008-01-01,A,,,,,01.45Z,NAFRev2,N,-0.015313,46.468804,0.94,street,Les Touches 79340 Saint-Germier,79256_8p3sr2,D,LES TOUCHES,
488403171,00017,48840317100017,O,2005-10-05,,,,2019-11-14T14:01:00,true,2,LE JARDIN SECRET,,,,LA BOULINIERE,79340,SAINT-GERMIER,,,79256,,,,,,,,,,,,,,,,,,,2006-05-15,F,,,,,52.6B,NAFRev1,N,-0.031804,46.469799,0.94,street,La Boulinière 79340 Saint-Germier,79256_60qgpl,G,LA BOULINIERE,
493510937,00011,49351093700011,O,2006-12-12,NN,,,2019-11-14T14:01:00,true,4,,,,,LA BOULINIERE,79340,SAINT-GERMIER,,,79256,,,,,,,,,,,,,,,,,,,2008-01-01,A,,,,,68.20B,NAFRev2,N,-0.031804,46.469799,0.94,street,La Boulinière 79340 Saint-Germier,79256_60qgpl,G,LA BOULINIERE,
494044761,00018,49404476100018,O,2007-02-01,,,4331ZB,2019-11-14T14:01:00,true,3,,,,LD,LE BREUIL,79340,SAINT-GERMIER,,,79256,,,,,,,,,,,,,,,,,,,2010-08-05,F,,,,,43.31Z,NAFRev2,N,-0.05352,46.465327,0.94,street,Le Breuil 79340 Saint-Germier,79256_liaf2f,G,LE BREUIL,
501493159,00013,50149315900013,O,2008-01-01,,,4333ZZ,2019-11-14T14:01:00,true,2,,,,LD,LA BOULINIERE,79340,SAINT-GERMIER,,,79256,,,,,,,,,,,,,,,,,,,2008-02-01,F,,,,,43.33Z,NAFRev2,N,-0.031804,46.469799,0.94,street,La Boulinière 79340 Saint-Germier,79256_60qgpl,G,LA BOULINIERE,
501968309,00010,50196830900010,O,2008-01-01,,,4399CZ,2019-11-14T14:01:00,true,1,,,,LD,L'AUDOUINIERE,79340,SAINT-GERMIER,,,79256,,,,,,,,,,,,,,,,,,,2008-01-01,A,,,,,43.99C,NAFRev2,N,-0.058529,46.454898,0.94,street,L’Audouinière 79340 Saint-Germier,79256_sme2nv,G,L AUDOUINIERE,
503473407,00032,50347340700032,O,2021-10-01,,,4334ZA,2022-01-01T14:44:34,true,1,,7,,RUE,DU TEILLET,79340,SAINT-GERMIER,,,79256,,,,,,,,,,,,,,,,,,,2021-10-01,A,DEPANN & SERVICES,,,DEPANN & SERVICES,43.34Z,NAFRev2,N,-0.041763,46.459291,0.94,housenumber,7 Rue du Teillet 79340 Saint-Germier,79256_0065_00007,G,7 RUE DU TEILLET,
507733061,00034,50773306100034,P,2020-09-09,,,,2021-07-29T08:37:31,true,1,[ND],[ND],[ND],[ND],[ND],[ND],SAINT-GERMIER,,[ND],79256,[ND],[ND],,,[ND],[ND],[ND],[ND],[ND],[ND],,,[ND],,[ND],[ND],,,2020-09-09,A,[ND],[ND],[ND],[ND],96.09Z,NAFRev2,N,,,0,,,,,,
510179518,00038,51017951800038,O,2021-01-20,,,1071CA,2022-08-01T09:24:22,false,2,,4,,LD,LA BOULINIERE,79340,SAINT-GERMIER,,,79256,,,,,,,,,,,,,,,,,,,2021-12-31,F,LA HULOTTE,,,LA HULOTTE,10.71C,NAFRev2,N,-0.031103,46.470059,0.94,housenumber,4 La Boulinière 79340 Saint-Germier,79256_60qgpl_00004,G,4 LA BOULINIERE,
510650666,00017,51065066600017,O,2009-02-04,,,4333ZZ,2020-01-09T08:32:58,true,3,,,,,BOURG,79340,SAINT-GERMIER,,,79256,,,,,,,,,,,,,,,,,,,2020-01-01,F,,,,,43.99C,NAFRev2,N,-0.036127,46.460493,0.9,locality,Bourg Gaillard 79340 Saint-Germier,79256_B011,G,BOURG GAILLARD,
511606576,00011,51160657600011,O,1984-10-02,,,,2019-11-14T14:01:00,true,1,,,,,MAIRIE,79340,SAINT-GERMIER,,,79256,,,,,,,,,,,,,,,,,,,1984-10-02,A,,,,,93.29Z,NAFRev2,N,-0.035567,46.462125,0.91,street,Rue de la Mairie 79340 Saint-Germier,79256_0040,G,RUE DE LA MAIRIE,
513633503,00026,51363350300026,O,2018-01-15,,,,2022-03-03T09:08:03,true,2,LA BOULINIERE,4,,,LA BOULINIERE,79340,SAINT-GERMIER,,,79256,,,,,,,,,,,,,,,,,,,2022-01-01,F,,,,,93.29Z,NAFRev2,N,-0.031103,46.470059,0.94,housenumber,4 La Boulinière 79340 Saint-Germier,79256_60qgpl_00004,G,4 LA BOULINIERE,
520970922,00024,52097092200024,O,2014-04-01,,,,2019-11-14T14:01:00,false,1,,,,,LA TERRIERE,79340,SAINT-GERMIER,,,79256,,,,,,,,,,,,,,,,,,,2014-04-01,A,,,,,35.11Z,NAFRev2,N,-0.026937,46.458071,0.93,street,La Terriere 79340 Saint-Germier,79256_37g47t,G,LA TERRIERE,
521023507,00010,52102350700010,O,2010-04-01,,,,2019-11-14T14:01:00,false,2,LA BOULINIERE,,,,,79340,SAINT-GERMIER,,,79256,,,,,,,,,,,,,,,,,,,2013-04-01,F,,,,,85.52Z,NAFRev2,N,-0.031804,46.469799,0.94,street,La Boulinière 79340 Saint-Germier,79256_60qgpl,D,LA BOULINIERE,
523438638,00018,52343863800018,O,2010-07-01,,,4391BZ,2019-11-14T14:01:00,false,2,,,,,LA BOULINIERE,79340,SAINT-GERMIER,,,79256,,,,,,,,,,,,,,,,,,,2013-11-08,F,,,,,43.91B,NAFRev2,N,-0.031804,46.469799,0.94,street,La Boulinière 79340 Saint-Germier,79256_60qgpl,G,LA BOULINIERE,
523438638,00026,52343863800026,O,2013-11-08,,,,2022-06-05T20:59:07,true,1,,,,LD,CHAREUIL,79340,SAINT-GERMIER,,,79256,,,,,,,,,,,,,,,,,,,2013-11-08,A,,,,VALERY PLAULT,43.91B,NAFRev2,N,-0.032726,46.464754,0.92,street,Le Chareuil 79340 Saint-Germier,79256_6jf6nd,G,LE CHAREUIL,
531089035,00020,53108903500020,O,2011-10-17,,,,2019-11-14T14:01:00,true,2,,,,LD,LA BOULINIERE,79340,SAINT-GERMIER,,,79256,,,,,,,,,,,,,,,,,,,2015-04-10,F,,,,,85.52Z,NAFRev2,N,-0.031804,46.469799,0.94,street,La Boulinière 79340 Saint-Germier,79256_60qgpl,G,LA BOULINIERE,
626711345,00019,62671134500019,O,,,,,2019-11-14T14:01:00,true,1,,,,LD,GROIE,79340,SAINT-GERMIER,,,79256,,,,,,,,,,,,,,,,,,,1984-12-25,F,,,,,57.05,NAP,N,-0.052326,46.450893,0.92,street,La Groie 79340 Saint-Germier,79256_bwh4p2,G,LA GROIE,
626811186,00016,62681118600016,O,1968-01-01,NN,,,2019-11-14T14:01:00,true,3,,,,,,79340,SAINT-GERMIER,,,79256,,,,,,,,,,,,,,,,,,,2008-01-01,A,,,,,01.61Z,NAFRev2,N,,,0,,,,,,
626811194,00010,62681119400010,O,,NN,,,2019-11-14T14:01:00,true,1,,,,,,79340,SAINT-GERMIER,,,79256,,,,,,,,,,,,,,,,,,,1992-07-31,F,,,,,01.1A,NAF1993,N,,,0,,,,,,
753599562,00018,75359956200018,O,2011-06-21,,,,2023-04-13T21:05:05,true,2,,,,,LA BOULINIERE,79340,SAINT-GERMIER,,,79256,,,,,,,,,,,,,,,,,,,2015-07-15,F,,,,,94.99Z,NAFRev2,N,-0.031804,46.469799,0.94,street,La Boulinière 79340 Saint-Germier,79256_60qgpl,G,LA BOULINIERE,
775715592,01452,77571559201452,O,2015-12-10,,,,2019-11-14T14:01:00,false,1,,,,,LE BOURG,79340,SAINT-GERMIER,,,79256,,,,,,,,,,,,,,,,,,,2015-12-10,A,,,,,46.21Z,NAFRev2,N,2.212915,47.9910304,0.9,poi.bar,Le Bourg (Bar) Ingrannes,https://osm.org/node/1718543174,G,,
781473277,00015,78147327700015,O,,,,,2019-11-14T14:01:00,true,1,,,,,,79340,SAINT-GERMIER,,,79256,,,,,,,,,,,,,,,,,,,1986-12-12,F,,,,,01.4A,NAF1993,N,,,0,,,,,,
781473285,00018,78147328500018,O,,NN,,,2019-11-14T14:01:00,true,1,,,,,,79340,SAINT-GERMIER,,,79256,,,,,,,,,,,,,,,,,,,,F,,,,,21.01,NAP,N,,,0,,,,,,
781473293,00012,78147329300012,O,,NN,,,2019-11-14T14:01:00,true,1,,,,LD,GROIE,79340,SAINT-GERMIER,,,79256,,,,,,,,,,,,,,,,,,,,F,,,,,55.60,NAP,N,-0.052326,46.450893,0.92,street,La Groie 79340 Saint-Germier,79256_bwh4p2,G,LA GROIE,
781473301,00013,78147330100013,O,,,,,2019-11-14T14:01:00,true,1,,,,,,79340,SAINT-GERMIER,,,79256,,,,,,,,,,,,,,,,,,,1984-12-25,F,,,,,,,N,,,0,,,,,,
781473319,00015,78147331900015,O,,,,9999ZZ,2019-11-14T14:01:00,true,1,,,,,,79340,SAINT-GERMIER,,,79256,,,,,,,,,,,,,,,,,,,1987-12-25,F,,,,,55.60,NAP,N,,,0,,,,,,
781473327,00018,78147332700018,O,,,,,2019-11-14T14:01:00,true,1,,,,,,79340,SAINT-GERMIER,,,79256,,,,,,,,,,,,,,,,,,,1984-12-25,F,,,,,47.04,NAP,N,,,0,,,,,,
781473343,00015,78147334300015,O,,,,,2019-11-14T14:01:00,true,1,,,,,,79340,SAINT-GERMIER,,,79256,,,,,,,,,,,,,,,,,,,1984-12-25,F,,,,,60.07,NAP,N,,,0,,,,,,
781473350,00010,78147335000010,O,,NN,,,2019-11-14T14:01:00,true,1,,,,,,79340,SAINT-GERMIER,,,79256,,,,,,,,,,,,,,,,,,,2000-03-29,F,,,,,60.01,NAP,N,,,0,,,,,,
792464224,00015,79246422400015,O,2013-04-01,,,1629ZA,2022-11-03T04:12:04,false,2,,,,,LA BOULINIERE,79340,SAINT-GERMIER,,,79256,,,,,,,,,,,,,,,,,,,2017-12-01,F,,,,,31.09B,NAFRev2,N,-0.031804,46.469799,0.94,street,La Boulinière 79340 Saint-Germier,79256_60qgpl,G,LA BOULINIERE,
792464224,00023,79246422400023,O,2023-01-01,,,,2023-04-03T11:03:44,true,1,,,,LD,LA GUILBOTERIE,79340,SAINT-GERMIER,,,79256,,,,,,,,,,,,,,,,,,,2023-01-01,A,EI FERME DE L'ALISIER,,,,01.28Z,NAFRev2,N,-0.068732,46.468573,0.39,street,Lieu Dit la Boucherie 79340 Saint-Germier,79256_09yafv,G,LIEU DIT LA BOUCHERIE,
793610791,00014,79361079100014,O,2013-03-18,,,,2019-11-14T14:01:00,true,1,,7,,RUE,DU PRESBYTERE,79340,SAINT-GERMIER,,,79256,,,,,,,,,,,,,,,,,,,2013-03-18,A,,,,,47.99A,NAFRev2,N,-0.038768,46.461796,0.94,housenumber,7 Rue du Presbytère 79340 Saint-Germier,79256_0060_00007,G,7 RUE DU PRESBYTERE,
795336296,00012,79533629600012,O,2013-09-17,,,,2019-11-19T08:06:43,false,2,,1,,RUE,DE LA MAIRIE,79340,SAINT-GERMIER,,,79256,,,,,,,,,,,,,,,,,,,2015-12-31,F,,,,,43.34Z,NAFRev2,N,-0.035835,46.461875,0.94,housenumber,1 Rue de la Mairie 79340 Saint-Germier,79256_0040_00001,G,1 RUE DE LA MAIRIE,
797975885,00014,79797588500014,O,2013-10-01,,,,2019-11-14T14:01:00,true,1,,,,LD,LA BERTRANDIERE,79340,SAINT-GERMIER,,,79256,,,,,,,,,,,,,,,,,,,2013-10-01,A,,,,,01.11Z,NAFRev2,N,4.3647607,45.4849469,0.89,poi.bus_stop,La Bertrandière (Arrêt de bus) L'Étrat,https://osm.org/node/3507249905,G,,
802930610,00018,80293061000018,O,2014-07-01,,,4312AZ,2019-11-14T14:01:00,true,1,LA CHARTRIE,,,,LA CHARTRIE,79340,SAINT-GERMIER,,,79256,,,,,,,,,,,,,,,,,,,2014-07-01,A,,,,,43.12A,NAFRev2,N,-0.022992,46.468865,0.92,street,Lieu Dit la Chartrie 79340 Saint-Germier,79256_s5wojo,G,LIEU DIT LA CHARTRIE,
803675941,00022,80367594100022,O,2014-09-27,,,8129BP,2019-11-14T14:01:00,false,2,,,,,LA BOULINIERE,79340,SAINT-GERMIER,,,79256,,,,,,,,,,,,,,,,,,,2015-01-01,F,,,,,81.29B,NAFRev2,N,-0.031804,46.469799,0.94,street,La Boulinière 79340 Saint-Germier,79256_60qgpl,G,LA BOULINIERE,
804531648,00017,80453164800017,O,2014-10-18,,,,2019-11-14T14:01:00,true,1,,,,,MAIRIE,79340,SAINT-GERMIER,,,79256,,,,,,,,,,,,,,,,,,,2014-10-18,A,,,,,93.19Z,NAFRev2,N,-0.035567,46.462125,0.91,street,Rue de la Mairie 79340 Saint-Germier,79256_0040,G,RUE DE LA MAIRIE,