siren,nic,siret,statutDiffusionEtablissement,dateCreationEtablissement,trancheEffectifsEtablissement,anneeEffectifsEtablissement,activitePrincipaleRegistreMetiersEtablissement,dateDernierTraitementEtablissement,etablissementSiege,nombrePeriodesEtablissement,complementAdresseEtablissement,numeroVoieEtablissement,indiceRepetitionEtablissement,typeVoieEtablissement,libelleVoieEtablissement,codePostalEtablissement,libelleCommuneEtablissement,libelleCommuneEtrangerEtablissement,distributionSpecialeEtablissement,codeCommuneEtablissement,codeCedexEtablissement,libelleCedexEtablissement,codePaysEtrangerEtablissement,libellePaysEtrangerEtablissement,complementAdresse2Etablissement,numeroVoie2Etablissement,indiceRepetition2Etablissement,typeVoie2Etablissement,libelleVoie2Etablissement,codePostal2Etablissement,libelleCommune2Etablissement,libelleCommuneEtranger2Etablissement,distributionSpeciale2Etablissement,codeCommune2Etablissement,codeCedex2Etablissement,libelleCedex2Etablissement,codePaysEtranger2Etablissement,libellePaysEtranger2Etablissement,dateDebut,etatAdministratifEtablissement,enseigne1Etablissement,enseigne2Etablissement,enseigne3Etablissement,denominationUsuelleEtablissement,activitePrincipaleEtablissement,nomenclatureActivitePrincipaleEtablissement,caractereEmployeurEtablissement,longitude,latitude,geo_score,geo_type,geo_adresse,geo_id,geo_ligne,geo_l4,geo_l5
014853295,00013,01485329500013,O,1994-12-25,NN,,,2019-11-14T14:00:20,true,3,,1,,RUE,DES CORDELIERS,15100,SAINT-FLOUR,,,15187,,,,,,,,,,,,,,,,,,,2008-01-01,A,,,,,81.10Z,NAFRev2,N,3.099092,45.032823,0.95,housenumber,1 Rue des Cordeliers 15100 Saint-Flour,15187_0200_00001,G,1 RUE DES CORDELIERS,
014858732,00010,01485873200010,O,1994-12-25,NN,,,2022-10-13T09:47:08,true,3,,,,AV,DE LA REPUBLIQUE,15100,SAINT-FLOUR,,,15187,,,,,,,,,,,,,,,,,,,2022-07-31,A,,,,,81.10Z,NAFRev2,N,3.105908,45.033779,0.87,street,Avenue de la Republique 15100 Saint-Flour,15187_0670,G,AVENUE DE LA REPUBLIQUE,
068502376,04394,06850237604394,O,2004-04-01,NN,,,2019-11-14T14:00:20,false,5,,5,,PL,D ARMES,15100,SAINT-FLOUR,,,15187,,,,,,,,,,,,,,,,,,,2009-01-15,F,PARUVENDU,,,,58.13Z,NAFRev2,O,3.094321,45.033395,0.81,housenumber,5 Place d’Armes 15100 Saint-Flour,15187_0030_00005,G,5 PLACE D ARMES,
068502376,05722,06850237605722,O,2009-01-15,NN,,,2019-11-14T14:00:20,false,2,,30,,RUE,DES LACS,15100,SAINT-FLOUR,,,15187,,,,,,,,,,,,,,,,,,,2011-11-03,F,PARU VENDU,,,,58.13Z,NAFRev2,O,3.089817,45.032914,0.96,housenumber,30 Rue des Lacs 15100 Saint-Flour,15187_0410_00030,G,30 RUE DES LACS,
130001563,00084,13000156300084,O,2006-01-01,12,2020,,2022-08-29T09:03:19,false,2,,,,,AUT AUTOROUTE A 75,15100,SAINT-FLOUR,,,15187,,,,,,,,,,,,,,,,,,,2008-01-01,A,CEI SAINT FLOUR,,,,84.13Z,NAFRev2,O,,,0,,,,,,
130005481,09672,13000548109672,O,2008-12-19,NN,,,2019-11-14T14:00:20,false,3,,3,,RUE,DES AGIALS,15100,SAINT-FLOUR,,BP 31,15187,,,,,,,,,,,,,,,,,,,2016-06-01,F,ALE SAINT FLOUR,,,,84.13Z,NAFRev2,O,3.090193,45.033609,0.96,housenumber,3 Rue des Agials 15100 Saint-Flour,15187_0011_00003,G,3 RUE DES AGIALS,
130005481,10175,13000548110175,O,2008-12-19,NN,,,2019-11-14T14:00:20,false,3,SAINT FLOUR,2,,AV,DE BESSERETTE,15100,SAINT-FLOUR,,,15187,,,,,,,,,,,,,,,,,,,2012-06-01,F,,,,,84.13Z,NAFRev2,O,3.084501,45.034959,0.86,housenumber,2 Avenue de Besserette 15100 Saint-Flour,15187_0060_00002,G,2 AVENUE DE BESSERETTE,
130005481,24135,13000548124135,O,2015-10-01,11,2020,,2022-08-29T09:03:24,false,1,,16,,AV,DE BESSERETTE,15100,SAINT-FLOUR,,CS 30031,15187,15101,ST FLOUR CEDEX,,,,,,,,,,,,,,,,,2015-10-01,A,POLE EMPLOI SAINT FLOUR,,,,84.13Z,NAFRev2,O,3.081348,45.036863,0.86,housenumber,16 Avenue de Besserette 15100 Saint-Flour,15187_0060_00016,G,16 AVENUE DE BESSERETTE,
130008345,00022,13000834500022,O,2010-01-01,NN,,,2019-11-14T14:00:20,false,1,,33,,AV,DU LIORAN,15100,SAINT-FLOUR,,,15187,,,,,,,,,,,,,,,,,,,2010-01-01,A,DELEGATION TERRITORIALE DE SAINT-FLOUR,,,,84.13Z,NAFRev2,O,3.078535,45.035784,0.85,housenumber,33 Avenue du Lioran 15100 Saint-Flour,15187_0432_00033,G,33 AVENUE DU LIORAN,
130014715,00135,13001471500135,O,2011-07-01,11,2020,,2022-08-29T09:03:39,false,2,,2,,RUE,DES AGIALS,15100,SAINT-FLOUR,,BP 50045,15187,,,,,,,,,,,,,,,,,,,2022-01-01,F,SIP ET DES ENTREPRISES DE SAINT-FLOUR,,,,84.11Z,NAFRev2,N,3.089761,45.033553,0.96,housenumber,2 Rue des Agials 15100 Saint-Flour,15187_0011_00002,G,2 RUE DES AGIALS,
130014715,00267,13001471500267,O,2011-07-01,NN,,,2019-11-14T14:00:20,false,2,,16,,PL,D ARMES,15100,SAINT-FLOUR,,BP   38,15187,,,,,,,,,,,,,,,,,,,2013-08-26,F,TRESORERIE DE SAINT-FLOUR,,,,84.11Z,NAFRev2,N,3.094976,45.034112,0.82,housenumber,16 Place d’Armes 15100 Saint-Flour,15187_0030_00016,G,16 PLACE D ARMES,
130014715,00333,13001471500333,O,2013-08-26,11,2020,,2022-08-29T09:03:39,false,2,,2,,RUE,DES AGIALS,15100,SAINT-FLOUR,,BP 38,15187,,,,,,,,,,,,,,,,,,,2022-01-01,A,SERVICE DE GESTION COMPTABLE SAINT-FLOUR,,,,84.11Z,NAFRev2,N,3.089761,45.033553,0.96,housenumber,2 Rue des Agials 15100 Saint-Flour,15187_0011_00002,G,2 RUE DES AGIALS,
130014715,00440,13001471500440,O,2023-01-01,,,,2022-12-06T13:51:01,false,1,,2,,RUE,DES AGIALS,15100,SAINT-FLOUR,,BP 38,15187,15107,SAINT FLOUR CEDEX,,,,,,,,,,,,,,,,,2023-01-01,A,TRESORERIE HOSPITALIERE DU CANTAL,,,,84.11Z,NAFRev2,N,3.089761,45.033553,0.96,housenumber,2 Rue des Agials 15100 Saint-Flour,15187_0011_00002,G,2 RUE DES AGIALS,
130015084,00010,13001508400010,O,2009-02-02,,,,2019-11-14T14:00:20,true,1,CTRE HOSPITALIER DE SAINT FLOUR,,,AV,DU DOC MALLET,15100,SAINT-FLOUR,,BP 43,15187,,,,,,,,,,,,,,,,,,,2009-02-02,A,,,,,46.46Z,NAFRev2,N,3.082806,45.033626,0.75,street,Avenue du Docteur Mallet 15100 Saint-Flour,15187_0260,G,AVENUE DU DOCTEUR MALLET,
171500010,00029,17150001000029,O,2001-12-25,11,2020,,2022-08-29T09:03:50,false,2,,35,,RUE,SOREL,15100,SAINT-FLOUR,,,15187,,,,,,,,,,,,,,,,,,,2008-01-01,A,SOUS-PREFECTURE DE SAINT-FLOUR,,,,84.11Z,NAFRev2,N,3.09258,45.034336,0.96,housenumber,35 Rue Sorel 15100 Saint-Flour,15187_0740_00035,G,35 RUE SOREL,
171502115,00198,17150211500198,O,1983-03-25,NN,,,2019-11-14T14:00:20,false,4,,16,,PL,D ARMES,15100,SAINT-FLOUR,,,15187,,,,,,,,,,,,,,,,,,,2011-07-01,F,TRESORERIE SAINT-FLOUR,,,,84.11Z,NAFRev2,N,3.094976,45.034112,0.82,housenumber,16 Place d’Armes 15100 Saint-Flour,15187_0030_00016,G,16 PLACE D ARMES,
171502214,00256,17150221400256,O,1989-03-20,NN,,,2019-11-14T14:00:20,false,5,CENTRE DES FINANCES PUBLIQUES,7,,CRS,SPY DES TERNES,15100,SAINT-FLOUR,,,15187,15107,SAINT FLOUR CEDEX,,,,,,,,,,,,,,,,,2011-07-01,F,SCE IMPOTS ENTREPRISES ST FLOUR,,,,84.11Z,NAFRev2,N,3.089581,45.03335,0.87,housenumber,7 Cours Spy des Ternes 15100 Saint-Flour,15187_0750_00007,G,7 COURS SPY DES TERNES,
171504319,00020,17150431900020,O,1985-05-07,NN,,,2020-05-28T13:44:39,false,4,,1,,RUE,DU DOC LIONNET,15100,SAINT-FLOUR,,BP 83,15187,,,,,,,,,,,,,,,,,,,2017-08-31,F,CTRE INFORMATION ET D ORIENTATION,,,,84.12Z,NAFRev2,N,3.084494,45.033568,0.87,housenumber,1 Rue du Docteur Lionnet 15100 Saint-Flour,15187_0250_00001,G,1 RUE DU DOCTEUR LIONNET,
171504319,00079,17150431900079,O,1985-05-09,NN,,,2019-11-14T14:00:20,false,3,PALAIS DE JUSTICE,,,PL,DU PALAIS DE JUSTICE,15100,SAINT-FLOUR,,,15187,,,,,,,,,,,,,,,,,,,2008-01-01,A,COMM CIRC ENSEIG SECOND DEGRE CCSD,,,,84.12Z,NAFRev2,N,3.091645,45.033193,0.88,street,Place du Palais de Justice 15100 Saint-Flour,15187_0580,G,PLACE DU PALAIS DE JUSTICE,
171504319,00087,17150431900087,O,1985-05-09,NN,,,2019-11-14T14:00:20,false,3,PALAIS DE JUSTICE,,,PL,DU PALAIS DE JUSTICE,15100,SAINT-FLOUR,,,15187,,,,,,,,,,,,,,,,,,,2008-01-01,A,COMMISSION PRESCOL ELEMENTAIRE CCPE,,,,84.12Z,NAFRev2,N,3.091645,45.033193,0.88,street,Place du Palais de Justice 15100 Saint-Flour,15187_0580,G,PLACE DU PALAIS DE JUSTICE,
171504319,00137,17150431900137,O,1985-05-09,NN,,,2019-11-14T14:00:20,false,4,PALAIS DE JUSTICE,,,PL,DU PALAIS DE JUSTICE,15100,SAINT-FLOUR,,BP 91,15187,,,,,,,,,,,,,,,,,,,2008-01-01,F,CIRCONSCRIPTION 1ER DEGRE ST-FLOUR IEN,,,,84.12Z,NAFRev2,N,3.091645,45.033193,0.88,street,Place du Palais de Justice 15100 Saint-Flour,15187_0580,G,PLACE DU PALAIS DE JUSTICE,
171504319,00236,17150431900236,O,2007-12-18,02,2020,,2022-08-29T09:03:50,false,1,,,,RUE,DU THEATRE,15100,SAINT-FLOUR,,BP 94,15187,,,,,,,,,,,,,,,,,,,2007-12-18,A,CIRC IER DEGRE IEN SAINT FLOUR,,,,84.12Z,NAFRev2,N,3.091023,45.033246,0.95,street,Rue du Théâtre 15100 Saint-Flour,15187_0790,G,RUE DU THEATRE,
171506611,00101,17150661100101,O,1985-02-25,NN,,,2019-11-14T14:00:20,false,4,ROUTE DE MURAT,,,AV,DU LIORAN,15100,SAINT-FLOUR,,,15187,,,,,,,,,,,,,,,,,,,2009-01-01,F,DDE SUBDIVISION DE ST-FLOUR,,,,84.13Z,NAFRev2,N,3.07483,45.03738,0.82,street,Avenue du Lioran 15100 Saint-Flour,15187_0432,G,AVENUE DU LIORAN,
171506611,00168,17150661100168,O,1991-04-24,NN,,,2019-11-14T14:00:20,false,4,,,,,CAR ECHANGEUR NORD,15100,SAINT-FLOUR,,,15187,,,,,,,,,,,,,,,,,,,2009-01-01,F,SUBDIVISION AUTOROUTIERE,,,,84.13Z,NAFRev2,N,,,0,,,,,,
171506611,00218,17150661100218,O,2001-12-25,NN,,,2019-11-14T14:00:20,false,3,,,,AV,DU LIORAN,15100,SAINT-FLOUR,,,15187,,,,,,,,,,,,,,,,,,,2009-01-01,F,PARC DE SAINT FLOUR ANNEXE,,,,84.13Z,NAFRev2,N,3.07483,45.03738,0.82,street,Avenue du Lioran 15100 Saint-Flour,15187_0432,G,AVENUE DU LIORAN,
176301117,00170,17630111700170,O,1986-08-29,NN,,,2022-08-08T13:41:26,false,4,,2,,RUE,DES LACS,15100,SAINT-FLOUR,,,15187,,,,,,,,,,,,,,,,,,,2010-01-01,F,TRIBUNAL DE COMMERCE,,,,84.23Z,NAFRev2,N,3.092186,45.032922,0.96,housenumber,2 Rue des Lacs 15100 Saint-Flour,15187_0410_00002,G,2 RUE DES LACS,
176301117,00444,17630111700444,O,1997-12-05,01,2020,,2022-08-29T09:03:57,false,4,,1,,RUE,DU THEATRE,15100,SAINT-FLOUR,,,15187,,,,,,,,,,,,,,,,,,,2020-01-01,A,TRIBUNAL DE PROXIMITE DE SAINT-FLOUR,,,,84.23Z,NAFRev2,N,3.090934,45.03317,0.95,housenumber,1 Rue du Théâtre 15100 Saint-Flour,15187_0790_00001,G,1 RUE DU THEATRE,
176301117,00725,17630111700725,O,2007-12-25,,,,2019-11-14T14:00:20,false,1,PALAIS DE JUSTICE,1,,RUE,DU THEATRE,15100,SAINT-FLOUR,,BP 34,15187,15101,ST FLOUR CEDEX,,,,,,,,,,,,,,,,,2007-12-25,A,TRIBUNAL PARITAIRE BAUX RURAUX,,,,84.23Z,NAFRev2,N,3.090934,45.03317,0.95,housenumber,1 Rue du Théâtre 15100 Saint-Flour,15187_0790_00001,G,1 RUE DU THEATRE,
176302313,00232,17630231300232,O,2000-09-01,,,,2019-11-14T14:00:20,false,4,,9,,RUE,DE LA ROLLANDIE,15100,SAINT-FLOUR,,,15187,,,,,,,,,,,,,,,,,,,2010-12-20,F,SEC.D'ASIETTE CONTR.INDIRECTES ST FLOUR,,,,84.11Z,NAFRev2,N,3.093614,45.032961,0.96,housenumber,9 Rue de la Rollandie 15100 Saint-Flour,15187_0710_00009,G,9 RUE DE LA ROLLANDIE,
180038028,03829,18003802803829,O,1983-03-16,NN,,,2019-11-14T14:00:20,false,2,,,,AV,DU DOC MALLET,15100,SAINT-FLOUR,,,15187,,,,,,,,,,,,,,,,,,,1995-11-01,F,AGENCE LOCALE DE SAINT FLOUR,,,,,,,3.082806,45.033626,0.75,street,Avenue du Docteur Mallet 15100 Saint-Flour,15187_0260,G,AVENUE DU DOCTEUR MALLET,
180038028,17795,18003802817795,O,1995-11-01,,,,2019-11-14T14:00:20,false,3,,42,,AV,DU LIORAN,15100,SAINT-FLOUR,,,15187,,,,,,,,,,,,,,,,,,,2003-03-01,F,AGENCE LOCALE SAINT FLOUR,,,,75.1E,NAFRev1,N,3.06937,45.038293,0.85,housenumber,42 Avenue du Lioran 15100 Saint-Flour,15187_0432_00042,G,42 AVENUE DU LIORAN,
180038028,22175,18003802822175,O,2003-03-01,NN,,,2019-11-14T14:00:20,false,5,,3,,RUE,DES AGIALS,15100,SAINT-FLOUR,,BP 31,15187,,,,,,,,,,,,,,,,,,,2008-12-19,F,ALE SAINT FLOUR,,,,84.13Z,NAFRev2,O,3.090193,45.033609,0.96,housenumber,3 Rue des Agials 15100 Saint-Flour,15187_0011_00003,G,3 RUE DES AGIALS,
181500018,00054,18150001800054,O,2005-12-25,NN,,,2019-11-14T14:00:20,false,2,,,,,LE ROZIER,15100,SAINT-FLOUR,,,15187,,,,,,,,,,,,,,,,,,,2008-01-01,A,ANTENNE CCI ST FLOUR,,,,94.11Z,NAFRev2,N,3.108553,45.05801,0.95,street,Le Rozier 15100 Saint-Flour,15187_ub4m67,G,LE ROZIER,
186306924,00090,18630692400090,O,2013-01-01,NN,,,2019-11-14T14:00:20,false,2,VILLAGE D'ENTREPRISE,,,,ZA DU ROZIER COREN,15100,SAINT-FLOUR,,,15187,,,,,,,,,,,,,,,,,,,2017-01-01,F,ANTENNE DE SAINT-FLOUR,,,,94.11Z,NAFRev2,O,3.107589,45.059765,0.95,locality,ZA du Rozier Coren 15100 Saint-Flour,15187_A110,G,ZA DU ROZIER COREN,
191500297,00012,19150029700012,O,1983-03-01,21,2020,,2022-08-29T09:04:19,true,4,,,,RUE,BLAISE PASCAL,15100,SAINT-FLOUR,,BP 47,15187,,,,,,,,,,,,,,,,,,,2008-01-01,A,,,,,85.31Z,NAFRev2,O,3.091049,45.036035,0.95,street,Rue Blaise Pascal 15100 Saint-Flour,15187_0065,G,RUE BLAISE PASCAL,
191500305,00013,19150030500013,O,1983-03-01,21,2020,,2022-08-29T09:04:19,true,4,,20,,RUE,MARCELLIN BOUDET,15100,SAINT-FLOUR,,,15187,,,,,,,,,,,,,,,,,,,2012-09-17,A,,,,,85.31Z,NAFRev2,O,3.080872,45.034633,0.96,housenumber,20 Rue Marcellin Boudet 15100 Saint-Flour,15187_0440_00020,G,20 RUE MARCELLIN BOUDET,
191500305,00021,19150030500021,O,1989-04-21,,,,2019-11-14T14:00:20,false,3,,18,,RUE,MARCELLIN BOUDET,15100,SAINT-FLOUR,,,15187,,,,,,,,,,,,,,,,,,,2000-08-31,F,LYCEE PROFESSIONNEL MARCELLIN BOUDET,,,,80.4C,NAF1993,N,3.082391,45.034799,0.96,housenumber,18 Rue Marcellin Boudet 15100 Saint-Flour,15187_0440_00018,G,18 RUE MARCELLIN BOUDET,
191500420,00010,19150042000010,O,1983-03-01,,,,2019-11-14T14:00:20,true,1,,18,,RUE,MARCELLIN BOUDET,15100,SAINT-FLOUR,,,15187,,,,,,,,,,,,,,,,,,,2000-09-01,F,,,,,80.2C,NAF1993,N,3.082391,45.034799,0.96,housenumber,18 Rue Marcellin Boudet 15100 Saint-Flour,15187_0440_00018,G,18 RUE MARCELLIN BOUDET,
191505999,00026,19150599900026,O,1990-03-30,21,2020,,2022-08-29T09:04:19,true,5,5 ROUTE DES HAUTES TERRES,,,,VOLZAC,15100,SAINT-FLOUR,,BP 92,15187,15104,ST FLOUR CEDEX,,,,,,,,,,,,,,,,,2011-01-09,A,LYCEE PROFESSIONNEL AGRICOLE LOUIS MALLET,,,,85.32Z,NAFRev2,O,3.066378,45.025301,0.95,street,Volzac 15100 Saint-Flour,15187_cqklub,G,VOLZAC,
191505999,00034,19150599900034,O,1972-12-25,11,2020,,2022-08-29T09:04:19,false,4,,,,,VOLZAC,15100,SAINT-FLOUR,,,15187,,,,,,,,,,,,,,,,,,,2020-01-01,A,CFPPA ST FLOUR,,,,85.59A,NAFRev2,O,3.066378,45.025301,0.95,street,Volzac 15100 Saint-Flour,15187_cqklub,G,VOLZAC,
191506666,00012,19150666600012,O,1983-03-01,12,2020,,2022-08-29T09:04:19,true,3,,1,,RUE,DE L EGALITE,15100,SAINT-FLOUR,,BP 109,15187,,,,,,,,,,,,,,,,,,,2008-01-01,A,,,,,85.31Z,NAFRev2,N,3.106148,45.033248,0.95,housenumber,1 Rue de l’Egalité 15100 Saint-Flour,15187_0273_00001,G,1 RUE DE L EGALITE,
200001337,00019,20000133700019,O,2005-12-22,NN,,,2019-11-14T14:00:20,false,4,CTRE TRI ARRONDISSEMENT ST FLOUR,,,,ZI LA FLORIZANE,15100,SAINT-FLOUR,,,15187,,,,,,,,,,,,,,,,,,,2016-12-30,F,,,,,38.11Z,NAFRev2,O,3.106391,45.049063,0.95,locality,ZI la Florizane 15100 Saint-Flour,15187_B208,G,ZI LA FLORIZANE,
200001337,00076,20000133700076,O,2016-12-30,00,2020,,2022-08-29T09:04:53,true,2,VILLAGE D'ENTREPRISES,,,,ZA DU ROZIER COREN,15100,SAINT-FLOUR,,,15187,,,,,,,,,,,,,,,,,,,2020-01-20,F,,,,,38.11Z,NAFRev2,O,3.107589,45.059765,0.95,locality,ZA du Rozier Coren 15100 Saint-Flour,15187_A110,G,ZA DU ROZIER COREN,
200043651,00013,20004365100013,O,2013-12-05,,,,2022-12-16T04:09:19,false,3,,17,,PL,D ARMES,15100,SAINT-FLOUR,,,15187,,,,,,,,,,,,,,,,,,,2022-07-02,F,,,,,91.03Z,NAFRev2,O,3.095067,45.034016,0.82,housenumber,17 Place d’Armes 15100 Saint-Flour,15187_0030_00017,G,17 PLACE D ARMES,
200043909,00015,20004390900015,O,2013-12-31,NN,,,2019-11-14T14:00:20,true,3,VILLAGE ENTREPRISES DU ROZIER COREN,,,,ZA DU ROZIER COREN,15100,SAINT-FLOUR,,,15187,,,,,,,,,,,,,,,,,,,2017-01-01,F,,,,,84.11Z,NAFRev2,O,3.107589,45.059765,0.95,locality,ZA du Rozier Coren 15100 Saint-Flour,15187_A110,G,ZA DU ROZIER COREN,
200043909,00080,20004390900080,O,2014-01-01,,,,2019-11-14T14:00:20,false,2,VILLAGE ENTREPRISES DU ROZIER COREN,,,,ZA DU ROZIER COREN,15100,SAINT-FLOUR,,,15187,,,,,,,,,,,,,,,,,,,2017-01-01,F,SERVICE D'ORDURES MENAGERES,,,,38.11Z,NAFRev2,N,3.107589,45.059765,0.95,locality,ZA du Rozier Coren 15100 Saint-Flour,15187_A110,G,ZA DU ROZIER COREN,
200043909,00098,20004390900098,O,2014-01-01,,,,2019-11-14T14:00:20,false,2,VILLAGE ENTREPRISES DU ROZIER COREN,,,,ZA DU ROZIER COREN,15100,SAINT-FLOUR,,,15187,,,,,,,,,,,,,,,,,,,2017-01-01,F,SERVICES TRANSPORTS,,,,49.39A,NAFRev2,N,3.107589,45.059765,0.95,locality,ZA du Rozier Coren 15100 Saint-Flour,15187_A110,G,ZA DU ROZIER COREN,
200043909,00106,20004390900106,O,2014-01-01,,,,2019-11-14T14:00:20,false,2,VILLAGE ENTREPRISES DU ROZIER COREN,,,,ZA DU ROZIER COREN,15100,SAINT-FLOUR,,,15187,,,,,,,,,,,,,,,,,,,2017-01-01,F,DECHETTERIE,,,,38.12Z,NAFRev2,N,3.107589,45.059765,0.95,locality,ZA du Rozier Coren 15100 Saint-Flour,15187_A110,G,ZA DU ROZIER COREN,
200043909,00155,20004390900155,O,2014-01-01,,,,2019-11-14T14:00:20,false,2,,,,,LE COLOMBIER,15100,SAINT-FLOUR,,,15187,,,,,,,,,,,,,,,,,,,2017-01-01,F,CENTRE AQUALUDIQUE,,,,93.11Z,NAFRev2,N,3.108553,45.05801,0.39,street,Le Rozier 15100 Saint-Flour,15187_ub4m67,G,LE ROZIER,
200043909,00171,20004390900171,O,2014-01-01,,,,2019-11-14T14:00:20,false,2,VILLAGE ENTREPRISES DU ROZIER COREN,,,,ZA DU ROZIER COREN,15100,SAINT-FLOUR,,,15187,,,,,,,,,,,,,,,,,,,2017-01-01,F,REGIE DISTRIBUTION CHALEUR BOIS,,,,35.30Z,NAFRev2,N,3.107589,45.059765,0.95,locality,ZA du Rozier Coren 15100 Saint-Flour,15187_A110,G,ZA DU ROZIER COREN,
200043909,00189,20004390900189,O,2014-01-01,,,,2019-11-14T14:00:20,false,2,VILLAGE ENTREPRISES DU ROZIER COREN,,,,ZA DU ROZIER COREN,15100,SAINT-FLOUR,,,15187,,,,,,,,,,,,,,,,,,,2017-01-01,F,REGIE COMMUNAUTAIRE DU SPANC,,,,84.12Z,NAFRev2,N,3.107589,45.059765,0.95,locality,ZA du Rozier Coren 15100 Saint-Flour,15187_A110,G,ZA DU ROZIER COREN,
200043909,00197,20004390900197,O,2014-01-01,,,,2019-11-14T14:00:20,false,2,VILLAGE ENTREPRISES DU ROZIER COREN,,,,ZA DU ROZIER COREN,15100,SAINT-FLOUR,,,15187,,,,,,,,,,,,,,,,,,,2017-01-01,F,REGIE DE L'ECOMUSEE,,,,91.02Z,NAFRev2,N,3.107589,45.059765,0.95,locality,ZA du Rozier Coren 15100 Saint-Flour,15187_A110,G,ZA DU ROZIER COREN,
200044949,00010,20004494900010,O,2014-01-01,NN,,,2019-11-14T14:00:20,true,1,,,,RUE,DE BELLOY,15100,SAINT-FLOUR,,,15187,,,,,,,,,,,,,,,,,,,2014-01-01,A,,,,,84.12Z,NAFRev2,O,3.093404,45.034862,0.96,street,Rue de Belloy 15100 Saint-Flour,15187_0040,G,RUE DE BELLOY,
200066660,00016,20006666000016,O,2017-01-01,22,2020,,2022-08-29T09:05:20,true,1,VILLAGE D'ENTREPRISES,,,,ZA DU ROZIER COREN,15100,SAINT-FLOUR,,,15187,,,,,,,,,,,,,,,,,,,2017-01-01,A,,,,,84.11Z,NAFRev2,O,3.107589,45.059765,0.95,locality,ZA du Rozier Coren 15100 Saint-Flour,15187_A110,G,ZA DU ROZIER COREN,
200066660,00024,20006666000024,O,2017-01-01,,,,2023-04-17T13:39:32,false,1,,,,,ZA DU ROZIER COREN,15100,SAINT-FLOUR,,,15187,,,,,,,,,,,,,,,,,,,2017-01-01,A,REGIS DISTRIBUTION DE CHALEUR,,,,35.30Z,NAFRev2,N,3.107589,45.059765,0.95,locality,ZA du Rozier Coren 15100 Saint-Flour,15187_A110,G,ZA DU ROZIER COREN,
200066660,00032,20006666000032,O,2017-01-01,,,,2023-04-17T13:57:24,false,1,,,,,ZA DU ROZIER COREN,15100,SAINT-FLOUR,,,15187,,,,,,,,,,,,,,,,,,,2017-01-01,A,REGIE SPANC,,,,84.11Z,NAFRev2,N,3.107589,45.059765,0.95,locality,ZA du Rozier Coren 15100 Saint-Flour,15187_A110,G,ZA DU ROZIER COREN,
200066660,00040,20006666000040,O,2017-01-01,,,,2023-04-17T13:58:47,false,1,,,,,ZA DU ROZIER COREN,15100,SAINT-FLOUR,,,15187,,,,,,,,,,,,,,,,,,,2017-01-01,A,ZONE D'ACTIVITES DU RAUCHARD,,,,42.99Z,NAFRev2,N,3.107589,45.059765,0.95,locality,ZA du Rozier Coren 15100 Saint-Flour,15187_A110,G,ZA DU ROZIER COREN,
200066660,00057,20006666000057,O,2017-01-01,,,,2023-04-17T14:00:05,false,1,,,,,ZA DU ROZIER COREN,15100,SAINT-FLOUR,,,15187,,,,,,,,,,,,,,,,,,,2017-01-01,A,ZONE ARTISANALE ROZIER COREN,,,,42.99Z,NAFRev2,N,3.107589,45.059765,0.95,locality,ZA du Rozier Coren 15100 Saint-Flour,15187_A110,G,ZA DU ROZIER COREN,
200066660,00065,20006666000065,O,2017-01-01,,,,2023-04-17T14:01:28,false,1,,,,,ZA DU ROZIER COREN,15100,SAINT-FLOUR,,,15187,,,,,,,,,,,,,,,,,,,2017-01-01,A,ZONE ARTISANALE DE VOLZAC,,,,42.99Z,NAFRev2,N,3.107589,45.059765,0.95,locality,ZA du Rozier Coren 15100 Saint-Flour,15187_A110,G,ZA DU ROZIER COREN,
200066660,00073,20006666000073,O,2017-01-01,,,,2023-04-17T14:02:41,false,1,,,,,ZA DU ROZIER COREN,15100,SAINT-FLOUR,,,15187,,,,,,,,,,,,,,,,,,,2017-01-01,A,ZONE ARTISANALE DE BELVEZET,,,,42.99Z,NAFRev2,N,3.107589,45.059765,0.95,locality,ZA du Rozier Coren 15100 Saint-Flour,15187_A110,G,ZA DU ROZIER COREN,
200066660,00081,20006666000081,O,2017-01-01,,,,2023-04-17T14:04:09,false,1,,,,,ZA DU ROZIER COREN,15100,SAINT-FLOUR,,,15187,,,,,,,,,,,,,,,,,,,2017-01-01,A,ZONE ARTISANALE DU LUC D'USSEL,,,,42.99Z,NAFRev2,N,3.107589,45.059765,0.95,locality,ZA du Rozier Coren 15100 Saint-Flour,15187_A110,G,ZA DU ROZIER COREN,
200066660,00099,20006666000099,O,2017-01-01,,,,2023-04-17T14:05:29,false,1,,,,,ZA DU ROZIER COREN,15100,SAINT-FLOUR,,,15187,,,,,,,,,,,,,,,,,,,2017-01-01,A,ABATTOIR INTERCOMMUNAL PIERREFORT,,,,10.11Z,NAFRev2,N,3.107589,45.059765,0.95,locality,ZA du Rozier Coren 15100 Saint-Flour,15187_A110,G,ZA DU ROZIER COREN,
200066660,00149,20006666000149,O,2017-01-01,,,,2023-04-17T14:06:56,false,1,,,,,ZA DU ROZIER COREN,15100,SAINT-FLOUR,,,15187,,,,,,,,,,,,,,,,,,,2017-01-01,A,ATELIER RELAIS ARDELIS,,,,68.20B,NAFRev2,N,3.107589,45.059765,0.95,locality,ZA du Rozier Coren 15100 Saint-Flour,15187_A110,G,ZA DU ROZIER COREN,
200066660,00156,20006666000156,O,2017-01-01,,,,2023-04-17T14:08:18,false,1,,,,,ZA DU ROZIER COREN,15100,SAINT-FLOUR,,,15187,,,,,,,,,,,,,,,,,,,2017-01-01,A,ATELIER RELAIS VULCACUIR,,,,68.20B,NAFRev2,N,3.107589,45.059765,0.95,locality,ZA du Rozier Coren 15100 Saint-Flour,15187_A110,G,ZA DU ROZIER COREN,
200066660,00198,20006666000198,O,2017-01-01,,,,2023-04-17T14:09:43,false,1,,,,,ZA DU ROZIER COREN,15100,SAINT-FLOUR,,,15187,,,,,,,,,,,,,,,,,,,2017-01-01,A,COLLECTE DES ORDURES MENAGERES,,,,38.11Z,NAFRev2,N,3.107589,45.059765,0.95,locality,ZA du Rozier Coren 15100 Saint-Flour,15187_A110,G,ZA DU ROZIER COREN,
200066660,00214,20006666000214,O,2017-01-01,,,,2023-04-17T14:12:01,false,1,,,,,ZA DU ROZIER COREN,15100,SAINT-FLOUR,,,15187,,,,,,,,,,,,,,,,,,,2017-01-01,A,CABINET MEDICAL DE VALUEJOLS,,,,68.20B,NAFRev2,N,3.107589,45.059765,0.95,locality,ZA du Rozier Coren 15100 Saint-Flour,15187_A110,G,ZA DU ROZIER COREN,
200066660,00222,20006666000222,O,2017-01-01,,,,2023-04-17T14:28:20,false,1,,,,,ZA DU ROZIER COREN,15100,SAINT-FLOUR,,,15187,,,,,,,,,,,,,,,,,,,2017-01-01,A,POLE DE SANTE SAINT-FLOUR,,,,68.20B,NAFRev2,N,3.107589,45.059765,0.95,locality,ZA du Rozier Coren 15100 Saint-Flour,15187_A110,G,ZA DU ROZIER COREN,
200066660,00230,20006666000230,O,2017-01-01,,,,2023-04-17T14:29:55,false,1,,,,,ZA DU ROZIER COREN,15100,SAINT-FLOUR,,,15187,,,,,,,,,,,,,,,,,,,2017-01-01,A,CENTRE AQUALUDIQUE DE SAINT-FLOUR,,,,93.11Z,NAFRev2,N,3.107589,45.059765,0.95,locality,ZA du Rozier Coren 15100 Saint-Flour,15187_A110,G,ZA DU ROZIER COREN,
200066660,00248,20006666000248,O,2017-01-01,,,,2023-04-17T15:05:04,false,1,,,,,ZA DU ROZIER COREN,15100,SAINT-FLOUR,,,15187,,,,,,,,,,,,,,,,,,,2017-01-01,A,REGIE ENSEIGNEMENT DIFFUSION ARTISTIQUE,,,,85.59B,NAFRev2,N,3.107589,45.059765,0.95,locality,ZA du Rozier Coren 15100 Saint-Flour,15187_A110,G,ZA DU ROZIER COREN,
200066660,00255,20006666000255,O,2017-01-01,,,,2023-04-17T15:06:35,false,1,,,,,ZA DU ROZIER COREN,15100,SAINT-FLOUR,,,15187,,,,,,,,,,,,,,,,,,,2017-01-01,A,ECOMUSEE,,,,91.02Z,NAFRev2,N,3.107589,45.059765,0.95,locality,ZA du Rozier Coren 15100 Saint-Flour,15187_A110,G,ZA DU ROZIER COREN,
200066660,00263,20006666000263,O,2017-01-01,,,,2023-04-17T15:08:06,false,1,,,,,ZA DU ROZIER COREN,15100,SAINT-FLOUR,,,15187,,,,,,,,,,,,,,,,,,,2017-01-01,A,FORAGES COLTINES,,,,36.00Z,NAFRev2,N,3.107589,45.059765,0.95,locality,ZA du Rozier Coren 15100 Saint-Flour,15187_A110,G,ZA DU ROZIER COREN,
200066660,00271,20006666000271,O,2017-01-01,,,,2023-04-17T15:21:14,false,1,,,,,ZA DU ROZIER COREN,15100,SAINT-FLOUR,,,15187,,,,,,,,,,,,,,,,,,,2017-01-01,A,DOMAINE NORDIQUE,,,,84.13Z,NAFRev2,N,3.107589,45.059765,0.95,locality,ZA du Rozier Coren 15100 Saint-Flour,15187_A110,G,ZA DU ROZIER COREN,