siren,nic,siret,statutDiffusionEtablissement,dateCreationEtablissement,trancheEffectifsEtablissement,anneeEffectifsEtablissement,activitePrincipaleRegistreMetiersEtablissement,dateDernierTraitementEtablissement,etablissementSiege,nombrePeriodesEtablissement,complementAdresseEtablissement,numeroVoieEtablissement,indiceRepetitionEtablissement,typeVoieEtablissement,libelleVoieEtablissement,codePostalEtablissement,libelleCommuneEtablissement,libelleCommuneEtrangerEtablissement,distributionSpecialeEtablissement,codeCommuneEtablissement,codeCedexEtablissement,libelleCedexEtablissement,codePaysEtrangerEtablissement,libellePaysEtrangerEtablissement,complementAdresse2Etablissement,numeroVoie2Etablissement,indiceRepetition2Etablissement,typeVoie2Etablissement,libelleVoie2Etablissement,codePostal2Etablissement,libelleCommune2Etablissement,libelleCommuneEtranger2Etablissement,distributionSpeciale2Etablissement,codeCommune2Etablissement,codeCedex2Etablissement,libelleCedex2Etablissement,codePaysEtranger2Etablissement,libellePaysEtranger2Etablissement,dateDebut,etatAdministratifEtablissement,enseigne1Etablissement,enseigne2Etablissement,enseigne3Etablissement,denominationUsuelleEtablissement,activitePrincipaleEtablissement,nomenclatureActivitePrincipaleEtablissement,caractereEmployeurEtablissement,longitude,latitude,geo_score,geo_type,geo_adresse,geo_id,geo_ligne,geo_l4,geo_l5
213002504,00016,21300250400016,O,1983-03-01,02,2020,,2022-08-29T09:06:42,true,3,HOTEL DE VILLE,,,,,30360,SAINT ETIENNE DE L'OLM,,,30250,,,,,,,,,,,,,,,,,,,2008-01-01,A,MAIRIE,,,,84.11Z,NAFRev2,O,4.180948,44.068093,0.5,locality,Ville Montant 30360 Saint-Étienne-de-l'Olm,30250_B054,D,VILLE MONTANT,
213002504,00024,21300250400024,O,1983-12-21,02,2020,,2022-08-29T09:06:42,false,4,,,,,,30360,SAINT ETIENNE DE L'OLM,,,30250,,,,,,,,,,,,,,,,,,,2022-05-13,A,ECOLE ELEMENTAIRE,,,,85.20Z,NAFRev2,N,,,0,,,,,,
213002504,00032,21300250400032,O,1997-01-01,NN,,,2008-01-04T18:30:31,false,3,,,,PL,DE LA MAIRIE,30360,SAINT ETIENNE DE L'OLM,,,30250,,,,,,,,,,,,,,,,,,,2008-01-01,A,SERVICE D'ASSAINISSEMENT,,,,37.00Z,NAFRev2,N,4.183741,44.058297,0.77,street,Rue de la Mairie 30360 Saint-Étienne-de-l'Olm,30250_0100,G,RUE DE LA MAIRIE,
253001945,00026,25300194500026,O,1995-09-21,NN,,,2016-04-26T01:30:49,true,3,,,,,HOTEL DE VILLE,30360,SAINT ETIENNE DE L'OLM,,,30250,,,,,,,,,,,,,,,,,,,2000-06-05,F,,,,,75.1G,NAF1993,,3.0709671,50.6304695,0.92,poi.townhall,Hôtel de Ville Lille,https://osm.org/way/40917078,G,,
263003519,00018,26300351900018,O,1986-01-06,NN,,,2021-05-27T16:54:08,true,5,,,,,MAIRIE,30360,SAINT ETIENNE DE L'OLM,,,30250,,,,,,,,,,,,,,,,,,,2020-12-31,F,,,,,88.99B,NAFRev2,N,4.183741,44.058297,0.92,street,Rue de la Mairie 30360 Saint-Étienne-de-l'Olm,30250_0100,G,RUE DE LA MAIRIE,
301135323,00022,30113532300022,O,,,,,,true,1,,,,,,30360,SAINT ETIENNE DE L'OLM,,,30250,,,,,,,,,,,,,,,,,,,1993-01-31,F,,,,,52.6E,NAF1993,N,,,0,,,,,,
311233837,00013,31123383700013,O,1900-01-01,NN,,,2008-01-04T20:06:19,true,3,,,,,,30360,SAINT ETIENNE DE L'OLM,,,30250,,,,,,,,,,,,,,,,,,,2008-01-01,A,,,,,93.12Z,NAFRev2,N,,,0,,,,,,
316249341,00017,31624934100017,O,,NN,,,,true,1,,,,,LE PEYRAL,30360,SAINT ETIENNE DE L'OLM,,,30250,,,,,,,,,,,,,,,,,,,1998-08-30,F,,,,,45.2V,NAF1993,N,2.715211,43.6233875,0.89,poi.camp_site,Le Peyral (Camping) La Salvetat-sur-Agout,https://osm.org/way/135443811,G,,
316249358,00011,31624935800011,O,,,,,,true,1,,,,,,30360,SAINT ETIENNE DE L'OLM,,,30250,,,,,,,,,,,,,,,,,,,1984-12-25,F,,,,,55.60,NAP,N,,,0,,,,,,
321585507,00023,32158550700023,O,2008-02-12,,,,2013-04-10T09:16:33,false,2,RUE DE LA BERGERIE,,,,COSTE DE PASTOUREL,30360,SAINT ETIENNE DE L'OLM,,,30250,,,,,,,,,,,,,,,,,,,2009-12-31,F,,,,,01.21Z,NAFRev2,N,,,0,,,,,,
321656480,00019,32165648000019,O,1981-04-27,NN,,,2014-08-12T09:10:19,true,4,CHEZ MM BOUVIER RESERVE DE L'ORATOIRE,,,,RESERVE DE L ORATOIRE,30360,SAINT ETIENNE DE L'OLM,,,30250,,,,,,,,,,,,,,,,,,,2013-12-31,F,,,,,01.21Z,NAFRev2,N,,,0,,,,,,
323201285,00034,32320128500034,O,,NN,,,,true,1,,,,,LE PEYRAL,30360,SAINT ETIENNE DE L'OLM,,,30250,,,,,,,,,,,,,,,,,,,1997-09-30,F,,,,,45.3E,NAF1993,N,2.715211,43.6233875,0.89,poi.camp_site,Le Peyral (Camping) La Salvetat-sur-Agout,https://osm.org/way/135443811,G,,
325994408,00012,32599440800012,O,1982-11-29,NN,,,2008-01-29T20:49:11,false,3,,,,,QUARTIER DES CLAUS,30360,SAINT ETIENNE DE L'OLM,,,30250,,,,,,,,,,,,,,,,,,,2007-11-16,F,,,,,74.6Z,NAFRev1,N,4.185023,44.061219,0.46,street,Chemin des Claux 30360 Saint-Étienne-de-l'Olm,30250_0060,G,CHEMIN DES CLAUX,
326714003,00018,32671400300018,O,1983-03-03,NN,,,2016-12-07T19:26:06,true,5,,,,,,30360,SAINT ETIENNE DE L'OLM,,,30250,,,,,,,,,,,,,,,,,,,2008-09-30,F,,,,,47.72A,NAFRev2,N,,,0,,,,,,
328471156,00013,32847115600013,O,,NN,,,,true,1,,,,,LA LAUZIERE,30360,SAINT ETIENNE DE L'OLM,,,30250,,,,,,,,,,,,,,,,,,,,F,,,,,55.40,NAP,N,6.1517686,44.6984057,0.89,poi.track,La Lauzière (Chemin) Saint-Michel-de-Chaillol,https://osm.org/way/190755462,G,,
331765479,00034,33176547900034,O,2003-04-01,,,,2008-11-07T00:50:40,false,3,,,,,CALADE DE L'ECOLE,30360,SAINT ETIENNE DE L'OLM,,,30250,,,,,,,,,,,,,,,,,,,2004-03-31,F,,,,,45.4J,NAFRev1,N,4.184596,44.05805,0.94,street,Calade de l’Ecole 30360 Saint-Étienne-de-l'Olm,30250_6opii6,G,CALADE DE L ECOLE,
331765479,00042,33176547900042,O,2008-07-01,NN,,,2014-07-08T00:36:50,true,3,,,,,L'AVEN FUSADE,30360,SAINT ETIENNE DE L'OLM,,,30250,,,,,,,,,,,,,,,,,,,2012-03-31,F,,,,,43.34Z,NAFRev2,O,,,0,,,,,,
334947132,00034,33494713200034,O,1998-04-21,NN,,,,true,1,,,,PL,DE L'ABREUVOIR,30360,SAINT ETIENNE DE L'OLM,,,30250,,,,,,,,,,,,,,,,,,,2001-09-12,F,,,,,17.4A,NAF1993,N,4.184985,44.058424,0.84,street,Place de l’Abreuvoir 30360 Saint-Étienne-de-l'Olm,30250_0010,G,PLACE DE L ABREUVOIR,
337527410,00019,33752741000019,O,,,,,,true,1,,,,,QRT LE PEYRAL,30360,SAINT ETIENNE DE L'OLM,,,30250,,,,,,,,,,,,,,,,,,,1997-12-31,F,,,,,52.6E,NAF1993,N,,,0,,,,,,
340143189,00017,34014318900017,O,,NN,,,,true,1,,,,,LIEU DIT  LE PEYRAL,30360,SAINT ETIENNE DE L'OLM,,,30250,,,,,,,,,,,,,,,,,,,1989-04-30,F,,,,,64.11,NAP,N,2.715211,43.6233875,0.89,poi.camp_site,Le Peyral (Camping) La Salvetat-sur-Agout,https://osm.org/way/135443811,G,,
340337757,00058,34033775700058,O,2008-11-03,,,,2012-10-17T09:29:31,false,2,QUARTIER LE PEYRIAL,,,RUE,DES CAMPS,30360,SAINT ETIENNE DE L'OLM,,,30250,,,,,,,,,,,,,,,,,,,2012-09-30,F,,,,,96.09Z,NAFRev2,N,4.181566,44.058282,0.73,street,Chemin des Camps 30360 Saint-Étienne-de-l'Olm,30250_0040,G,CHEMIN DES CAMPS,
340441435,00021,34044143500021,O,1995-01-01,NN,,,2014-07-08T00:44:35,true,5,,,,,LE VILLAGE,30360,SAINT ETIENNE DE L'OLM,,,30250,,,,,,,,,,,,,,,,,,,2009-11-30,F,,,,,41.20B,NAFRev2,O,4.180948,44.068093,0.42,locality,Ville Montant 30360 Saint-Étienne-de-l'Olm,30250_B054,G,VILLE MONTANT,
341035244,00019,34103524400019,O,,NN,,,,true,1,,,,,,30360,SAINT ETIENNE DE L'OLM,,,30250,,,,,,,,,,,,,,,,,,,1991-09-30,F,,,,,69.25,NAP,N,,,0,,,,,,
341341550,00026,34134155000026,O,1999-05-01,NN,,,2010-11-30T09:52:12,false,4,,,,,LIEU DIT FEUILLERAS,30360,SAINT ETIENNE DE L'OLM,,,30250,,,,,,,,,,,,,,,,,,,2010-10-31,F,,,,,01.49Z,NAFRev2,N,4.18494,44.058833,0.35,street,Calade du Terrailler 30360 Saint-Étienne-de-l'Olm,30250_acb2no,G,CALADE DU TERRAILLER,
342238284,00042,34223828400042,O,2000-02-17,NN,,,2011-04-28T00:34:31,false,4,,,,,LE VILLAGE,30360,SAINT ETIENNE DE L'OLM,,,30250,,,,,,,,,,,,,,,,,,,2002-09-30,F,,,,,93.0D,NAF1993,N,4.180948,44.068093,0.42,locality,Ville Montant 30360 Saint-Étienne-de-l'Olm,30250_B054,G,VILLE MONTANT,
342238284,00075,34223828400075,O,2010-10-30,,,9602AA,2023-01-24T03:48:50,true,2,,,,RUE,DE LA MAIRIE,30360,SAINT ETIENNE DE L'OLM,,,30250,,,,,,,,,,,,,,,,,,,2022-12-31,F,ANNIE COIFFURE,,,,96.02A,NAFRev2,N,4.183741,44.058297,0.94,street,Rue de la Mairie 30360 Saint-Étienne-de-l'Olm,30250_0100,G,RUE DE LA MAIRIE,
378486088,00040,37848608800040,O,1998-09-01,NN,,,2009-12-02T05:48:21,true,3,,,,,LE PEYRAL,30360,SAINT ETIENNE DE L'OLM,,,30250,,,,,,,,,,,,,,,,,,,2006-12-31,F,,,,,52.4Z,NAFRev1,O,2.715211,43.6233875,0.89,poi.camp_site,Le Peyral (Camping) La Salvetat-sur-Agout,https://osm.org/way/135443811,G,,
379971070,00022,37997107000022,O,2001-01-05,,,,2011-04-28T00:46:16,false,4,,,,,MAS MAYA,30360,SAINT ETIENNE DE L'OLM,,,30250,,,,,,,,,,,,,,,,,,,2002-12-25,F,,,,,52.6E,NAF1993,O,,,0,,,,,,
382103539,00013,38210353900013,O,1991-04-29,NN,,,,true,1,,,,,LE PEYRAL,30360,SAINT ETIENNE DE L'OLM,,,30250,,,,,,,,,,,,,,,,,,,2001-09-06,F,,,,,85.1G,NAF1993,N,2.715211,43.6233875,0.89,poi.camp_site,Le Peyral (Camping) La Salvetat-sur-Agout,https://osm.org/way/135443811,G,,
382730125,00020,38273012500020,O,1994-09-25,NN,,,2006-11-25T11:38:44,false,3,,,,,,30360,SAINT ETIENNE DE L'OLM,,,30250,,,,,,,,,,,,,,,,,,,2005-01-01,F,,,,,92.3A,NAFRev1,N,,,0,,,,,,
383351327,00010,38335132700010,O,1991-10-01,11,2020,,2022-08-29T09:10:24,true,6,,165,,CHE,DE L OLM,30360,SAINT ETIENNE DE L'OLM,,,30250,,,,,,,,,,,,,,,,,,,2011-06-29,A,,,,,49.41C,NAFRev2,O,4.183548,44.059833,0.87,housenumber,165 Chemin de l’Olm 30360 Saint-Étienne-de-l'Olm,30250_0110_00165,G,165 CHEMIN DE L OLM,
388028029,00030,38802802900030,O,2003-06-01,NN,,,2014-02-27T10:47:40,false,2,,,,,LE PEYRAL,30360,SAINT ETIENNE DE L'OLM,,,30250,,,,,,,,,,,,,,,,,,,2003-08-01,F,,,,,,,,2.715211,43.6233875,0.89,poi.camp_site,Le Peyral (Camping) La Salvetat-sur-Agout,https://osm.org/way/135443811,G,,
388337297,00021,38833729700021,O,1996-09-01,NN,,,2015-06-03T19:32:25,true,4,,,,,COSTE DE PASTOUREL,30360,SAINT ETIENNE DE L'OLM,,,30250,,,,,,,,,,,,,,,,,,,2015-06-26,F,,,,,80.10Z,NAFRev2,N,,,0,,,,,,
390425999,00013,39042599900013,O,1992-05-01,NN,,,2008-11-08T00:52:34,false,4,,,,LD,LE PEYRAL,30360,SAINT ETIENNE DE L'OLM,,,30250,,,,,,,,,,,,,,,,,,,2000-01-06,F,,,,,51.4A,NAF1993,O,2.715211,43.6233875,0.89,poi.camp_site,Le Peyral (Camping) La Salvetat-sur-Agout,https://osm.org/way/135443811,G,,
390497519,00020,39049751900020,O,1995-02-09,NN,,,,false,3,,,,,,30360,SAINT ETIENNE DE L'OLM,,,30250,,,,,,,,,,,,,,,,,,,1996-10-15,F,,,,,85.1C,NAF1993,N,,,0,,,,,,
390742476,00034,39074247600034,P,2013-10-15,,,,2021-04-01T10:03:37,false,2,[ND],[ND],[ND],[ND],[ND],[ND],SAINT ETIENNE DE L'OLM,,[ND],30250,[ND],[ND],,,[ND],[ND],[ND],[ND],[ND],[ND],,,[ND],,[ND],[ND],,,2020-12-08,F,[ND],[ND],[ND],[ND],47.89Z,NAFRev2,N,,,0,,,,,,
391055647,00021,39105564700021,O,1994-09-25,NN,,,2006-10-28T01:41:16,false,3,,,,,,30360,SAINT ETIENNE DE L'OLM,,,30250,,,,,,,,,,,,,,,,,,,2005-01-01,F,,,,,92.3A,NAFRev1,N,,,0,,,,,,
392470092,00017,39247009200017,O,1993-06-29,NN,,,2016-05-27T04:22:50,true,3,,,,,,30360,SAINT ETIENNE DE L'OLM,,,30250,,,,,,,,,,,,,,,,,,,2008-01-01,A,,,,,68.20B,NAFRev2,N,,,0,,,,,,
393025697,00045,39302569700045,O,2014-04-01,,,,2016-06-23T10:07:18,false,1,,,,,LE PEYRAL,30360,SAINT ETIENNE DE L'OLM,,,30250,,,,,,,,,,,,,,,,,,,2014-04-01,A,,,,,10.84Z,NAFRev2,N,2.715211,43.6233875,0.89,poi.camp_site,Le Peyral (Camping) La Salvetat-sur-Agout,https://osm.org/way/135443811,G,,
393966338,00013,39396633800013,O,,NN,,,2006-11-25T12:20:58,true,1,,,,,,30360,SAINT ETIENNE DE L'OLM,,,30250,,,,,,,,,,,,,,,,,,,1997-12-31,F,,,,,74.1J,NAF1993,N,,,0,,,,,,
399333103,00022,39933310300022,O,1999-01-01,NN,,,,true,4,,,,,LE PEYRAL,30360,SAINT ETIENNE DE L'OLM,,,30250,,,,,,,,,,,,,,,,,,,2002-07-30,F,,,,,51.4A,NAF1993,N,2.715211,43.6233875,0.89,poi.camp_site,Le Peyral (Camping) La Salvetat-sur-Agout,https://osm.org/way/135443811,G,,
407500404,00014,40750040400014,O,1996-05-06,NN,,,2006-11-25T15:13:02,true,4,,,,,LA CALADE DE L'ECOLE,30360,SAINT ETIENNE DE L'OLM,,,30250,,,,,,,,,,,,,,,,,,,2004-04-01,F,,,,,45.4J,NAFRev1,N,4.184596,44.05805,0.82,street,Calade de l’Ecole 30360 Saint-Étienne-de-l'Olm,30250_6opii6,G,CALADE DE L ECOLE,
408681336,00041,40868133600041,P,2010-06-18,,,,2019-08-03T07:45:54,false,1,[ND],[ND],[ND],[ND],[ND],[ND],SAINT ETIENNE DE L'OLM,,[ND],30250,[ND],[ND],,,[ND],[ND],[ND],[ND],[ND],[ND],,,[ND],,[ND],[ND],,,2010-06-18,A,[ND],[ND],[ND],[ND],01.28Z,NAFRev2,N,,,0,,,,,,
412046815,00038,41204681500038,O,2001-04-02,NN,,,,true,3,,,,,CALADE DES ECOLES,30360,SAINT ETIENNE DE L'OLM,,,30250,,,,,,,,,,,,,,,,,,,2001-12-31,F,,,,,51.6K,NAF1993,O,4.184596,44.05805,0.72,street,Calade de l’Ecole 30360 Saint-Étienne-de-l'Olm,30250_6opii6,G,CALADE DE L ECOLE,
418033015,00011,41803301500011,O,1998-01-01,NN,,,2008-01-04T23:14:30,true,3,,,,,,30360,SAINT ETIENNE DE L'OLM,,,30250,,,,,,,,,,,,,,,,,,,2008-01-01,A,,,,,01.21Z,NAFRev2,N,,,0,,,,,,
418792776,00019,41879277600019,O,1985-12-31,NN,,,2008-01-04T23:26:45,true,3,,,,,,30360,SAINT ETIENNE DE L'OLM,,,30250,,,,,,,,,,,,,,,,,,,2008-01-01,A,,,,,55.20Z,NAFRev2,N,,,0,,,,,,
418792784,00013,41879278400013,O,1991-01-01,NN,,,2016-01-12T00:20:07,true,3,,,,,,30360,SAINT ETIENNE DE L'OLM,,,30250,,,,,,,,,,,,,,,,,,,2008-01-01,A,,,,,01.21Z,NAFRev2,N,,,0,,,,,,
418792792,00016,41879279200016,O,1983-12-31,NN,,,2012-07-28T12:35:05,true,4,,,,,,30360,SAINT ETIENNE DE L'OLM,,,30250,,,,,,,,,,,,,,,,,,,2009-12-25,F,,,,,01.49Z,NAFRev2,N,,,0,,,,,,
420766602,00023,42076660200023,O,2002-07-03,NN,,,2006-12-15T01:11:10,false,4,,,,,LES CLAUX,30360,SAINT ETIENNE DE L'OLM,,,30250,,,,,,,,,,,,,,,,,,,2004-01-31,F,,,,,60.2L,NAFRev1,O,4.185023,44.061219,0.74,street,Chemin des Claux 30360 Saint-Étienne-de-l'Olm,30250_0060,G,CHEMIN DES CLAUX,
421647835,00063,42164783500063,O,2021-02-11,,,9603ZP,2021-11-06T14:23:01,true,1,,190,,RUE,DU CHATEAU D'EAU,30360,SAINT ETIENNE DE L'OLM,,,30250,,,,,,,,,,,,,,,,,,,2021-02-11,A,POMPES FUNEBRES ANDUZIENNE,,,,86.90A,NAFRev2,N,4.186598,44.060698,0.94,housenumber,190 Rue du Château d’Eau 30360 Saint-Étienne-de-l'Olm,30250_0050_00190,G,190 RUE DU CHATEAU D EAU,
422726935,00030,42272693500030,O,2003-01-10,NN,,,,false,2,MAS MAYA,,,,LE PERRAL,30360,SAINT ETIENNE DE L'OLM,,,30250,,,,,,,,,,,,,,,,,,,2003-08-28,F,,,,,,,,,,0,,,,,,
423199033,00014,42319903300014,O,1999-01-01,NN,,,2010-11-24T06:09:06,true,4,,,,LD,LA LAUZIERE,30360,SAINT ETIENNE DE L'OLM,,,30250,,,,,,,,,,,,,,,,,,,2010-10-31,F,,,,,01.49Z,NAFRev2,N,6.1517686,44.6984057,0.89,poi.track,La Lauzière (Chemin) Saint-Michel-de-Chaillol,https://osm.org/way/190755462,G,,
423411792,00017,42341179200017,O,1999-05-01,NN,,,2010-04-22T05:53:04,true,4,,,,,LA LAUZIERE,30360,SAINT ETIENNE DE L'OLM,,,30250,,,,,,,,,,,,,,,,,,,2009-12-31,F,,,,,01.49Z,NAFRev2,N,6.1517686,44.6984057,0.89,poi.track,La Lauzière (Chemin) Saint-Michel-de-Chaillol,https://osm.org/way/190755462,G,,
424542900,00024,42454290000024,O,2020-10-06,,,,2022-05-04T09:17:50,true,1,,216,,CHE,DE CAMPAGNE,30360,SAINT ETIENNE DE L'OLM,,,30250,,,,,,,,,,,,,,,,,,,2020-10-06,A,,,,,94.99Z,NAFRev2,N,4.179896,44.062027,0.54,housenumber,216 Chemin des Galabrunes 30360 Saint-Étienne-de-l'Olm,30250_0090_00216,G,216 CHEMIN DES GALABRUNES,
428339782,00016,42833978200016,O,1974-01-01,NN,,,,true,3,,,,,,30360,SAINT ETIENNE DE L'OLM,,,30250,,,,,,,,,,,,,,,,,,,2003-01-03,F,,,,,01.3Z,NAFRev1,N,,,0,,,,,,
428403570,00016,42840357000016,O,1968-01-01,NN,,,2008-01-05T01:26:19,true,3,,,,,,30360,SAINT ETIENNE DE L'OLM,,,30250,,,,,,,,,,,,,,,,,,,2008-01-01,A,,,,,01.21Z,NAFRev2,N,,,0,,,,,,
428403588,00018,42840358800018,O,1968-01-01,NN,,,2021-06-05T03:53:11,true,3,,,,,,30360,SAINT ETIENNE DE L'OLM,,,30250,,,,,,,,,,,,,,,,,,,2008-01-01,A,,,,,01.11Z,NAFRev2,N,,,0,,,,,,
428403596,00011,42840359600011,O,1968-01-01,NN,,,2008-01-05T01:26:19,true,3,,,,,,30360,SAINT ETIENNE DE L'OLM,,,30250,,,,,,,,,,,,,,,,,,,2008-01-01,A,,,,,01.21Z,NAFRev2,N,,,0,,,,,,
431543644,00014,43154364400014,O,2000-05-02,02,2020,,2022-08-29T09:09:39,true,4,,,,,LES CLAUX,30360,SAINT ETIENNE DE L'OLM,,,30250,,,,,,,,,,,,,,,,,,,2008-07-29,A,,,,,77.32Z,NAFRev2,O,4.185023,44.061219,0.74,street,Chemin des Claux 30360 Saint-Étienne-de-l'Olm,30250_0060,G,CHEMIN DES CLAUX,
433353372,00025,43335337200025,O,2010-08-02,,,,2018-10-27T03:44:50,true,4,VILLEMONTANT,,,,VILLE MONTANT,30360,SAINT ETIENNE DE L'OLM,,,30250,,,,,,,,,,,,,,,,,,,2018-09-30,F,,,,,46.19B,NAFRev2,N,4.180948,44.068093,0.93,locality,Ville Montant 30360 Saint-Étienne-de-l'Olm,30250_B054,G,VILLE MONTANT,
434675435,00011,43467543500011,O,2000-12-19,NN,,,2021-09-15T15:56:02,false,4,,,,,CALADE DU TERRAILLER,30360,SAINT ETIENNE DE L'OLM,,,30250,,,,,,,,,,,,,,,,,,,2021-07-07,F,,,,,68.20B,NAFRev2,N,4.18494,44.058833,0.94,street,Calade du Terrailler 30360 Saint-Étienne-de-l'Olm,30250_acb2no,G,CALADE DU TERRAILLER,
434746053,00017,43474605300017,O,2001-02-27,NN,,,2008-04-26T15:44:15,true,4,,,,,LE PEYRAL,30360,SAINT ETIENNE DE L'OLM,,,30250,,,,,,,,,,,,,,,,,,,2006-12-18,F,,,,,52.6E,NAFRev1,O,2.715211,43.6233875,0.89,poi.camp_site,Le Peyral (Camping) La Salvetat-sur-Agout,https://osm.org/way/135443811,G,,
435046032,00031,43504603200031,P,2015-09-09,,,,2021-02-23T13:17:07,true,1,[ND],[ND],[ND],[ND],[ND],[ND],SAINT ETIENNE DE L'OLM,,[ND],30250,[ND],[ND],,,[ND],[ND],[ND],[ND],[ND],[ND],,,[ND],,[ND],[ND],,,2015-09-09,A,[ND],[ND],[ND],[ND],74.20Z,NAFRev2,N,,,0,,,,,,
441570819,00017,44157081900017,O,2002-04-04,NN,,1413ZC,2015-03-18T01:15:27,true,4,,,,,COSTE DE PASTOUREL,30360,SAINT ETIENNE DE L'OLM,,,30250,,,,,,,,,,,,,,,,,,,2013-12-17,F,,,,,14.13Z,NAFRev2,N,,,0,,,,,,
442056321,00015,44205632100015,O,2002-06-01,NN,,,2013-01-29T04:54:57,true,4,,,,,LA LAUZIERE,30360,SAINT ETIENNE DE L'OLM,,,30250,,,,,,,,,,,,,,,,,,,2012-12-31,F,,,,,01.49Z,NAFRev2,N,6.1517686,44.6984057,0.89,poi.track,La Lauzière (Chemin) Saint-Michel-de-Chaillol,https://osm.org/way/190755462,G,,
443551924,00022,44355192400022,O,2003-01-10,NN,,,,false,2,MAS MAYA,,,,,30360,SAINT ETIENNE DE L'OLM,,,30250,,,,,,,,,,,,,,,,,,,2003-08-28,F,,,,,,,,,,0,,,,,,
449619030,00025,44961903000025,O,2012-06-30,,,,2019-04-18T17:05:55,false,2,LE VILLAGE,,,PL,DE L ABREUVOIR,30360,SAINT ETIENNE DE L'OLM,,,30250,,,,,,,,,,,,,,,,,,,2013-01-07,F,,,,,86.21Z,NAFRev2,N,4.184985,44.058424,0.84,street,Place de l’Abreuvoir 30360 Saint-Étienne-de-l'Olm,30250_0010,G,PLACE DE L ABREUVOIR,
449957539,00017,44995753900017,O,2003-10-01,NN,,,2022-07-13T08:44:57,true,7,,,,,LA LAUZIERE,30360,SAINT ETIENNE DE L'OLM,,,30250,,,,,,,,,,,,,,,,,,,2022-06-30,F,,,,,85.59A,NAFRev2,O,6.1517686,44.6984057,0.89,poi.track,La Lauzière (Chemin) Saint-Michel-de-Chaillol,https://osm.org/way/190755462,G,,
450135827,00019,45013582700019,O,2003-10-02,NN,,,2008-11-08T02:29:37,true,3,,,,,,30360,SAINT ETIENNE DE L'OLM,,,30250,,,,,,,,,,,,,,,,,,,2003-12-31,F,,,,,45.3A,NAFRev1,N,,,0,,,,,,
450326921,00019,45032692100019,O,2003-07-02,NN,,,2007-05-21T23:56:36,true,4,LE PEYRAL,,,,,30360,SAINT ETIENNE DE L'OLM,,,30250,,,,,,,,,,,,,,,,,,,2005-08-09,F,,,,,52.6E,NAFRev1,N,,,0,,,,,,
452228612,00027,45222861200027,O,2004-03-01,,,,2008-04-26T17:28:24,false,4,,,,,,30360,SAINT ETIENNE DE L'OLM,,,30250,,,,,,,,,,,,,,,,,,,2008-01-01,A,INOX 30,,,,25.99A,NAFRev2,N,,,0,,,,,,
452826480,00025,45282648000025,O,2005-06-05,NN,,,2010-04-18T10:29:44,true,3,,,,,LA LAUZIERE,30360,SAINT ETIENNE DE L'OLM,,,30250,,,,,,,,,,,,,,,,,,,2008-12-31,A,,,,,59.11C,NAFRev2,N,6.1517686,44.6984057,0.89,poi.track,La Lauzière (Chemin) Saint-Michel-de-Chaillol,https://osm.org/way/190755462,G,,
452998099,00025,45299809900025,O,2017-06-13,,,,2021-02-23T13:37:11,true,1,,159,,CHE,DES GALABRUNES,30360,SAINT ETIENNE DE L'OLM,,,30250,,,,,,,,,,,,,,,,,,,2017-06-13,A,,,,,96.09Z,NAFRev2,N,4.180722,44.062133,0.88,housenumber,159 Chemin des Galabrunes 30360 Saint-Étienne-de-l'Olm,30250_0090_00159,G,159 CHEMIN DES GALABRUNES,
453000812,00017,45300081200017,O,2004-04-01,NN,,4332CZ,2017-03-28T13:26:25,true,5,,,,,LA CALADE DE L ECOLE,30360,SAINT ETIENNE DE L'OLM,,,30250,,,,,,,,,,,,,,,,,,,2008-09-09,F,,,,,43.32C,NAFRev2,N,4.184596,44.05805,0.82,street,Calade de l’Ecole 30360 Saint-Étienne-de-l'Olm,30250_6opii6,G,CALADE DE L ECOLE,
453796450,00014,45379645000014,O,2004-06-15,NN,,,2008-11-08T02:39:23,true,3,,,,,LE VILLAGE,30360,SAINT ETIENNE DE L'OLM,,,30250,,,,,,,,,,,,,,,,,,,2005-12-31,F,,,,,45.3A,NAFRev1,N,4.180948,44.068093,0.42,locality,Ville Montant 30360 Saint-Étienne-de-l'Olm,30250_B054,G,VILLE MONTANT,
480845916,00034,48084591600034,O,2010-05-25,NN,,,2016-04-26T03:03:15,false,5,,,,CHE,DES GALABRUNES,30360,SAINT ETIENNE DE L'OLM,,,30250,,,,,,,,,,,,,,,,,,,2014-11-01,F,,,,,73.11Z,NAFRev2,O,4.180622,44.061738,0.87,street,Chemin des Galabrunes 30360 Saint-Étienne-de-l'Olm,30250_0090,G,CHEMIN DES GALABRUNES,
481349405,00037,48134940500037,O,2011-02-15,,,,2012-01-07T12:44:37,true,2,,,,PL,DU REMPART,30360,SAINT ETIENNE DE L'OLM,,,30250,,,,,,,,,,,,,,,,,,,2011-10-05,F,,,,LES VIEILLES PIERRES DE LA GARDONNENQUE,68.10Z,NAFRev2,N,4.184727,44.059374,0.81,street,Place du Rempart 30360 Saint-Étienne-de-l'Olm,30250_gkpfpj,G,PLACE DU REMPART,
488923897,00018,48892389700018,O,2006-01-19,NN,,,2009-06-27T12:52:50,true,2,,,,,,30360,SAINT ETIENNE DE L'OLM,,,30250,,,,,,,,,,,,,,,,,,,2007-01-31,F,,,,,36.1C,NAFRev1,O,,,0,,,,,,
489957191,00013,48995719100013,O,2006-04-20,NN,,,2010-04-18T12:01:48,false,4,,,,QUA,LE PEYRAL,30360,SAINT ETIENNE DE L'OLM,,,30250,,,,,,,,,,,,,,,,,,,2008-01-02,F,,,,,46.90Z,NAFRev2,O,,,0,,,,,,
490202413,00020,49020241300020,O,2007-01-01,,,,2008-11-08T03:03:24,false,1,,,,,LA LAUZIERE,30360,SAINT ETIENNE DE L'OLM,,,30250,,,,,,,,,,,,,,,,,,,2007-01-01,F,,,,,45.2A,NAFRev1,N,6.1517686,44.6984057,0.89,poi.track,La Lauzière (Chemin) Saint-Michel-de-Chaillol,https://osm.org/way/190755462,G,,
491187886,00016,49118788600016,O,2006-06-09,,,,2021-11-16T11:37:21,true,3,,,,LD,FEUILLERAS,30360,SAINT ETIENNE DE L'OLM,,,30250,,,,,,,,,,,,,,,,,,,2021-11-13,F,,,,,68.20B,NAFRev2,N,4.18494,44.058833,0.35,street,Calade du Terrailler 30360 Saint-Étienne-de-l'Olm,30250_acb2no,G,CALADE DU TERRAILLER,
492730874,00012,49273087400012,O,2006-04-01,,,,2012-02-06T02:47:55,true,3,,,,,LES CLAUX,30360,SAINT ETIENNE DE L'OLM,,,30250,,,,,,,,,,,,,,,,,,,2011-06-06,F,,,,,01.21Z,NAFRev2,N,4.185023,44.061219,0.74,street,Chemin des Claux 30360 Saint-Étienne-de-l'Olm,30250_0060,G,CHEMIN DES CLAUX,
492923578,00040,49292357800040,O,2012-01-01,NN,,,2017-05-04T06:43:22,false,3,,2,,PL,DU REMPART,30360,SAINT ETIENNE DE L'OLM,,,30250,,,,,,,,,,,,,,,,,,,2015-09-14,F,,,,,66.22Z,NAFRev2,O,4.184921,44.059245,0.82,housenumber,2 Place du Rempart 30360 Saint-Étienne-de-l'Olm,30250_gkpfpj_00002,G,2 PLACE DU REMPART,
493446074,00038,49344607400038,O,2013-02-01,,,,2013-09-09T11:36:55,true,2,,,,RUE,DU TIRAGE,30360,SAINT ETIENNE DE L'OLM,,,30250,,,,,,,,,,,,,,,,,,,2013-09-04,F,,,,,96.03Z,NAFRev2,N,4.185533,44.058855,0.94,street,Rue du Tirage 30360 Saint-Étienne-de-l'Olm,30250_0120,G,RUE DU TIRAGE,
493992556,00032,49399255600032,O,2014-04-22,,,,2021-02-23T14:02:15,true,1,,19,,RTE,DE VEZENOBRES,30360,SAINT ETIENNE DE L'OLM,,,30250,,,,,,,,,,,,,,,,,,,2014-04-22,A,,,,,74.10Z,NAFRev2,N,4.178099,44.059915,0.86,housenumber,19 Route de Vézenobres 30360 Saint-Étienne-de-l'Olm,30250_0130_00019,G,19 ROUTE DE VEZENOBRES,
501033542,00017,50103354200017,O,2007-11-12,,,,2014-07-10T01:03:29,true,3,,,,,LES CLAUX,30360,SAINT ETIENNE DE L'OLM,,,30250,,,,,,,,,,,,,,,,,,,2010-11-30,F,,,,,43.21A,NAFRev2,N,4.185023,44.061219,0.74,street,Chemin des Claux 30360 Saint-Étienne-de-l'Olm,30250_0060,G,CHEMIN DES CLAUX,
501482384,00010,50148238400010,P,2007-11-12,,,4321AB,2022-01-07T04:01:49,true,5,[ND],[ND],[ND],[ND],[ND],[ND],SAINT ETIENNE DE L'OLM,,[ND],30250,[ND],[ND],,,[ND],[ND],[ND],[ND],[ND],[ND],,,[ND],,[ND],[ND],,,2021-12-31,F,[ND],[ND],[ND],[ND],43.21A,NAFRev2,N,,,0,,,,,,
504070111,00019,50407011100019,O,2008-04-25,NN,,,2016-04-26T02:16:03,true,1,,,,,LES CLAUX,30360,SAINT ETIENNE DE L'OLM,,,30250,,,,,,,,,,,,,,,,,,,2008-04-25,A,,,,,01.21Z,NAFRev2,N,4.185023,44.061219,0.74,street,Chemin des Claux 30360 Saint-Étienne-de-l'Olm,30250_0060,G,CHEMIN DES CLAUX,
504507229,00012,50450722900012,O,2008-06-01,NN,,,2012-05-05T14:04:57,false,4,,,,QUA,LE PEYRAL,30360,SAINT ETIENNE DE L'OLM,,,30250,,,,,,,,,,,,,,,,,,,2010-05-06,F,SD FRANCE,,,,46.73B,NAFRev2,O,,,0,,,,,,
504909920,00010,50490992000010,P,2008-07-05,,,,2014-07-10T01:22:58,false,2,[ND],[ND],[ND],[ND],[ND],[ND],SAINT ETIENNE DE L'OLM,,[ND],30250,[ND],[ND],,,[ND],[ND],[ND],[ND],[ND],[ND],,,[ND],,[ND],[ND],,,2010-02-23,F,[ND],[ND],[ND],[ND],31.09B,NAFRev2,N,,,0,,,,,,