siren,nic,siret,statutDiffusionEtablissement,dateCreationEtablissement,trancheEffectifsEtablissement,anneeEffectifsEtablissement,activitePrincipaleRegistreMetiersEtablissement,dateDernierTraitementEtablissement,etablissementSiege,nombrePeriodesEtablissement,complementAdresseEtablissement,numeroVoieEtablissement,indiceRepetitionEtablissement,typeVoieEtablissement,libelleVoieEtablissement,codePostalEtablissement,libelleCommuneEtablissement,libelleCommuneEtrangerEtablissement,distributionSpecialeEtablissement,codeCommuneEtablissement,codeCedexEtablissement,libelleCedexEtablissement,codePaysEtrangerEtablissement,libellePaysEtrangerEtablissement,complementAdresse2Etablissement,numeroVoie2Etablissement,indiceRepetition2Etablissement,typeVoie2Etablissement,libelleVoie2Etablissement,codePostal2Etablissement,libelleCommune2Etablissement,libelleCommuneEtranger2Etablissement,distributionSpeciale2Etablissement,codeCommune2Etablissement,codeCedex2Etablissement,libelleCedex2Etablissement,codePaysEtranger2Etablissement,libellePaysEtranger2Etablissement,dateDebut,etatAdministratifEtablissement,enseigne1Etablissement,enseigne2Etablissement,enseigne3Etablissement,denominationUsuelleEtablissement,activitePrincipaleEtablissement,nomenclatureActivitePrincipaleEtablissement,caractereEmployeurEtablissement,longitude,latitude,geo_score,geo_type,geo_adresse,geo_id,geo_ligne,geo_l4,geo_l5
213400211,00016,21340021100016,O,1983-03-01,02,2020,,2022-08-29T09:06:53,true,4,HOTEL DE VILLE,,,,,34360,BABEAU-BOULDOUX,,,34021,,,,,,,,,,,,,,,,,,,2008-01-01,A,MAIRIE,,,,84.11Z,NAFRev2,O,2.913889,43.440931,0.33,street,Rue de la Chapelle 34360 Babeau-Bouldoux,34021_0193,D,RUE DE LA CHAPELLE,
213400211,00024,21340021100024,O,1997-01-01,NN,,,2019-11-14T14:00:34,false,3,HOTEL DE VILLE,,,,,34360,BABEAU-BOULDOUX,,,34021,,,,,,,,,,,,,,,,,,,2008-01-01,A,SERVICE DES EAUX,,,,36.00Z,NAFRev2,N,2.913889,43.440931,0.33,street,Rue de la Chapelle 34360 Babeau-Bouldoux,34021_0193,D,RUE DE LA CHAPELLE,
213400211,00032,21340021100032,O,1997-01-01,NN,,,2019-11-14T14:00:34,false,3,HOTEL DE VILLE,,,,,34360,BABEAU-BOULDOUX,,,34021,,,,,,,,,,,,,,,,,,,2008-01-01,A,SERVICE ASSAINISSEMENT,,,,37.00Z,NAFRev2,N,2.913889,43.440931,0.33,street,Rue de la Chapelle 34360 Babeau-Bouldoux,34021_0193,D,RUE DE LA CHAPELLE,
253400543,00018,25340054300018,O,1983-03-01,NN,,,2019-11-14T14:00:34,true,5,,,,,HOTEL DE VILLE,34360,BABEAU-BOULDOUX,,,34021,,,,,,,,,,,,,,,,,,,2017-12-07,F,,,,,35.12Z,NAFRev2,N,2.913889,43.440931,0.33,street,Rue de la Chapelle 34360 Babeau-Bouldoux,34021_0193,G,RUE DE LA CHAPELLE,
263403693,00017,26340369300017,O,1995-12-25,,,,2019-11-14T14:00:34,true,3,,,,,,34360,BABEAU-BOULDOUX,,,34021,,,,,,,,,,,,,,,,,,,2016-01-01,F,CCAS,,,,88.99B,NAFRev2,N,,,0,,,,,,
293400974,00011,29340097400011,O,1983-09-14,NN,,,2019-11-14T14:00:34,true,3,,,,,HOTEL DE VILLE,34360,BABEAU-BOULDOUX,,,34021,,,,,,,,,,,,,,,,,,,2008-01-01,A,,,,,42.99Z,NAFRev2,N,2.913889,43.440931,0.33,street,Rue de la Chapelle 34360 Babeau-Bouldoux,34021_0193,G,RUE DE LA CHAPELLE,
315729871,00030,31572987100030,O,2002-06-01,,,,2019-11-14T14:00:34,false,3,,,,RUE,DE LA VALLEE,34360,BABEAU-BOULDOUX,,,34021,,,,,,,,,,,,,,,,,,,2008-01-01,A,,,,,01.21Z,NAFRev2,O,2.908661,43.436131,0.94,street,Rue de la Vallee 34360 Babeau-Bouldoux,34021_0131,G,RUE DE LA VALLEE,
318155173,00020,31815517300020,O,1983-05-09,NN,,,2019-11-14T14:00:34,true,4,,,,,,34360,BABEAU-BOULDOUX,,,34021,,,,,,,,,,,,,,,,,,,2017-01-14,F,,,,,47.21Z,NAFRev2,N,,,0,,,,,,
321573354,00016,32157335400016,O,1981-04-16,NN,,,2019-11-14T14:00:34,true,1,,,,RUE,DU CIMETIERE,34360,BABEAU-BOULDOUX,,,34021,,,,,,,,,,,,,,,,,,,2002-01-30,F,,,,,01.1G,NAF1993,N,2.908047,43.436028,0.4,street,Rue du Four des Flammes 34360 Babeau-Bouldoux,34021_05xrom,G,RUE DU FOUR DES FLAMMES,
322276437,00025,32227643700025,O,1984-07-01,NN,,,2019-11-14T14:00:34,true,1,,,,,,34360,BABEAU-BOULDOUX,,,34021,,,,,,,,,,,,,,,,,,,1998-06-30,F,,,,,50.1Z,NAF1993,N,,,0,,,,,,
322328535,00016,32232853500016,O,1981-07-04,NN,,,2019-11-14T14:00:34,true,3,,,,,,34360,BABEAU-BOULDOUX,,,34021,,,,,,,,,,,,,,,,,,,2007-09-30,F,,,,,36.5Z,NAFRev1,N,,,0,,,,,,
324908839,00016,32490883900016,O,1981-01-01,NN,,,2019-11-14T14:00:34,true,3,,,,,LA SERVELIERE A DONNADIEU,34360,BABEAU-BOULDOUX,,,34021,,,,,,,,,,,,,,,,,,,2008-01-01,A,,,,,01.21Z,NAFRev2,N,2.892327,43.424159,0.44,street,Donnadieu 34360 Babeau-Bouldoux,34021_oi6iuc,G,DONNADIEU,
326453511,00015,32645351100015,O,1983-01-01,NN,,,2019-11-14T14:00:34,true,4,,,,,,34360,BABEAU-BOULDOUX,,,34021,,,,,,,,,,,,,,,,,,,2014-11-19,F,,,,,01.21Z,NAFRev2,N,,,0,,,,,,
326470556,00019,32647055600019,O,1983-01-01,NN,,,2019-11-14T14:00:34,true,3,,,,,,34360,BABEAU-BOULDOUX,,,34021,,,,,,,,,,,,,,,,,,,2008-01-01,A,,,,,01.13Z,NAFRev2,N,,,0,,,,,,
328985007,00017,32898500700017,O,1983-12-22,NN,,,2019-11-14T14:00:34,false,4,,,,,,34360,BABEAU-BOULDOUX,,,34021,,,,,,,,,,,,,,,,,,,2018-10-30,F,,,,,68.20B,NAFRev2,N,,,0,,,,,,
328985007,00025,32898500700025,O,2018-10-30,,,,2021-02-23T10:49:58,true,1,,3,,RUE,DES JARDINS,34360,BABEAU-BOULDOUX,,,34021,,,,,,,,,,,,,,,,,,,2018-10-30,A,,,,,68.20B,NAFRev2,N,2.913099,43.440749,0.94,housenumber,3 Rue des Jardins 34360 Babeau-Bouldoux,34021_0060_00003,G,3 RUE DES JARDINS,
329570048,00010,32957004800010,O,1984-02-15,NN,,,2019-11-14T14:00:34,true,4,,,,,,34360,BABEAU-BOULDOUX,,,34021,,,,,,,,,,,,,,,,,,,2017-12-31,F,,,,,01.21Z,NAFRev2,N,,,0,,,,,,
331834028,00010,33183402800010,O,1985-02-11,NN,,,2019-11-14T14:00:34,true,6,,,,,,34360,BABEAU-BOULDOUX,,,34021,,,,,,,,,,,,,,,,,,,2008-12-31,F,,,,,43.21A,NAFRev2,N,,,0,,,,,,
339002081,00026,33900208100026,O,2001-04-01,,,,2021-06-25T08:56:05,true,4,CAUDURO,,,,,34360,BABEAU-BOULDOUX,,,34021,,,,,,,,,,,,,,,,,,,2021-05-18,F,,,,,01.13Z,NAFRev2,N,,,0,,,,,,
340205111,00024,34020511100024,O,2000-02-23,NN,,,2019-11-14T14:00:34,false,4,,,,,,34360,BABEAU-BOULDOUX,,,34021,,,,,,,,,,,,,,,,,,,2001-07-01,F,,,,,92.3A,NAF1993,N,,,0,,,,,,
340343425,00070,34034342500070,O,1989-12-25,02,2020,,2022-08-29T09:26:15,false,5,,,,,MALIBERT,34360,BABEAU-BOULDOUX,,,34021,,,,,,,,,,,,,,,,,,,2017-07-19,A,MALIBERT,,,,55.20Z,NAFRev2,O,2.910252,43.436439,0.92,street,Route de Malibert 34360 Babeau-Bouldoux,34021_0079,G,ROUTE DE MALIBERT,
340707272,00019,34070727200019,O,1987-01-01,NN,,,2019-11-14T14:00:34,true,1,,,,,,34360,BABEAU-BOULDOUX,,,34021,,,,,,,,,,,,,,,,,,,2001-07-31,F,,,,,01.1G,NAF1993,N,,,0,,,,,,
347652653,00010,34765265300010,O,1988-07-07,,,,2019-11-14T14:00:34,true,4,,,,,,34360,BABEAU-BOULDOUX,,,34021,,,,,,,,,,,,,,,,,,,2000-12-31,F,,,,,01.1G,NAF1993,N,,,0,,,,,,
348019324,00014,34801932400014,O,1988-08-22,NN,,,2019-11-14T14:00:34,false,5,,,,,,34360,BABEAU-BOULDOUX,,,34021,,,,,,,,,,,,,,,,,,,2019-01-01,A,,,,,01.21Z,NAFRev2,N,,,0,,,,,,
350082137,00018,35008213700018,O,1989-03-21,NN,,,2019-11-14T14:00:34,true,4,,,,IMP,DU PORCHE,34360,BABEAU-BOULDOUX,,,34021,,,,,,,,,,,,,,,,,,,2010-06-10,A,,,,,01.21Z,NAFRev2,N,2.913673,43.440546,0.8,street,Impasse du Porche 34360 Babeau-Bouldoux,34021_0099,G,IMPASSE DU PORCHE,
351300900,00013,35130090000013,O,1989-07-05,NN,,,2019-11-14T14:00:34,true,4,,,,,PIERRE MORTE,34360,BABEAU-BOULDOUX,,,34021,,,,,,,,,,,,,,,,,,,1998-06-08,F,,,,,55.3A,NAF1993,N,4.1410721,44.311018,0.89,poi.information,Pierre Morte (Informations) Courry,https://osm.org/node/4658195028,G,,
353737851,00017,35373785100017,O,1990-02-06,NN,,,2019-11-14T14:00:34,true,3,,,,LD,DONNADIEU,34360,BABEAU-BOULDOUX,,,34021,,,,,,,,,,,,,,,,,,,2008-01-01,A,,,,,01.21Z,NAFRev2,N,2.892327,43.424159,0.94,street,Donnadieu 34360 Babeau-Bouldoux,34021_oi6iuc,G,DONNADIEU,
377832886,00016,37783288600016,O,1990-05-01,NN,,,2019-11-14T14:00:34,true,4,,,,,,34360,BABEAU-BOULDOUX,,,34021,,,,,,,,,,,,,,,,,,,2013-12-31,F,,,,,47.81Z,NAFRev2,N,,,0,,,,,,
377832886,00024,37783288600024,O,1989-11-25,NN,,,2019-11-14T14:00:34,false,5,,,,,,34360,BABEAU-BOULDOUX,,,34021,,,,,,,,,,,,,,,,,,,2011-12-31,F,,,,,01.13Z,NAFRev2,N,,,0,,,,,,
378692651,00011,37869265100011,O,1990-07-12,NN,,,2019-11-14T14:00:34,true,3,,,,RUE,DES CACTUS,34360,BABEAU-BOULDOUX,,,34021,,,,,,,,,,,,,,,,,,,2008-01-01,A,,,,,68.20B,NAFRev2,N,2.908035,43.435751,0.94,street,Rue des Cactus 34360 Babeau-Bouldoux,34021_0036,G,RUE DES CACTUS,
379676091,00042,37967609100042,O,2010-01-30,,,,2019-11-14T14:00:34,true,2,,3,,RUE,DES CACTUS,34360,BABEAU-BOULDOUX,,,34021,,,,,,,,,,,,,,,,,,,2012-05-31,F,,,,,47.78C,NAFRev2,N,2.908035,43.435751,0.94,housenumber,3 Rue des Cactus 34360 Babeau-Bouldoux,34021_0036_00003,G,3 RUE DES CACTUS,
381544865,00045,38154486500045,O,2008-04-02,,,,2019-11-14T14:00:34,false,2,,,,RUE,DE LA VALLEE,34360,BABEAU-BOULDOUX,,,34021,,,,,,,,,,,,,,,,,,,2008-12-31,F,,,,,68.31Z,NAFRev2,N,2.908661,43.436131,0.94,street,Rue de la Vallee 34360 Babeau-Bouldoux,34021_0131,G,RUE DE LA VALLEE,
390754836,00018,39075483600018,O,,NN,,,2019-11-14T14:00:34,true,1,,,,,REC DE LONGUE SAUME,34360,BABEAU-BOULDOUX,,,34021,,,,,,,,,,,,,,,,,,,1994-03-01,F,,,,,52.6E,NAF1993,N,2.895983,43.426871,0.93,locality,Rec de Longue Saume 34360 Babeau-Bouldoux,34021_B082,G,REC DE LONGUE SAUME,
391125341,00019,39112534100019,O,1992-01-01,NN,,,2019-11-14T14:00:34,true,3,,,,,,34360,BABEAU-BOULDOUX,,,34021,,,,,,,,,,,,,,,,,,,2008-01-01,A,,,,,01.21Z,NAFRev2,N,,,0,,,,,,
391798832,00013,39179883200013,O,1993-06-07,NN,,,2019-11-14T14:00:34,false,3,CHEZ ROUANET JEAN CLAUDE,,,,,34360,BABEAU-BOULDOUX,,,34021,,,,,,,,,,,,,,,,,,,2007-03-26,F,,,,,01.4A,NAFRev1,N,,,0,,,,,,
393493903,00016,39349390300016,O,1994-01-01,NN,,,2019-11-14T14:00:34,true,3,,,,,CHEZ MR J DECOR,34360,BABEAU-BOULDOUX,,,34021,,,,,,,,,,,,,,,,,,,2008-01-01,A,,,,,01.21Z,NAFRev2,N,,,0,,,,,,
394198303,00015,39419830300015,O,1993-04-14,NN,,,2019-11-14T14:00:34,true,3,,,,,DONNADIEU,34360,BABEAU-BOULDOUX,,,34021,,,,,,,,,,,,,,,,,,,2008-01-01,A,,,,,01.21Z,NAFRev2,N,2.892327,43.424159,0.94,street,Donnadieu 34360 Babeau-Bouldoux,34021_oi6iuc,G,DONNADIEU,
399847045,00016,39984704500016,O,1994-02-02,NN,,,2019-11-14T14:00:34,true,3,,,,,,34360,BABEAU-BOULDOUX,,,34021,,,,,,,,,,,,,,,,,,,2008-01-01,A,,,,,01.21Z,NAFRev2,N,,,0,,,,,,
399946755,00010,39994675500010,O,1994-02-13,NN,,,2019-11-14T14:00:34,true,1,,,,,,34360,BABEAU-BOULDOUX,,,34021,,,,,,,,,,,,,,,,,,,2000-01-17,F,,,,,01.1G,NAF1993,N,,,0,,,,,,
401152582,00037,40115258200037,O,2017-11-22,,,,2019-11-14T14:00:34,false,1,,,,,PISCICULTURE DE MALIBERT,34360,BABEAU-BOULDOUX,,,34021,,,,,,,,,,,,,,,,,,,2017-11-22,A,,,,,03.22Z,NAFRev2,O,2.910252,43.436439,0.53,street,Route de Malibert 34360 Babeau-Bouldoux,34021_0079,G,ROUTE DE MALIBERT,
401195615,00018,40119561500018,O,,NN,,,2019-11-14T14:00:34,true,1,,,,,,34360,BABEAU-BOULDOUX,,,34021,,,,,,,,,,,,,,,,,,,1976-12-25,F,,,,,01.1G,NAF1993,N,,,0,,,,,,
401896519,00014,40189651900014,O,1990-09-30,NN,,,2019-11-14T14:00:34,true,4,,,,HAM,DONNADIEU,34360,BABEAU-BOULDOUX,,,34021,,,,,,,,,,,,,,,,,,,2008-11-24,F,,,,,01.21Z,NAFRev2,N,2.892327,43.424159,0.94,street,Donnadieu 34360 Babeau-Bouldoux,34021_oi6iuc,G,DONNADIEU,
402662746,00013,40266274600013,O,1974-01-01,NN,,,2019-11-14T14:00:34,true,4,,,,,,34360,BABEAU-BOULDOUX,,,34021,,,,,,,,,,,,,,,,,,,2018-07-28,F,,,,,01.21Z,NAFRev2,N,,,0,,,,,,
403440985,00022,40344098500022,O,1998-01-01,NN,,,2021-10-27T08:29:43,true,3,MALIBERT,,,,,34360,BABEAU-BOULDOUX,,,34021,,,,,,,,,,,,,,,,,,,2008-01-01,A,,,,,01.21Z,NAFRev2,N,2.910252,43.436439,0.92,street,Route de Malibert 34360 Babeau-Bouldoux,34021_0079,D,ROUTE DE MALIBERT,
412405805,00018,41240580500018,O,1987-12-31,NN,,,2019-11-14T14:00:34,true,4,,,,,,34360,BABEAU-BOULDOUX,,,34021,,,,,,,,,,,,,,,,,,,2010-01-11,F,,,,,01.21Z,NAFRev2,N,,,0,,,,,,
412407306,00015,41240730600015,O,1987-12-31,NN,,,2019-11-14T14:00:34,true,4,,,,,,34360,BABEAU-BOULDOUX,,,34021,,,,,,,,,,,,,,,,,,,2008-01-01,A,,,,,01.21Z,NAFRev2,N,,,0,,,,,,
412415721,00015,41241572100015,O,1987-12-31,NN,,,2019-11-14T14:00:34,true,3,,,,,,34360,BABEAU-BOULDOUX,,,34021,,,,,,,,,,,,,,,,,,,2007-08-30,F,,,,,01.1G,NAFRev1,N,,,0,,,,,,
412416539,00010,41241653900010,O,1988-06-01,NN,,,2020-02-05T10:53:06,true,3,,,,,,34360,BABEAU-BOULDOUX,,,34021,,,,,,,,,,,,,,,,,,,2008-01-01,A,,,,,01.21Z,NAFRev2,N,,,0,,,,,,
412417388,00011,41241738800011,O,1993-06-28,NN,,,2019-11-14T14:00:34,true,4,,,,,,34360,BABEAU-BOULDOUX,,,34021,,,,,,,,,,,,,,,,,,,2012-07-19,F,,,,,01.21Z,NAFRev2,N,,,0,,,,,,
412417461,00016,41241746100016,O,1987-12-31,NN,,,2019-11-14T14:00:34,true,3,,,,,,34360,BABEAU-BOULDOUX,,,34021,,,,,,,,,,,,,,,,,,,2007-08-30,F,,,,,01.1G,NAFRev1,N,,,0,,,,,,
412423774,00014,41242377400014,O,1992-12-01,NN,,,2019-11-14T14:00:34,true,3,,,,,,34360,BABEAU-BOULDOUX,,,34021,,,,,,,,,,,,,,,,,,,2004-12-01,F,,,,,01.1G,NAFRev1,N,,,0,,,,,,
412427619,00017,41242761900017,O,1994-10-29,NN,,,2019-11-14T14:00:34,true,4,,,,,,34360,BABEAU-BOULDOUX,,,34021,,,,,,,,,,,,,,,,,,,2008-10-15,F,,,,,01.21Z,NAFRev2,N,,,0,,,,,,
412428328,00014,41242832800014,O,1995-12-01,NN,,,2019-11-14T14:00:34,true,4,,,,,,34360,BABEAU-BOULDOUX,,,34021,,,,,,,,,,,,,,,,,,,2000-06-14,F,,,,,01.1G,NAF1993,N,,,0,,,,,,
412429177,00014,41242917700014,O,1989-12-31,NN,,,2021-09-17T08:49:04,true,4,,,,,,34360,BABEAU-BOULDOUX,,,34021,,,,,,,,,,,,,,,,,,,2018-12-31,F,,,,,01.21Z,NAFRev2,N,,,0,,,,,,
412985731,00030,41298573100030,O,2013-05-06,,,,2019-11-14T14:00:34,true,2,DONNADIEU,,,RUE,DE LA FONTAINE,34360,BABEAU-BOULDOUX,,,34021,,,,,,,,,,,,,,,,,,,2015-12-31,F,,,,,85.59A,NAFRev2,N,2.908932,43.435696,0.62,street,Rue de la Forge 34360 Babeau-Bouldoux,34021_0050,G,RUE DE LA FORGE,
413638230,00016,41363823000016,O,1988-12-31,NN,,,2019-11-14T14:00:34,true,3,,,,,BOULDOUX,34360,BABEAU-BOULDOUX,,,34021,,,,,,,,,,,,,,,,,,,2008-01-01,A,,,,,01.21Z,NAFRev2,N,2.912394,43.440089,0.91,street,Grand Rue 34360 Babeau-Bouldoux,34021_0119,G,GRAND RUE,
413641283,00010,41364128300010,O,1987-12-31,NN,,,2019-11-14T14:00:34,true,3,,,,,,34360,BABEAU-BOULDOUX,,,34021,,,,,,,,,,,,,,,,,,,2008-01-01,A,,,,,01.21Z,NAFRev2,N,,,0,,,,,,
413641283,00028,41364128300028,O,2006-09-20,,,,2021-02-23T11:35:58,false,2,,,,RUE,DES 4 COINS,34360,BABEAU-BOULDOUX,,,34021,,,,,,,,,,,,,,,,,,,2008-01-01,A,,,,,01.61Z,NAFRev2,N,2.908615,43.435736,0.94,street,Rue des 4 Coins 34360 Babeau-Bouldoux,34021_0044,G,RUE DES 4 COINS,
413651738,00010,41365173800010,O,1987-12-31,NN,,,2019-11-14T14:00:34,true,1,,,,,,34360,BABEAU-BOULDOUX,,,34021,,,,,,,,,,,,,,,,,,,1999-12-31,F,,,,,01.1G,NAF1993,N,,,0,,,,,,
413821075,00012,41382107500012,O,1996-06-01,,,,2019-11-14T14:00:34,false,3,,,,,PIERREMORTE,34360,BABEAU-BOULDOUX,,,34021,,,,,,,,,,,,,,,,,,,1996-12-31,F,,,,,55.3A,NAF1993,N,,,0,,,,,,
414545848,00015,41454584800015,O,1997-07-15,NN,,,2019-11-14T14:00:34,true,4,ROBERT GINETTE,,,RUE,DE L'EGLISE,34360,BABEAU-BOULDOUX,,,34021,,,,,,,,,,,,,,,,,,,2009-03-31,F,,,,,01.21Z,NAFRev2,N,2.911983,43.439396,0.7,locality,Chemin de l’Eglise 34360 Babeau-Bouldoux,34021_B032,G,CHEMIN DE L EGLISE,
419799150,00042,41979915000042,O,2018-09-24,,,,2021-02-23T11:40:44,true,1,,,,RTE,DE MALIBERT,34360,BABEAU-BOULDOUX,,,34021,,,,,,,,,,,,,,,,,,,2018-09-24,A,,,,,47.99A,NAFRev2,N,2.910252,43.436439,0.83,street,Route de Malibert 34360 Babeau-Bouldoux,34021_0079,G,ROUTE DE MALIBERT,
421149592,00022,42114959200022,O,2001-01-01,NN,,,2019-11-14T14:00:34,false,3,CHEZ M ROUANET JEAN CLAUDE,,,,,34360,BABEAU-BOULDOUX,,,34021,,,,,,,,,,,,,,,,,,,2008-01-01,F,,,,,68.20B,NAFRev2,N,,,0,,,,,,
421149592,00030,42114959200030,O,2016-03-08,,,,2021-02-23T11:42:21,true,1,,,,RUE,DES CACTUS,34360,BABEAU-BOULDOUX,,,34021,,,,,,,,,,,,,,,,,,,2016-03-08,A,,,,,68.20B,NAFRev2,N,2.908035,43.435751,0.94,street,Rue des Cactus 34360 Babeau-Bouldoux,34021_0036,G,RUE DES CACTUS,
422566752,00016,42256675200016,O,1999-04-15,NN,,,2019-11-14T14:00:34,true,4,,,,RUE,DES JARDINS,34360,BABEAU-BOULDOUX,,,34021,,,,,,,,,,,,,,,,,,,2017-12-31,F,,,,,01.13Z,NAFRev2,N,2.913256,43.440958,0.94,street,Rue des Jardins 34360 Babeau-Bouldoux,34021_0060,G,RUE DES JARDINS,
422728238,00011,42272823800011,O,1991-08-20,01,2020,,2022-08-29T09:04:01,true,3,,,,,,34360,BABEAU-BOULDOUX,,,34021,,,,,,,,,,,,,,,,,,,2008-01-01,A,,,,,01.21Z,NAFRev2,N,,,0,,,,,,
422961680,00010,42296168000010,O,1999-01-01,NN,,,2019-11-14T14:00:34,true,3,,,,,,34360,BABEAU-BOULDOUX,,,34021,,,,,,,,,,,,,,,,,,,2008-01-01,A,,,,,01.21Z,NAFRev2,N,,,0,,,,,,
428389639,00017,42838963900017,O,1986-01-01,NN,,,2019-11-14T14:00:34,true,3,,,,,,34360,BABEAU-BOULDOUX,,,34021,,,,,,,,,,,,,,,,,,,2001-12-31,F,,,,,01.3Z,NAF1993,N,,,0,,,,,,
428389936,00017,42838993600017,O,1988-01-01,NN,,,2019-11-14T14:00:34,true,3,,,,,,34360,BABEAU-BOULDOUX,,,34021,,,,,,,,,,,,,,,,,,,2008-01-01,A,,,,,01.21Z,NAFRev2,N,,,0,,,,,,
428390173,00014,42839017300014,O,1989-01-01,NN,,,2019-11-14T14:00:34,true,3,,,,,,34360,BABEAU-BOULDOUX,,,34021,,,,,,,,,,,,,,,,,,,2008-01-01,A,,,,,01.21Z,NAFRev2,N,,,0,,,,,,
428390181,00017,42839018100017,O,1989-01-01,NN,,,2019-11-14T14:00:34,true,3,,,,,,34360,BABEAU-BOULDOUX,,,34021,,,,,,,,,,,,,,,,,,,2008-01-01,A,,,,,01.21Z,NAFRev2,N,,,0,,,,,,
428390215,00013,42839021500013,O,1989-01-01,NN,,,2019-11-14T14:00:34,true,3,,,,,,34360,BABEAU-BOULDOUX,,,34021,,,,,,,,,,,,,,,,,,,2008-01-01,A,,,,,01.21Z,NAFRev2,N,,,0,,,,,,
428390785,00015,42839078500015,O,1995-01-01,NN,,,2019-11-14T14:00:34,true,3,,,,,,34360,BABEAU-BOULDOUX,,,34021,,,,,,,,,,,,,,,,,,,2008-01-01,A,,,,,01.21Z,NAFRev2,N,,,0,,,,,,
428391296,00012,42839129600012,O,1968-01-01,NN,,,2019-11-14T14:00:34,true,1,,,,,,34360,BABEAU-BOULDOUX,,,34021,,,,,,,,,,,,,,,,,,,1998-06-29,F,,,,,01.3Z,NAF1993,N,,,0,,,,,,
428391304,00014,42839130400014,O,1969-01-01,NN,,,2019-11-14T14:00:34,true,3,,,,,,34360,BABEAU-BOULDOUX,,,34021,,,,,,,,,,,,,,,,,,,2008-01-01,A,,,,,01.21Z,NAFRev2,N,,,0,,,,,,
428391312,00017,42839131200017,O,1968-01-01,NN,,,2019-11-14T14:00:34,true,3,,,,,,34360,BABEAU-BOULDOUX,,,34021,,,,,,,,,,,,,,,,,,,2008-01-01,A,,,,,01.21Z,NAFRev2,N,,,0,,,,,,
428411961,00017,42841196100017,O,1968-01-01,NN,,,2019-11-14T14:00:34,true,3,,,,,,34360,BABEAU-BOULDOUX,,,34021,,,,,,,,,,,,,,,,,,,2008-01-01,A,,,,,01.21Z,NAFRev2,N,,,0,,,,,,
428411979,00019,42841197900019,O,1968-01-01,NN,,,2019-11-14T14:00:34,true,1,,,,,,34360,BABEAU-BOULDOUX,,,34021,,,,,,,,,,,,,,,,,,,2001-12-22,F,,,,,01.3Z,NAF1993,N,,,0,,,,,,
428650394,00045,42865039400045,O,2004-07-01,,,,2021-02-23T11:48:10,true,1,,,,LD,CAUDURO,34360,BABEAU-BOULDOUX,,,34021,,,,,,,,,,,,,,,,,,,2004-07-01,A,,,,,68.20A,NAFRev2,N,,,0,,,,,,
428657472,00018,42865747200018,O,1987-01-01,NN,,,2019-11-14T14:00:34,true,4,,,,,,34360,BABEAU-BOULDOUX,,,34021,,,,,,,,,,,,,,,,,,,2016-12-31,F,,,,,90.01Z,NAFRev2,N,,,0,,,,,,
430398081,00017,43039808100017,O,2000-04-05,NN,,,2019-11-14T14:00:34,true,4,,,,,,34360,BABEAU-BOULDOUX,,,34021,,,,,,,,,,,,,,,,,,,2003-02-28,F,,,,,45.3A,NAFRev1,N,,,0,,,,,,
430398107,00010,43039810700010,O,2000-04-05,NN,,,2019-11-14T14:00:34,true,4,,,,,,34360,BABEAU-BOULDOUX,,,34021,,,,,,,,,,,,,,,,,,,2003-02-28,F,,,,,45.3A,NAFRev1,N,,,0,,,,,,
430843219,00014,43084321900014,O,1980-01-01,NN,,,2019-11-14T14:00:34,true,3,,,,,DONNADIEU,34360,BABEAU-BOULDOUX,,,34021,,,,,,,,,,,,,,,,,,,2008-01-01,A,,,,,01.21Z,NAFRev2,N,2.892327,43.424159,0.94,street,Donnadieu 34360 Babeau-Bouldoux,34021_oi6iuc,G,DONNADIEU,
430865360,00019,43086536000019,O,1995-01-01,NN,,,2019-11-14T14:00:34,true,3,,,,,,34360,BABEAU-BOULDOUX,,,34021,,,,,,,,,,,,,,,,,,,2008-01-01,A,,,,,01.21Z,NAFRev2,N,,,0,,,,,,
430865477,00011,43086547700011,O,1982-01-01,NN,,,2019-11-14T14:00:34,true,3,,,,,,34360,BABEAU-BOULDOUX,,,34021,,,,,,,,,,,,,,,,,,,2008-01-01,A,,,,,01.21Z,NAFRev2,N,,,0,,,,,,
430865485,00014,43086548500014,O,1968-01-01,NN,,,2019-11-14T14:00:34,true,3,,,,,DONNADIEU,34360,BABEAU-BOULDOUX,,,34021,,,,,,,,,,,,,,,,,,,2003-12-31,F,,,,,01.3Z,NAFRev1,N,2.892327,43.424159,0.94,street,Donnadieu 34360 Babeau-Bouldoux,34021_oi6iuc,G,DONNADIEU,
432921930,00033,43292193000033,O,2006-04-01,01,2020,4399CZ,2022-08-29T09:11:02,true,4,BABEAU BOULDOU,,,RUE,DES PLANASSES BASSES,34360,BABEAU-BOULDOUX,,,34021,,,,,,,,,,,,,,,,,,,2013-05-21,A,,,,,43.99C,NAFRev2,O,2.91258,43.436988,0.94,street,Rue des Planasses Basses 34360 Babeau-Bouldoux,34021_0192,G,RUE DES PLANASSES BASSES,
437796873,00010,43779687300010,O,2001-05-04,NN,,,2020-03-20T08:32:26,true,3,,,,PL,DU TILLEUL,34360,BABEAU-BOULDOUX,,,34021,,,,,,,,,,,,,,,,,,,2008-01-01,A,,,,,93.29Z,NAFRev2,N,2.91371,43.440816,0.8,street,Place du Tilleul 34360 Babeau-Bouldoux,34021_0129,G,PLACE DU TILLEUL,
439206780,00017,43920678000017,O,2001-07-01,01,2020,,2022-08-29T09:15:17,true,3,,,,,BABEAU,34360,BABEAU-BOULDOUX,,,34021,,,,,,,,,,,,,,,,,,,2008-01-01,A,,,,,01.21Z,NAFRev2,N,2.912394,43.440089,0.91,street,Grand Rue 34360 Babeau-Bouldoux,34021_0119,G,GRAND RUE,
439306606,00021,43930660600021,O,2008-01-01,,,,2021-02-23T13:20:00,true,1,,,,RTE,DE SAINT CHINIAN,34360,BABEAU-BOULDOUX,,,34021,,,,,,,,,,,,,,,,,,,2008-01-01,A,,,,,66.30Z,NAFRev2,N,2.909172,43.434112,0.85,street,Route de Saint Chinian 34360 Babeau-Bouldoux,34021_0046,G,ROUTE DE SAINT CHINIAN,
439364399,00014,43936439900014,O,2001-09-01,NN,,,2019-11-14T14:00:34,true,3,,,,RUE,JOSEPH ROUANET,34360,BABEAU-BOULDOUX,,,34021,,,,,,,,,,,,,,,,,,,2008-01-01,A,,,,,46.34Z,NAFRev2,N,2.911116,43.435637,0.84,street,Avenue Joseph Rouanet 34360 Babeau-Bouldoux,34021_0116,G,AVENUE JOSEPH ROUANET,
441257946,00018,44125794600018,O,2000-06-01,NN,,,2019-11-14T14:00:34,true,4,,,,,,34360,BABEAU-BOULDOUX,,,34021,,,,,,,,,,,,,,,,,,,2009-02-19,F,,,,,01.21Z,NAFRev2,N,,,0,,,,,,
442339214,00037,44233921400037,P,2021-06-01,,,,2021-09-22T14:41:36,true,2,[ND],[ND],[ND],[ND],[ND],[ND],BABEAU-BOULDOUX,,[ND],34021,[ND],[ND],,,[ND],[ND],[ND],[ND],[ND],[ND],,,[ND],,[ND],[ND],,,2021-09-01,A,[ND],[ND],[ND],[ND],96.09Z,NAFRev2,N,,,0,,,,,,
442734646,00015,44273464600015,O,2001-01-01,NN,,,2019-11-14T14:00:34,true,3,,,,RUE,DES CEDRES,34360,BABEAU-BOULDOUX,,,34021,,,,,,,,,,,,,,,,,,,2008-01-01,A,,,,,01.21Z,NAFRev2,N,2.909134,43.435591,0.94,street,Rue des Cedres 34360 Babeau-Bouldoux,34021_0037,G,RUE DES CEDRES,
444755797,00024,44475579700024,O,2022-02-01,,,,2022-04-26T15:04:51,true,1,,,,RUE,DES PLANASSES BASSES,34360,BABEAU-BOULDOUX,,,34021,,,,,,,,,,,,,,,,,,,2022-02-01,A,,,,MODE ATOUT PRIX 34,47.91B,NAFRev2,N,2.91258,43.436988,0.94,street,Rue des Planasses Basses 34360 Babeau-Bouldoux,34021_0192,G,RUE DES PLANASSES BASSES,
448833467,00013,44883346700013,O,2003-06-10,NN,,,2019-11-14T14:00:34,true,5,,,,RUE,DE LA VALLEE,34360,BABEAU-BOULDOUX,,,34021,,,,,,,,,,,,,,,,,,,2005-12-31,F,,,,,45.2V,NAFRev1,N,2.908661,43.436131,0.94,street,Rue de la Vallee 34360 Babeau-Bouldoux,34021_0131,G,RUE DE LA VALLEE,
451638324,00017,45163832400017,O,2004-01-18,NN,,,2019-11-14T14:00:34,true,3,,,,RUE,DES PLANASSES BASSES,34360,BABEAU-BOULDOUX,,,34021,,,,,,,,,,,,,,,,,,,2008-01-01,A,,,,,68.20A,NAFRev2,N,2.91258,43.436988,0.94,street,Rue des Planasses Basses 34360 Babeau-Bouldoux,34021_0192,G,RUE DES PLANASSES BASSES,
452768625,00017,45276862500017,O,2004-03-16,NN,,,2019-11-14T14:00:34,false,2,LE VILLAGE,,,IMP,VISTE,34360,BABEAU-BOULDOUX,,,34021,,,,,,,,,,,,,,,,,,,2004-07-10,F,,,,,,,N,,,0,,,,,,
452948599,00017,45294859900017,O,2004-04-01,NN,,,2019-11-14T14:00:34,false,3,,,,PL,DE LA MAIRIE,34360,BABEAU-BOULDOUX,,,34021,,,,,,,,,,,,,,,,,,,2005-03-01,F,CAMBON MULTI SERVICES,,,,01.4B,NAFRev1,N,2.908677,43.435419,0.82,street,Place de la Mairie 34360 Babeau-Bouldoux,34021_0078,G,PLACE DE LA MAIRIE,
452948599,00025,45294859900025,O,2005-03-01,NN,,,2021-02-23T13:37:07,true,2,,,,RUE,DE LA FORGE,34360,BABEAU-BOULDOUX,,,34021,,,,,,,,,,,,,,,,,,,2008-01-01,A,,,,,81.30Z,NAFRev2,N,2.908932,43.435696,0.94,street,Rue de la Forge 34360 Babeau-Bouldoux,34021_0050,G,RUE DE LA FORGE,
453644320,00013,45364432000013,O,2004-03-01,NN,,,2019-11-14T14:00:34,true,3,DONNADIEU,,,RTE,DE LA LOUVIERE,34360,BABEAU-BOULDOUX,,,34021,,,,,,,,,,,,,,,,,,,2008-01-01,A,,,,,68.20B,NAFRev2,N,2.89206,43.424747,0.84,street,Route de la Louviere 34360 Babeau-Bouldoux,34021_0197,G,ROUTE DE LA LOUVIERE,