siren,nic,siret,statutDiffusionEtablissement,dateCreationEtablissement,trancheEffectifsEtablissement,anneeEffectifsEtablissement,activitePrincipaleRegistreMetiersEtablissement,dateDernierTraitementEtablissement,etablissementSiege,nombrePeriodesEtablissement,complementAdresseEtablissement,numeroVoieEtablissement,indiceRepetitionEtablissement,typeVoieEtablissement,libelleVoieEtablissement,codePostalEtablissement,libelleCommuneEtablissement,libelleCommuneEtrangerEtablissement,distributionSpecialeEtablissement,codeCommuneEtablissement,codeCedexEtablissement,libelleCedexEtablissement,codePaysEtrangerEtablissement,libellePaysEtrangerEtablissement,complementAdresse2Etablissement,numeroVoie2Etablissement,indiceRepetition2Etablissement,typeVoie2Etablissement,libelleVoie2Etablissement,codePostal2Etablissement,libelleCommune2Etablissement,libelleCommuneEtranger2Etablissement,distributionSpeciale2Etablissement,codeCommune2Etablissement,codeCedex2Etablissement,libelleCedex2Etablissement,codePaysEtranger2Etablissement,libellePaysEtranger2Etablissement,dateDebut,etatAdministratifEtablissement,enseigne1Etablissement,enseigne2Etablissement,enseigne3Etablissement,denominationUsuelleEtablissement,activitePrincipaleEtablissement,nomenclatureActivitePrincipaleEtablissement,caractereEmployeurEtablissement,longitude,latitude,geo_score,geo_type,geo_adresse,geo_id,geo_ligne,geo_l4,geo_l5
130013253,00203,13001325300203,O,2010-12-17,NN,,,2021-10-27T08:03:57,false,2,,,,PL,DU CHAMP-DE-FOIRE,41250,BRACIEUX,,,41025,,,,,,,,,,,,,,,,,,,2021-01-01,F,TRESORERIE DE BRACIEUX,,,,84.11Z,NAFRev2,N,1.543238,47.549681,0.86,street,Place du Champ de Foire 41250 Bracieux,41025_0020,G,PLACE DU CHAMP DE FOIRE,
130025646,00022,13002564600022,O,2022-09-02,,,,2022-10-01T04:53:24,true,1,EHPAD LA BONNE EURE,31,,RUE,DE CANDY,41250,BRACIEUX,,,41025,,,,,,,,,,,,,,,,,,,2022-09-02,A,,,,,84.12Z,NAFRev2,O,1.550872,47.550357,0.96,housenumber,31 Rue de Candy 41250 Bracieux,41025_0010_00031,G,31 RUE DE CANDY,
174102111,00294,17410211100294,O,1983-03-16,,,,2013-04-29T22:36:16,false,4,,,,PL,DU CHAMP DE FOIRE,41250,BRACIEUX,,,41025,,,,,,,,,,,,,,,,,,,2010-12-17,F,TRESORERIE DE BRACIEUX,,,,84.11Z,NAFRev2,N,1.543238,47.549681,0.86,street,Place du Champ de Foire 41250 Bracieux,41025_0020,G,PLACE DU CHAMP DE FOIRE,
194100053,00017,19410005300017,O,1983-03-01,12,2020,,2022-08-29T09:04:27,true,4,,23,B,RUE,DE CANDY,41250,BRACIEUX,,,41025,,,,,,,,,,,,,,,,,,,2012-02-01,A,,,,,85.31Z,NAFRev2,O,1.546883,47.54945,0.85,housenumber,23bis Rue de Candy 41250 Bracieux,41025_0010_00023_bis,G,23BIS RUE DE CANDY,
200096931,00015,20009693100015,O,2022-01-01,,,,2021-12-24T11:59:02,true,1,,22,,AV,DE LA SABLIERE,41250,BRACIEUX,,,41025,,,,,,,,,,,,,,,,,,,2022-01-01,A,,,,,84.12Z,NAFRev2,O,1.550216,47.551559,0.85,housenumber,22 Avenue de la Sablière 41250 Bracieux,41025_0072_00022,G,22 AVENUE DE LA SABLIERE,
214100257,00010,21410025700010,O,1983-03-01,12,2020,,2022-08-29T09:07:11,true,4,,,,PL,DE L'HOTEL DE VILLE,41250,BRACIEUX,,,41025,,,,,,,,,,,,,,,,,,,2008-01-01,A,MAIRIE,,,,84.11Z,NAFRev2,O,1.54247,47.549187,0.9,street,Place de l’Hôtel de Ville 41250 Bracieux,41025_0040,G,PLACE DE L HOTEL DE VILLE,
214100257,00028,21410025700028,O,1983-03-16,NN,,,2013-11-17T04:24:56,false,4,,,,,,41250,BRACIEUX,,,41025,,,,,,,,,,,,,,,,,,,2011-12-31,F,TERRAIN DE CAMPING DE BRACIEUX,,,,55.30Z,NAFRev2,N,,,0,,,,,,
214100257,00036,21410025700036,O,1983-12-21,01,2020,,2022-08-29T09:07:11,false,4,,6,,RUE,DE LA TREFILERIE,41250,BRACIEUX,,,41025,,,,,,,,,,,,,,,,,,,2021-12-25,A,ECOLE MATERNELLE GEORGES BRASSENS,,,,85.10Z,NAFRev2,N,1.543332,47.548253,0.78,housenumber,6 Impasse de la Trefilerie 41250 Bracieux,41025_0080_00006,G,6 IMPASSE DE LA TREFILERIE,
214100257,00044,21410025700044,O,1983-12-21,02,2020,,2022-08-29T09:07:11,false,3,,1,,RUE,DE CANDY,41250,BRACIEUX,,,41025,,,,,,,,,,,,,,,,,,,2008-01-01,A,ECOLE ELEMENTAIRE PUBLIQUE RENE MASSON,,,,85.20Z,NAFRev2,N,1.543337,47.548778,0.96,housenumber,1 Rue de Candy 41250 Bracieux,41025_0010_00001,G,1 RUE DE CANDY,
214100257,00051,21410025700051,O,1995-01-01,NN,,,2008-01-04T18:33:25,false,3,,,,PL,DE L HOTEL DE VILLE,41250,BRACIEUX,,,41025,,,,,,,,,,,,,,,,,,,2008-01-01,A,SERVICE DES EAUX,,,,36.00Z,NAFRev2,N,1.54247,47.549187,0.9,street,Place de l’Hôtel de Ville 41250 Bracieux,41025_0040,G,PLACE DE L HOTEL DE VILLE,
214100257,00069,21410025700069,O,1995-01-01,NN,,,2008-01-04T18:33:25,false,3,,,,PL,DE L'HOTEL DE VILLE,41250,BRACIEUX,,,41025,,,,,,,,,,,,,,,,,,,2008-01-01,A,SERVICE ASSAINISSEMENT,,,,37.00Z,NAFRev2,N,1.54247,47.549187,0.9,street,Place de l’Hôtel de Ville 41250 Bracieux,41025_0040,G,PLACE DE L HOTEL DE VILLE,
214100257,00085,21410025700085,O,1997-01-01,NN,,,2008-01-04T18:33:25,false,3,MAIRIE,,,PL,DE L HOTEL DE VILLE,41250,BRACIEUX,,,41025,,,,,,,,,,,,,,,,,,,2008-01-01,A,LOTISSEMENTS COMMUNAUX,,,,42.99Z,NAFRev2,N,1.54247,47.549187,0.9,street,Place de l’Hôtel de Ville 41250 Bracieux,41025_0040,G,PLACE DE L HOTEL DE VILLE,
214100257,00093,21410025700093,O,2000-01-01,NN,,,2013-03-30T12:05:58,false,4,,,,PL,DE L'HOTEL DE VILLE,41250,BRACIEUX,,,41025,,,,,,,,,,,,,,,,,,,2008-01-01,F,LOTISSEMENT LA GARENNE,,,,42.99Z,NAFRev2,N,1.54247,47.549187,0.9,street,Place de l’Hôtel de Ville 41250 Bracieux,41025_0040,G,PLACE DE L HOTEL DE VILLE,
244100145,00014,24410014500014,O,1991-06-28,NN,,,2007-04-20T14:28:07,true,4,MAIRIE,,,,,41250,BRACIEUX,,,41025,,,,,,,,,,,,,,,,,,,2005-04-04,F,,,,,75.1A,NAFRev1,N,1.542127,47.548329,0.92,street,Rue de la Mairie 41250 Bracieux,41025_0050,D,RUE DE LA MAIRIE,
244100798,00010,24410079800010,O,2001-12-26,NN,,,2010-04-18T03:15:36,false,4,MAIRIE,,,PL,DE L'HOTEL DE VILLE,41250,BRACIEUX,,,41025,,,,,,,,,,,,,,,,,,,2008-07-04,F,,,,,84.11Z,NAFRev2,O,1.54247,47.549187,0.9,street,Place de l’Hôtel de Ville 41250 Bracieux,41025_0040,G,PLACE DE L HOTEL DE VILLE,
244100798,00028,24410079800028,O,2002-04-01,NN,,,2013-04-26T14:51:10,false,3,,22,,AV,DE LA SABLIERE,41250,BRACIEUX,,,41025,,,,,,,,,,,,,,,,,,,2008-01-01,A,REGIE D'ADDUCTION D'EAU POTABLE,,,,36.00Z,NAFRev2,N,1.550216,47.551559,0.85,housenumber,22 Avenue de la Sablière 41250 Bracieux,41025_0072_00022,G,22 AVENUE DE LA SABLIERE,
244100798,00036,24410079800036,O,2002-04-01,NN,,,2013-04-19T16:04:39,false,4,LE MOULIN,15,,RUE,ROGER BRUN,41250,BRACIEUX,,BP 33,41025,,,,,,,,,,,,,,,,,,,2009-12-31,F,ADDUCTION EAU POTABLE EN AFFERMAGE,,,,84.12Z,NAFRev2,N,1.540397,47.549558,0.96,housenumber,15 Rue Roger Brun 41250 Bracieux,41025_0067_00015,G,15 RUE ROGER BRUN,
244100798,00044,24410079800044,O,2002-04-01,NN,,,2013-04-26T15:17:56,false,3,,22,,AV,DE LA SABLIERE,41250,BRACIEUX,,,41025,,,,,,,,,,,,,,,,,,,2008-01-01,A,SERVICE ASSAINISSEMENT,,,,37.00Z,NAFRev2,N,1.550216,47.551559,0.85,housenumber,22 Avenue de la Sablière 41250 Bracieux,41025_0072_00022,G,22 AVENUE DE LA SABLIERE,
244100798,00051,24410079800051,O,2002-04-01,NN,,,2013-04-26T15:19:15,false,3,,22,,AV,DE LA SABLIERE,41250,BRACIEUX,,,41025,,,,,,,,,,,,,,,,,,,2008-01-01,A,SERVICE DEVELOPPEMENT ECONOMIQUE,,,,84.13Z,NAFRev2,N,1.550216,47.551559,0.85,housenumber,22 Avenue de la Sablière 41250 Bracieux,41025_0072_00022,G,22 AVENUE DE LA SABLIERE,
244100798,00093,24410079800093,O,2006-01-01,,,,2013-04-26T15:21:03,false,2,,22,,AV,DE LA SABLIERE,41250,BRACIEUX,,,41025,,,,,,,,,,,,,,,,,,,2008-01-01,A,LOCATION LOCAUX TRESOR PUBLIC,,,,68.20B,NAFRev2,N,1.550216,47.551559,0.85,housenumber,22 Avenue de la Sablière 41250 Bracieux,41025_0072_00022,G,22 AVENUE DE LA SABLIERE,
244100798,00135,24410079800135,O,2007-05-11,,,,2023-04-11T16:16:58,false,2,,22,,AV,DE LA SABLIERE,41250,BRACIEUX,,,41025,,,,,,,,,,,,,,,,,,,2008-01-01,A,ZAE NOYER GOUJON,,,,42.99Z,NAFRev2,N,1.550216,47.551559,0.85,housenumber,22 Avenue de la Sablière 41250 Bracieux,41025_0072_00022,G,22 AVENUE DE LA SABLIERE,
244100798,00143,24410079800143,O,2007-05-11,,,,2023-04-11T16:18:11,false,2,,22,,AV,DE LA SABLIERE,41250,BRACIEUX,,,41025,,,,,,,,,,,,,,,,,,,2008-01-01,A,SPANC,,,,84.12Z,NAFRev2,N,1.550216,47.551559,0.85,housenumber,22 Avenue de la Sablière 41250 Bracieux,41025_0072_00022,G,22 AVENUE DE LA SABLIERE,
244100798,00150,24410079800150,O,2007-05-11,,,,2023-04-11T16:19:25,false,2,,22,,AV,DE LA SABLIERE,41250,BRACIEUX,,,41025,,,,,,,,,,,,,,,,,,,2008-01-01,A,ZAE DES CHATEAUX,,,,42.99Z,NAFRev2,N,1.550216,47.551559,0.85,housenumber,22 Avenue de la Sablière 41250 Bracieux,41025_0072_00022,G,22 AVENUE DE LA SABLIERE,
244100798,00176,24410079800176,O,2008-07-04,NN,,,2015-05-14T03:44:06,false,2,LE MOULIN,15,,RUE,ROGER BRUN,41250,BRACIEUX,,BP 33,41025,,,,,,,,,,,,,,,,,,,2013-03-08,F,,,,,84.11Z,NAFRev2,O,1.540397,47.549558,0.96,housenumber,15 Rue Roger Brun 41250 Bracieux,41025_0067_00015,G,15 RUE ROGER BRUN,
244100798,00184,24410079800184,O,2010-01-25,,,,2023-04-11T16:31:55,false,1,,22,,AV,DE LA SABLIERE,41250,BRACIEUX,,,41025,,,,,,,,,,,,,,,,,,,2010-01-25,A,ZA LA FERTE ST CYR,,,,42.99Z,NAFRev2,N,1.550216,47.551559,0.85,housenumber,22 Avenue de la Sablière 41250 Bracieux,41025_0072_00022,G,22 AVENUE DE LA SABLIERE,
244100798,00192,24410079800192,O,2010-04-12,,,,2023-04-11T16:33:25,false,1,,22,,AV,DE LA SABLIERE,41250,BRACIEUX,,,41025,,,,,,,,,,,,,,,,,,,2010-04-12,A,ZAE LE VIVIER TOUR EN SOLOGNE,,,,42.99Z,NAFRev2,N,1.550216,47.551559,0.85,housenumber,22 Avenue de la Sablière 41250 Bracieux,41025_0072_00022,G,22 AVENUE DE LA SABLIERE,
244100798,00218,24410079800218,O,2013-03-08,21,2020,,2022-08-29T09:09:45,true,1,,22,,AV,DE LA SABLIERE,41250,BRACIEUX,,,41025,,,,,,,,,,,,,,,,,,,2013-03-08,A,,,,,84.11Z,NAFRev2,O,1.550216,47.551559,0.85,housenumber,22 Avenue de la Sablière 41250 Bracieux,41025_0072_00022,G,22 AVENUE DE LA SABLIERE,
244100798,00226,24410079800226,O,2016-04-11,,,,2023-04-11T16:34:44,false,1,,22,,AV,DE LA SABLIERE,41250,BRACIEUX,,,41025,,,,,,,,,,,,,,,,,,,2016-04-11,A,PSPG SAINT LAURENT NOUAN,,,,41.20B,NAFRev2,N,1.550216,47.551559,0.85,housenumber,22 Avenue de la Sablière 41250 Bracieux,41025_0072_00022,G,22 AVENUE DE LA SABLIERE,
244100798,00234,24410079800234,O,2016-07-11,,,,2023-04-11T16:35:59,false,1,LE MOULIN,22,,AV,DE LA SABLIERE,41250,BRACIEUX,,,41025,,,,,,,,,,,,,,,,,,,2016-07-11,A,COMPLEXE AQUATIQUE,,,,93.11Z,NAFRev2,N,1.550216,47.551559,0.85,housenumber,22 Avenue de la Sablière 41250 Bracieux,41025_0072_00022,G,22 AVENUE DE LA SABLIERE,
244100798,00242,24410079800242,O,2021-04-12,,,,2023-04-11T16:37:15,false,1,,22,,AV,DE LA SABLIERE,41250,BRACIEUX,,,41025,,,,,,,,,,,,,,,,,,,2021-04-12,A,ZA LES TABARDIERES III,,,,42.99Z,NAFRev2,N,1.550216,47.551559,0.85,housenumber,22 Avenue de la Sablière 41250 Bracieux,41025_0072_00022,G,22 AVENUE DE LA SABLIERE,
254100035,00016,25410003500016,O,1983-03-01,NN,,,2008-04-26T08:28:04,true,4,,,,,,41250,BRACIEUX,,,41025,,,,,,,,,,,,,,,,,,,2008-01-14,F,,,,,84.12Z,NAFRev2,N,,,0,,,,,,
254101793,00019,25410179300019,O,1983-03-01,NN,,,2019-06-24T13:13:33,true,5,,,,,MAIRIE,41250,BRACIEUX,,,41025,,,,,,,,,,,,,,,,,,,2018-01-01,F,,,,,84.12Z,NAFRev2,N,1.542127,47.548329,0.92,street,Rue de la Mairie 41250 Bracieux,41025_0050,G,RUE DE LA MAIRIE,
254103179,00019,25410317900019,O,1996-03-26,03,2020,,2022-08-29T09:10:01,true,3,,,,,MAIRIE,41250,BRACIEUX,,,41025,,,,,,,,,,,,,,,,,,,2008-01-01,A,,,,,42.99Z,NAFRev2,O,1.542127,47.548329,0.92,street,Rue de la Mairie 41250 Bracieux,41025_0050,G,RUE DE LA MAIRIE,
254103237,00015,25410323700015,O,1997-05-27,03,2020,,2022-08-29T09:10:01,true,3,MAIRIE,,,PL,DE L'HOTEL DE VILLE,41250,BRACIEUX,,,41025,,,,,,,,,,,,,,,,,,,2008-01-01,A,,,,,84.13Z,NAFRev2,O,1.54247,47.549187,0.9,street,Place de l’Hôtel de Ville 41250 Bracieux,41025_0040,G,PLACE DE L HOTEL DE VILLE,
264100041,00013,26410004100013,O,1983-03-01,21,2020,,2022-08-29T09:10:30,true,5,,31,,RUE,CANDY,41250,BRACIEUX,,,41025,,,,,,,,,,,,,,,,,,,2009-09-18,A,,,,,87.10A,NAFRev2,O,1.550872,47.550357,0.95,housenumber,31 Rue de Candy 41250 Bracieux,41025_0010_00031,G,31 RUE DE CANDY,
264102401,00017,26410240100017,O,1993-01-28,NN,,,2010-06-26T03:09:35,true,3,MAIRIE,,,PL,DE L'HOTEL DE VILLE,41250,BRACIEUX,,,41025,,,,,,,,,,,,,,,,,,,2008-01-01,A,CCAS,,,,88.99B,NAFRev2,N,1.54247,47.549187,0.9,street,Place de l’Hôtel de Ville 41250 Bracieux,41025_0040,G,PLACE DE L HOTEL DE VILLE,
301704318,00015,30170431800015,O,,NN,,,,true,1,,,,PL,DE L'EGLISE,41250,BRACIEUX,,,41025,,,,,,,,,,,,,,,,,,,,F,,,,,55.71,NAP,N,1.541068,47.550347,0.75,street,Lieu-Dit les Près de l’Église 41250 Bracieux,41025_B024,G,LIEU DIT LES PRES DE L EGLISE,
302432943,00017,30243294300017,O,1975-01-01,NN,,,2014-06-13T23:56:41,true,5,,228,,RUE,DU TRANCHET,41250,BRACIEUX,,BP 25,41025,,,,,,,,,,,,,,,,,,,2013-07-12,F,,,,,46.31Z,NAFRev2,O,1.544987,47.546787,0.96,housenumber,228 Rue du Tranchet 41250 Bracieux,41025_0079_00228,G,228 RUE DU TRANCHET,
302837539,00014,30283753900014,O,,,,,,true,1,,2,,RTE,DE BLOIS,41250,BRACIEUX,,,41025,,,,,,,,,,,,,,,,,,,1984-12-25,F,,,,,81.11,NAP,N,1.53858,47.553885,0.83,housenumber,2 Route de Blois 41250 Bracieux,41025_0004_00002,G,2 ROUTE DE BLOIS,
302837547,00017,30283754700017,O,1900-01-01,NN,,,2008-01-04T19:22:24,true,3,,,,,,41250,BRACIEUX,,,41025,,,,,,,,,,,,,,,,,,,2008-01-01,A,,,,,94.99Z,NAFRev2,N,,,0,,,,,,
303204457,00012,30320445700012,O,,NN,,,,true,1,,,,,LES GUENOCHERES,41250,BRACIEUX,,,41025,,,,,,,,,,,,,,,,,,,,F,,,,,77.11,NAP,N,1.547823,47.54385,0.83,street,Lot des Guénochères 41250 Bracieux,41025_0024,G,LOT DES GUENOCHERES,
303233399,00029,30323339900029,O,1987-09-01,NN,,,,true,1,,7,,PL,DE LA HALLE,41250,BRACIEUX,,,41025,,,,,,,,,,,,,,,,,,,1999-04-09,F,,,,,15.8C,NAF1993,O,1.541643,47.548376,0.84,housenumber,7 Place de la Halle 41250 Bracieux,41025_0030_00007,G,7 PLACE DE LA HALLE,
303594071,00019,30359407100019,O,,,,,,true,1,,2,,RUE,PHELIPEAU,41250,BRACIEUX,,,41025,,,,,,,,,,,,,,,,,,,1995-09-28,F,,,,,81.21,NAP,N,1.54371,47.549793,0.89,housenumber,2 Rue Phélipeaux 41250 Bracieux,41025_0060_00002,G,2 RUE PHELIPEAUX,
304062417,00064,30406241700064,O,2012-09-03,,,,2014-01-21T04:22:15,true,2,,13,B,,DE CHEVERNY,41250,BRACIEUX,,,41025,,,,,,,,,,,,,,,,,,,2013-11-30,F,,,,,43.39Z,NAFRev2,N,1.539599,47.544657,0.83,housenumber,13bis Avenue de Cheverny 41250 Bracieux,41025_0022_00013_bis,G,13BIS AVENUE DE CHEVERNY,
304611312,00014,30461131200014,O,1964-01-01,NN,,,,true,1,,4,,RUE,RENE MASSON,41250,BRACIEUX,,,41025,,,,,,,,,,,,,,,,,,,1998-12-31,F,,,,,50.1Z,NAF1993,N,1.541631,47.54777,0.95,housenumber,4 Rue René Masson 41250 Bracieux,41025_0066_00004,G,4 RUE RENE MASSON,
305533895,00010,30553389500010,O,1900-01-01,NN,,,2007-05-19T08:38:12,true,4,,9,,RUE,ROGER BRUN,41250,BRACIEUX,,,41025,,,,,,,,,,,,,,,,,,,2005-05-24,F,,,,,74.1A,NAFRev1,O,1.539048,47.551994,0.96,housenumber,9 Rue Roger Brun 41250 Bracieux,41025_0067_00009,G,9 RUE ROGER BRUN,
305792079,00041,30579207900041,O,1998-01-17,NN,,,2013-05-18T02:32:51,false,6,,22,,AV,DE LA SABLIERE,41250,BRACIEUX,,,41025,,,,,,,,,,,,,,,,,,,2011-11-01,F,,,,,46.17B,NAFRev2,O,1.550216,47.551559,0.85,housenumber,22 Avenue de la Sablière 41250 Bracieux,41025_0072_00022,G,22 AVENUE DE LA SABLIERE,
306546193,00013,30654619300013,O,,NN,,,,true,1,,37,,AV,ROGER BRUN,41250,BRACIEUX,,,41025,,,,,,,,,,,,,,,,,,,1990-03-31,F,,,,,64.41,NAP,N,1.540488,47.549258,0.74,housenumber,37 Rue Roger Brun 41250 Bracieux,41025_0067_00037,G,37 RUE ROGER BRUN,
307192328,00010,30719232800010,O,,,,,,true,1,,,,PL,DU MARCHE AUX FRUITS,41250,BRACIEUX,,,41025,,,,,,,,,,,,,,,,,,,1985-12-25,F,,,,,81.21,NAP,N,1.540993,47.548989,0.57,street,Place du Marche au Beurre 41250 Bracieux,41025_0054,G,PLACE DU MARCHE AU BEURRE,
307620724,00012,30762072400012,O,,NN,,,,true,1,,6,,RUE,DE LA HALLE,41250,BRACIEUX,,,41025,,,,,,,,,,,,,,,,,,,1989-02-28,F,,,,,62.43,NAP,N,1.542212,47.548755,0.95,housenumber,6 Rue de la Halle 41250 Bracieux,41025_0035_00006,G,6 RUE DE LA HALLE,
310362207,00014,31036220700014,O,,NN,,,,true,1,,17,,RUE,DE LA MAIRIE,41250,BRACIEUX,,,41025,,,,,,,,,,,,,,,,,,,,F,,,,,64.11,NAP,N,1.542415,47.548448,0.95,housenumber,17 Rue de la Mairie 41250 Bracieux,41025_0050_00017,G,17 RUE DE LA MAIRIE,
310584057,00015,31058405700015,O,,NN,,,,true,1,,,,,,41250,BRACIEUX,,,41025,,,,,,,,,,,,,,,,,,,1989-12-25,F,,,,,62.46,NAP,N,,,0,,,,,,
311408215,00011,31140821500011,O,,,,,,true,1,,6,,RUE,DU TRANCHET,41250,BRACIEUX,,,41025,,,,,,,,,,,,,,,,,,,1984-12-25,F,,,,,69.12,NAP,N,1.548079,47.546902,0.87,street,Rue du Tranchet 41250 Bracieux,41025_0079,G,RUE DU TRANCHET,
311722417,00012,31172241700012,O,,NN,,,,true,1,,11,,RUE,DE LA MAIRIE,41250,BRACIEUX,,,41025,,,,,,,,,,,,,,,,,,,1988-12-31,F,,,,,67.04,NAP,N,1.54211,47.548304,0.95,housenumber,11 Rue de la Mairie 41250 Bracieux,41025_0050_00011,G,11 RUE DE LA MAIRIE,
311889299,00013,31188929900013,O,1978-01-01,NN,,,2006-12-15T00:17:33,false,4,,22,,AV,CHEVERNY,41250,BRACIEUX,,,41025,,,,,,,,,,,,,,,,,,,1998-12-31,F,,,,,50.1Z,NAF1993,O,1.538237,47.544481,0.82,housenumber,22 Avenue de Cheverny 41250 Bracieux,41025_0022_00022,G,22 AVENUE DE CHEVERNY,
311916399,00018,31191639900018,O,,,,,,true,1,,2,,RUE,PHELIPEAU,41250,BRACIEUX,,,41025,,,,,,,,,,,,,,,,,,,1984-12-25,F,,,,,21.08,NAP,N,1.54371,47.549793,0.89,housenumber,2 Rue Phélipeaux 41250 Bracieux,41025_0060_00002,G,2 RUE PHELIPEAUX,
311944946,00012,31194494600012,O,1978-01-01,NN,,,,false,4,,22,,AV,DE CHEVERNY,41250,BRACIEUX,,,41025,,,,,,,,,,,,,,,,,,,1999-01-11,F,,,,,50.1Z,NAF1993,O,1.538237,47.544481,0.85,housenumber,22 Avenue de Cheverny 41250 Bracieux,41025_0022_00022,G,22 AVENUE DE CHEVERNY,
312267602,00018,31226760200018,O,1978-01-01,NN,,,2007-05-19T08:49:57,true,3,,9,,RUE,RENE MASSON,41250,BRACIEUX,,,41025,,,,,,,,,,,,,,,,,,,2005-06-30,F,,,,,55.1C,NAFRev1,O,1.541217,47.547993,0.95,housenumber,9 Rue René Masson 41250 Bracieux,41025_0066_00009,G,9 RUE RENE MASSON,
312451644,00016,31245164400016,O,1980-02-04,,,,2006-11-25T09:30:29,true,2,,,,,FONTAINES EN SOLOGNE,41250,BRACIEUX,,,41025,,,,,,,,,,,,,,,,,,,2006-02-24,F,,,,,52.4T,NAFRev1,N,1.538458,47.542577,0.93,street,Route de Fontaines En Sologne 41250 Bracieux,41025_0125,G,ROUTE DE FONTAINES EN SOLOGNE,
313491656,00028,31349165600028,O,2001-01-01,NN,,,2007-05-19T08:52:12,true,5,,49,,RUE,ROGER BRUN,41250,BRACIEUX,,,41025,,,,,,,,,,,,,,,,,,,2005-06-30,F,,,,,67.2Z,NAFRev1,N,1.540743,47.548877,0.96,housenumber,49 Rue Roger Brun 41250 Bracieux,41025_0067_00049,G,49 RUE ROGER BRUN,
313877094,00018,31387709400018,O,,NN,,,,true,1,,,,RTE,DU CHATEAU D EAU,41250,BRACIEUX,,,41025,,,,,,,,,,,,,,,,,,,1999-12-31,F,,,,,74.8K,NAF1993,N,1.545082,47.544736,0.81,street,Rue du Château-d’Eau 41250 Bracieux,41025_0021,G,RUE DU CHATEAU D EAU,
314623661,00050,31462366100050,O,2009-01-13,,,,2010-01-22T05:39:35,true,2,,22,,AV,DE CHEVERNY,41250,BRACIEUX,,,41025,,,,,,,,,,,,,,,,,,,2009-11-12,F,,,,,68.20B,NAFRev2,N,1.538237,47.544481,0.85,housenumber,22 Avenue de Cheverny 41250 Bracieux,41025_0022_00022,G,22 AVENUE DE CHEVERNY,
314641838,00011,31464183800011,O,1978-01-01,NN,,,2009-12-07T15:33:37,false,4,,6,,RUE,DE SULLY,41250,BRACIEUX,,,41025,,,,,,,,,,,,,,,,,,,2009-01-01,F,,,,,75.00Z,NAFRev2,N,1.542784,47.549819,0.96,housenumber,6 Rue de Sully 41250 Bracieux,41025_0070_00006,G,6 RUE DE SULLY,
314641838,00029,31464183800029,O,2009-01-01,,,,2012-02-03T06:21:34,true,2,,17,,RUE,DE CANDY,41250,BRACIEUX,,,41025,,,,,,,,,,,,,,,,,,,2010-12-31,F,,,,,75.00Z,NAFRev2,N,1.545572,47.549304,0.96,housenumber,17 Rue de Candy 41250 Bracieux,41025_0010_00017,G,17 RUE DE CANDY,
314648205,00024,31464820500024,O,1981-01-01,NN,,,2016-04-26T02:12:46,false,6,,6,,RUE,PHILIPPEAUX,41250,BRACIEUX,,,41025,,,,,,,,,,,,,,,,,,,2014-10-01,F,,,,,75.00Z,NAFRev2,O,1.543862,47.549508,0.7,housenumber,6 Rue Phélipeaux 41250 Bracieux,41025_0060_00006,G,6 RUE PHELIPEAUX,
314648205,00032,31464820500032,O,2014-10-01,NN,,,2020-08-25T10:26:10,true,2,ZONE ARTISANALE DES CHATEAUX,,,RTE,DE BLOIS,41250,BRACIEUX,,,41025,,,,,,,,,,,,,,,,,,,2018-12-31,F,,,,,75.00Z,NAFRev2,N,1.536579,47.553653,0.81,street,Route de Blois 41250 Bracieux,41025_0004,G,ROUTE DE BLOIS,
314730185,00027,31473018500027,O,1991-03-01,NN,,,2014-07-08T00:18:41,false,6,,,,IMP,DE LA POSTE,41250,BRACIEUX,,,41025,,,,,,,,,,,,,,,,,,,2012-11-19,F,,,,,25.62B,NAFRev2,O,1.540854,47.548298,0.82,street,Impasse de la Poste 41250 Bracieux,41025_0064,G,IMPASSE DE LA POSTE,
314846353,00014,31484635300014,O,1964-01-01,NN,,4399DC,2016-07-05T03:33:15,true,6,,13,,RUE,RENE MASSON,41250,BRACIEUX,,,41025,,,,,,,,,,,,,,,,,,,2016-07-04,F,,,,,43.99D,NAFRev2,N,1.541154,47.547706,0.95,housenumber,13 Rue René Masson 41250 Bracieux,41025_0066_00013,G,13 RUE RENE MASSON,
315497842,00015,31549784200015,O,,,,,,true,1,,10,,PL,DE LA HALLE,41250,BRACIEUX,,,41025,,,,,,,,,,,,,,,,,,,1984-12-25,F,,,,,62.43,NAP,N,1.541326,47.548225,0.85,housenumber,10 Place de la Halle 41250 Bracieux,41025_0030_00010,G,10 PLACE DE LA HALLE,
316071794,00028,31607179400028,O,1983-12-20,NN,,,2006-12-15T00:18:52,false,4,,9,,RUE,DE SULLY,41250,BRACIEUX,,,41025,,,,,,,,,,,,,,,,,,,2001-12-31,F,,,,,92.3A,NAF1993,N,1.544808,47.550244,0.96,housenumber,9 Rue de Sully 41250 Bracieux,41025_0070_00009,G,9 RUE DE SULLY,
316129295,00028,31612929500028,O,1981-07-01,NN,,,,true,1,,14,,RUE,RENE MASSON,41250,BRACIEUX,,,41025,,,,,,,,,,,,,,,,,,,1989-02-17,F,,,,,70.2C,NAF1993,N,1.542026,47.546451,0.95,housenumber,14 Rue René Masson 41250 Bracieux,41025_0066_00014,G,14 RUE RENE MASSON,
316243617,00016,31624361700016,O,,,,,,true,1,,4,,PL,DE L HOTEL DE VILLE,41250,BRACIEUX,,,41025,,,,,,,,,,,,,,,,,,,1990-03-18,F,,,,,62.43,NAP,N,1.542468,47.549576,0.9,housenumber,4 Place de l’Hôtel de Ville 41250 Bracieux,41025_0040_00004,G,4 PLACE DE L HOTEL DE VILLE,
316401579,00032,31640157900032,O,1982-05-01,NN,,,2008-04-26T09:10:09,true,4,,2,,RUE,DE SULLY,41250,BRACIEUX,,,41025,,,,,,,,,,,,,,,,,,,2008-01-01,A,,,,,86.21Z,NAFRev2,O,1.542622,47.549777,0.96,housenumber,2 Rue de Sully 41250 Bracieux,41025_0070_00002,G,2 RUE DE SULLY,
317599033,00014,31759903300014,O,1979-01-01,NN,,,2008-01-04T20:54:10,true,3,,6,,RUE,DE SULLY,41250,BRACIEUX,,,41025,,,,,,,,,,,,,,,,,,,2008-01-01,A,,,,,41.10D,NAFRev2,N,1.542784,47.549819,0.96,housenumber,6 Rue de Sully 41250 Bracieux,41025_0070_00006,G,6 RUE DE SULLY,
317724755,00044,31772475500044,O,1990-04-01,NN,,,,false,4,,7,,RUE,DE CANDY,41250,BRACIEUX,,,41025,,,,,,,,,,,,,,,,,,,2000-01-01,F,,,,,85.1G,NAF1993,O,1.544002,47.548966,0.96,housenumber,7 Rue de Candy 41250 Bracieux,41025_0010_00007,G,7 RUE DE CANDY,
317724755,00051,31772475500051,O,2000-01-01,NN,,,2019-01-28T08:35:59,true,4,,64,,RUE,DE CANDY,41250,BRACIEUX,,,41025,,,,,,,,,,,,,,,,,,,2018-12-31,F,,,,,86.90E,NAFRev2,N,1.553018,47.550902,0.96,housenumber,64 Rue de Candy 41250 Bracieux,41025_0010_00064,G,64 RUE DE CANDY,
318404852,00044,31840485200044,O,2007-01-17,NN,,,2015-05-14T05:06:16,false,3,,51,,RUE,ROGER BRUN,41250,BRACIEUX,,,41025,,,,,,,,,,,,,,,,,,,2013-07-15,F,J.M COIFFURE,,,,96.02A,NAFRev2,O,1.540792,47.548789,0.96,housenumber,51 Rue Roger Brun 41250 Bracieux,41025_0067_00051,G,51 RUE ROGER BRUN,
319171153,00038,31917115300038,O,2008-03-17,,,,2016-12-27T11:37:30,false,2,,8,B,RUE,DE CANDY,41250,BRACIEUX,,,41025,,,,,,,,,,,,,,,,,,,2008-10-10,F,,,,,68.31Z,NAFRev2,N,1.543929,47.549003,0.84,housenumber,8bis Rue de Candy 41250 Bracieux,41025_0010_00008_bis,G,8BIS RUE DE CANDY,
319342507,00013,31934250700013,O,1980-07-08,NN,,,,true,1,,6,,RUE,DU GUE RENARD,41250,BRACIEUX,,,41025,,,,,,,,,,,,,,,,,,,2000-12-31,F,,,,,80.4A,NAF1993,N,1.539616,47.548124,0.95,housenumber,6 Rue du Gué Renard 41250 Bracieux,41025_0025_00006,G,6 RUE DU GUE RENARD,
320047384,00013,32004738400013,O,,,,,,true,1,,49,,RUE,ROGER BRUN,41250,BRACIEUX,,,41025,,,,,,,,,,,,,,,,,,,1984-12-25,F,,,,,64.46,NAP,N,1.540743,47.548877,0.96,housenumber,49 Rue Roger Brun 41250 Bracieux,41025_0067_00049,G,49 RUE ROGER BRUN,
320277957,00017,32027795700017,O,1980-10-10,NN,,,2017-01-24T19:27:33,true,8,,2,,RUE,RENE MASSON,41250,BRACIEUX,,,41025,,,,,,,,,,,,,,,,,,,2016-12-31,F,,,,,56.10A,NAFRev2,N,1.541061,47.548503,0.95,housenumber,2 Rue René Masson 41250 Bracieux,41025_0066_00002,G,2 RUE RENE MASSON,