siren,nic,siret,statutDiffusionEtablissement,dateCreationEtablissement,trancheEffectifsEtablissement,anneeEffectifsEtablissement,activitePrincipaleRegistreMetiersEtablissement,dateDernierTraitementEtablissement,etablissementSiege,nombrePeriodesEtablissement,complementAdresseEtablissement,numeroVoieEtablissement,indiceRepetitionEtablissement,typeVoieEtablissement,libelleVoieEtablissement,codePostalEtablissement,libelleCommuneEtablissement,libelleCommuneEtrangerEtablissement,distributionSpecialeEtablissement,codeCommuneEtablissement,codeCedexEtablissement,libelleCedexEtablissement,codePaysEtrangerEtablissement,libellePaysEtrangerEtablissement,complementAdresse2Etablissement,numeroVoie2Etablissement,indiceRepetition2Etablissement,typeVoie2Etablissement,libelleVoie2Etablissement,codePostal2Etablissement,libelleCommune2Etablissement,libelleCommuneEtranger2Etablissement,distributionSpeciale2Etablissement,codeCommune2Etablissement,codeCedex2Etablissement,libelleCedex2Etablissement,codePaysEtranger2Etablissement,libellePaysEtranger2Etablissement,dateDebut,etatAdministratifEtablissement,enseigne1Etablissement,enseigne2Etablissement,enseigne3Etablissement,denominationUsuelleEtablissement,activitePrincipaleEtablissement,nomenclatureActivitePrincipaleEtablissement,caractereEmployeurEtablissement,longitude,latitude,geo_score,geo_type,geo_adresse,geo_id,geo_ligne,geo_l4,geo_l5
200014660,00019,20001466000019,O,2008-01-31,,,,2019-11-14T14:00:44,true,2,MAIRIE,1,,RUE,DE BIARD,54890,BAYONVILLE-SUR-MAD,,,54055,,,,,,,,,,,,,,,,,,,2019-03-11,A,,,,,84.13Z,NAFRev2,N,5.991214,49.014161,0.95,housenumber,1 Rue de Biard 54890 Bayonville-sur-Mad,54055_0010_00001,G,1 RUE DE BIARD,
215400557,00017,21540055700017,O,1983-03-01,03,2020,,2022-08-29T09:07:41,true,4,,1,,RUE,DE BIARD,54890,BAYONVILLE-SUR-MAD,,,54055,,,,,,,,,,,,,,,,,,,2013-01-20,A,MAIRIE,,,,84.11Z,NAFRev2,O,5.991214,49.014161,0.95,housenumber,1 Rue de Biard 54890 Bayonville-sur-Mad,54055_0010_00001,G,1 RUE DE BIARD,
215400557,00025,21540055700025,O,1983-12-21,NN,,,2019-11-14T14:00:44,false,4,,1,,RUE,DE BIARD,54890,BAYONVILLE-SUR-MAD,,,54055,,,,,,,,,,,,,,,,,,,2009-08-31,F,ECOLE MATERNELLE PUBLIQUE,,,,85.10Z,NAFRev2,N,5.991214,49.014161,0.95,housenumber,1 Rue de Biard 54890 Bayonville-sur-Mad,54055_0010_00001,G,1 RUE DE BIARD,
215400557,00033,21540055700033,O,1997-01-01,NN,,,2019-11-14T14:00:44,false,3,,1,,RUE,DE BIARD,54890,BAYONVILLE-SUR-MAD,,,54055,,,,,,,,,,,,,,,,,,,2008-01-01,A,SCE EAUX ET ASSAINISSEMENT,,,,36.00Z,NAFRev2,N,5.991214,49.014161,0.95,housenumber,1 Rue de Biard 54890 Bayonville-sur-Mad,54055_0010_00001,G,1 RUE DE BIARD,
265402214,00018,26540221400018,O,1992-01-01,NN,,,2023-01-31T15:47:37,true,4,MAIRIE,1,,RUE,DE BIARD,54890,BAYONVILLE-SUR-MAD,,,54055,,,,,,,,,,,,,,,,,,,2021-12-31,F,CCAS,,,,88.99B,NAFRev2,N,5.991214,49.014161,0.95,housenumber,1 Rue de Biard 54890 Bayonville-sur-Mad,54055_0010_00001,G,1 RUE DE BIARD,
301054508,00017,30105450800017,O,,,,,2019-11-14T14:00:44,true,1,,,,CHE,DU MOULIN,54890,BAYONVILLE-SUR-MAD,,,54055,,,,,,,,,,,,,,,,,,,1984-12-25,F,,,,,62.46,NAP,N,5.987886,49.01502,0.74,street,Rue du Moulin 54890 Bayonville-sur-Mad,54055_0066,G,RUE DU MOULIN,
303429203,00068,30342920300068,O,2003-05-19,NN,,,2021-07-23T14:51:18,true,8,,33,,RUE,DE MEVILLE,54890,BAYONVILLE-SUR-MAD,,,54055,,,,,,,,,,,,,,,,,,,2020-12-31,F,,,,,70.22Z,NAFRev2,N,5.988546,49.015249,0.95,housenumber,33 Rue de Méville 54890 Bayonville-sur-Mad,54055_0060_00033,G,33 RUE DE MEVILLE,
304536733,00104,30453673300104,O,,NN,,,2019-11-14T14:00:44,true,1,,,,,,54890,BAYONVILLE-SUR-MAD,,,54055,,,,,,,,,,,,,,,,,,,1988-05-02,F,,,,,77.13,NAP,N,,,0,,,,,,
305424798,00042,30542479800042,O,2003-04-01,NN,,,2019-11-14T14:00:44,false,3,,36,,RUE,DE BIARD,54890,BAYONVILLE-SUR-MAD,,,54055,,,,,,,,,,,,,,,,,,,2005-03-04,F,,,,,52.5Z,NAFRev1,N,5.995555,49.014516,0.95,housenumber,36 Rue de Biard 54890 Bayonville-sur-Mad,54055_0010_00036,G,36 RUE DE BIARD,
310778055,00023,31077805500023,O,1986-10-01,NN,,,2019-11-14T14:00:44,true,1,,7,,RUE,DE MEVILLE,54890,BAYONVILLE-SUR-MAD,,,54055,,,,,,,,,,,,,,,,,,,1999-06-30,F,,,,,70.2C,NAF1993,N,5.990323,49.014363,0.95,housenumber,7 Rue de Méville 54890 Bayonville-sur-Mad,54055_0060_00007,G,7 RUE DE MEVILLE,
310828207,00053,31082820700053,O,,,,,2019-11-14T14:00:44,true,1,,,,,,54890,BAYONVILLE-SUR-MAD,,,54055,,,,,,,,,,,,,,,,,,,1990-09-11,F,,,,,51.5J,NAF1993,N,,,0,,,,,,
314935883,00020,31493588300020,O,,NN,,,2019-11-14T14:00:44,true,1,,46,,RUE,BIARD,54890,BAYONVILLE-SUR-MAD,,,54055,,,,,,,,,,,,,,,,,,,1987-11-30,F,,,,,69.11,NAP,N,5.995621,49.014514,0.94,housenumber,46 Rue de Biard 54890 Bayonville-sur-Mad,54055_0010_00046,G,46 RUE DE BIARD,
319269643,00015,31926964300015,O,,,,,2019-11-14T14:00:44,true,1,,46,,RUE,BILLARD,54890,BAYONVILLE-SUR-MAD,,,54055,,,,,,,,,,,,,,,,,,,1987-11-30,F,,,,,69.12,NAP,N,5.995621,49.014514,0.75,housenumber,46 Rue de Biard 54890 Bayonville-sur-Mad,54055_0010_00046,G,46 RUE DE BIARD,
321308223,00023,32130822300023,O,1900-01-01,NN,,,2019-11-14T14:00:44,false,3,,4,,RUE,MEVILLE,54890,BAYONVILLE-SUR-MAD,,,54055,,,,,,,,,,,,,,,,,,,1993-03-23,F,,,,,45.3F,NAF1993,N,5.990628,49.014256,0.94,housenumber,4 Rue de Méville 54890 Bayonville-sur-Mad,54055_0060_00004,G,4 RUE DE MEVILLE,
325027787,00010,32502778700010,O,1982-06-01,NN,,,2019-11-14T14:00:44,true,1,,6,,RUE,DE MEVILLE,54890,BAYONVILLE-SUR-MAD,,,54055,,,,,,,,,,,,,,,,,,,2001-10-15,F,,,,,55.4A,NAF1993,N,5.990465,49.014371,0.95,housenumber,6 Rue de Méville 54890 Bayonville-sur-Mad,54055_0060_00006,G,6 RUE DE MEVILLE,
326414166,00040,32641416600040,O,2010-07-13,,,,2019-11-14T14:00:44,false,2,,6,,RUE,MEVILLE,54890,BAYONVILLE-SUR-MAD,,,54055,,,,,,,,,,,,,,,,,,,2019-01-17,F,BRASSERIE DE LA VALLEE,,,,56.10C,NAFRev2,N,5.990465,49.014371,0.94,housenumber,6 Rue de Méville 54890 Bayonville-sur-Mad,54055_0060_00006,G,6 RUE DE MEVILLE,
326414166,00057,32641416600057,O,2014-06-24,NN,,,2021-10-27T08:25:13,true,2,,18,,RUE,DE MEVILLE,54890,BAYONVILLE-SUR-MAD,,,54055,,,,,,,,,,,,,,,,,,,2019-03-31,F,,,,,56.10C,NAFRev2,O,5.989657,49.015034,0.95,housenumber,18 Rue de Méville 54890 Bayonville-sur-Mad,54055_0060_00018,G,18 RUE DE MEVILLE,
329777718,00019,32977771800019,O,,,,,2022-10-01T04:00:31,true,1,,,,RUE,PRINCIPALE,54890,BAYONVILLE-SUR-MAD,,,54055,,,,,,,,,,,,,,,,,,,1988-04-21,F,,,,,58.03,NAP,N,5.988531,49.015251,0.34,street,Rue de Méville 54890 Bayonville-sur-Mad,54055_0060,G,RUE DE MEVILLE,
337592992,00016,33759299200016,O,,NN,,,2019-11-14T14:00:44,true,1,,11,,RUE,DE BIARD,54890,BAYONVILLE-SUR-MAD,,,54055,,,,,,,,,,,,,,,,,,,1988-01-31,F,,,,,01.1A,NAF1993,N,5.992306,49.014043,0.95,housenumber,11 Rue de Biard 54890 Bayonville-sur-Mad,54055_0010_00011,G,11 RUE DE BIARD,
339502387,00014,33950238700014,O,1985-12-30,NN,,,2019-11-14T14:00:44,true,3,,13,,RUE,DE MEVILLE,54890,BAYONVILLE-SUR-MAD,,,54055,,,,,,,,,,,,,,,,,,,2008-01-01,A,,,,,86.21Z,NAFRev2,N,5.989902,49.014688,0.95,housenumber,13 Rue de Méville 54890 Bayonville-sur-Mad,54055_0060_00013,G,13 RUE DE MEVILLE,
341881829,00012,34188182900012,O,1987-07-20,NN,,1610AQ,2021-10-27T08:34:43,true,5,,6,,RUE,DES ROCHES,54890,BAYONVILLE-SUR-MAD,,,54055,,,,,,,,,,,,,,,,,,,2019-03-30,F,,,,,16.10A,NAFRev2,O,5.989218,49.011805,0.94,housenumber,6 Rue des Roches 54890 Bayonville-sur-Mad,54055_0061_00006,G,6 RUE DES ROCHES,
344566740,00017,34456674000017,O,1988-04-19,NN,,4399CZ,2019-11-14T14:00:44,true,7,,45,,RUE,DE  BIARD,54890,BAYONVILLE-SUR-MAD,,,54055,,,,,,,,,,,,,,,,,,,2017-10-31,F,,,,,43.99C,NAFRev2,N,5.997425,49.015666,0.95,housenumber,45 Rue de Biard 54890 Bayonville-sur-Mad,54055_0010_00045,G,45 RUE DE BIARD,
344767637,00020,34476763700020,O,2003-04-01,NN,,,2019-11-14T14:00:44,true,4,,38,,RUE,DE BIARD,54890,BAYONVILLE-SUR-MAD,,,54055,,,,,,,,,,,,,,,,,,,2017-12-31,F,,,,,31.09B,NAFRev2,N,5.993364,49.014107,0.95,housenumber,38 Rue de Biard 54890 Bayonville-sur-Mad,54055_0010_00038,G,38 RUE DE BIARD,
348293994,00037,34829399400037,O,2002-10-01,NN,,,2019-11-14T14:00:44,false,3,,25,,RUE,DU MONCEL,54890,BAYONVILLE-SUR-MAD,,,54055,,,,,,,,,,,,,,,,,,,2005-06-01,F,,,,,45.4J,NAFRev1,N,5.990489,49.0157,0.79,housenumber,25 Rue de Moncel 54890 Bayonville-sur-Mad,54055_0065_00025,G,25 RUE DE MONCEL,
350900981,00019,35090098100019,O,1988-03-24,NN,,,2019-11-14T14:00:44,true,5,,15,,RUE,DE MEVILLE,54890,BAYONVILLE-SUR-MAD,,,54055,,,,,,,,,,,,,,,,,,,2010-10-06,F,,,,,10.71C,NAFRev2,O,5.989576,49.014529,0.95,housenumber,15 Rue de Méville 54890 Bayonville-sur-Mad,54055_0060_00015,G,15 RUE DE MEVILLE,
350988515,00010,35098851500010,O,,,,,2019-11-14T14:00:44,true,1,,15,,RUE,DE MEVILLE,54890,BAYONVILLE-SUR-MAD,,,54055,,,,,,,,,,,,,,,,,,,1990-08-16,F,,,,,38.40,NAP,N,5.989576,49.014529,0.95,housenumber,15 Rue de Méville 54890 Bayonville-sur-Mad,54055_0060_00015,G,15 RUE DE MEVILLE,
351070222,00010,35107022200010,O,1900-01-01,,,,2019-11-14T14:00:44,false,2,,18,,RUE,DE MERVILLE,54890,BAYONVILLE-SUR-MAD,,,54055,,,,,,,,,,,,,,,,,,,1988-03-24,F,,,,,,,,5.989657,49.015034,0.81,housenumber,18 Rue de Méville 54890 Bayonville-sur-Mad,54055_0060_00018,G,18 RUE DE MEVILLE,
351531884,00028,35153188400028,O,2010-10-08,NN,,,2019-11-14T14:00:44,true,2,,18,,RUE,REVILLE,54890,BAYONVILLE-SUR-MAD,,,54055,,,,,,,,,,,,,,,,,,,2012-10-02,F,,,,,10.71C,NAFRev2,O,5.989657,49.015034,0.76,housenumber,18 Rue de Méville 54890 Bayonville-sur-Mad,54055_0060_00018,G,18 RUE DE MEVILLE,
352541965,00013,35254196500013,O,1989-01-01,NN,,,2019-11-14T14:00:44,true,1,,19,,RUE,MONCEL,54890,BAYONVILLE-SUR-MAD,,,54055,,,,,,,,,,,,,,,,,,,2002-09-30,F,,,,,92.3A,NAF1993,N,5.990839,49.015495,0.94,housenumber,19 Rue de Moncel 54890 Bayonville-sur-Mad,54055_0065_00019,G,19 RUE DE MONCEL,
352668040,00012,35266804000012,O,,NN,,,2019-11-14T14:00:44,true,1,,18,,RUE,DE MEVILLE,54890,BAYONVILLE-SUR-MAD,,,54055,,,,,,,,,,,,,,,,,,,1990-08-16,F,,,,,38.40,NAP,N,5.989657,49.015034,0.95,housenumber,18 Rue de Méville 54890 Bayonville-sur-Mad,54055_0060_00018,G,18 RUE DE MEVILLE,
353636079,00017,35363607900017,O,1990-01-02,NN,,,2019-11-14T14:00:44,false,4,,7,,RUE,DE MEVILLE,54890,BAYONVILLE-SUR-MAD,,,54055,,,,,,,,,,,,,,,,,,,2000-09-04,F,,,,,70.2A,NAF1993,N,5.990323,49.014363,0.95,housenumber,7 Rue de Méville 54890 Bayonville-sur-Mad,54055_0060_00007,G,7 RUE DE MEVILLE,
379306806,00017,37930680600017,O,1990-04-23,NN,,,2019-11-14T14:00:44,true,3,,,,RTE,DE BRIEY,54890,BAYONVILLE-SUR-MAD,,,54055,,,,,,,,,,,,,,,,,,,1991-12-31,F,,,,,15.11,NAP,N,5.994691,49.014431,0.39,street,Rue de Biard 54890 Bayonville-sur-Mad,54055_0010,G,RUE DE BIARD,
380371518,00016,38037151800016,O,1990-10-01,,,,2019-11-14T14:00:44,false,3,,7,,RUE,DE MEVILLE,54890,BAYONVILLE-SUR-MAD,,,54055,,,,,,,,,,,,,,,,,,,1997-01-02,F,,,,,45.4J,NAF1993,N,5.990323,49.014363,0.95,housenumber,7 Rue de Méville 54890 Bayonville-sur-Mad,54055_0060_00007,G,7 RUE DE MEVILLE,
380750463,00016,38075046300016,O,1990-10-01,NN,,,2019-11-14T14:00:44,true,1,,8,,RUE,DE MEVILLE,54890,BAYONVILLE-SUR-MAD,,,54055,,,,,,,,,,,,,,,,,,,1999-01-31,F,,,,,15.8C,NAF1993,O,5.990329,49.014729,0.95,housenumber,8 Rue de Méville 54890 Bayonville-sur-Mad,54055_0060_00008,G,8 RUE DE MEVILLE,
389024274,00018,38902427400018,O,1992-07-01,NN,,,2019-11-14T14:00:44,true,1,,,,,GRANDE RUE,54890,BAYONVILLE-SUR-MAD,,,54055,,,,,,,,,,,,,,,,,,,2000-04-30,F,,,,,52.5Z,NAF1993,O,5.994691,49.014431,0.43,street,Rue de Biard 54890 Bayonville-sur-Mad,54055_0010,G,RUE DE BIARD,
391188463,00015,39118846300015,O,1900-01-01,NN,,,2019-11-14T14:00:44,false,3,,14,,RUE,DE BIARD,54890,BAYONVILLE-SUR-MAD,,,54055,,,,,,,,,,,,,,,,,,,1994-12-25,F,,,,,92.3F,NAF1993,N,5.991988,49.013878,0.95,housenumber,14 Rue de Biard 54890 Bayonville-sur-Mad,54055_0010_00014,G,14 RUE DE BIARD,
395326564,00014,39532656400014,O,1994-01-01,NN,,,2019-11-14T14:00:44,true,3,,47,,RUE,DE MEVILLE,54890,BAYONVILLE-SUR-MAD,,,54055,,,,,,,,,,,,,,,,,,,2004-12-31,F,,,,,92.4Z,NAFRev1,N,5.986584,49.015403,0.95,housenumber,47 Rue de Méville 54890 Bayonville-sur-Mad,54055_0060_00047,G,47 RUE DE MEVILLE,
403729924,00015,40372992400015,O,1996-02-17,NN,,,2019-11-14T14:00:44,false,3,,36,,RUE,DE BIARD,54890,BAYONVILLE-SUR-MAD,,,54055,,,,,,,,,,,,,,,,,,,1997-04-30,F,,,,,52.5Z,NAF1993,N,5.995555,49.014516,0.95,housenumber,36 Rue de Biard 54890 Bayonville-sur-Mad,54055_0010_00036,G,36 RUE DE BIARD,
408221851,00012,40822185100012,O,1996-07-01,12,2020,1610AQ,2022-08-29T09:25:51,true,5,,6,,RUE,DES ROCHES,54890,BAYONVILLE-SUR-MAD,,,54055,,,,,,,,,,,,,,,,,,,2022-07-08,A,,,,,16.10A,NAFRev2,O,5.989218,49.011805,0.94,housenumber,6 Rue des Roches 54890 Bayonville-sur-Mad,54055_0061_00006,G,6 RUE DES ROCHES,
413957887,00016,41395788700016,O,1997-09-24,,,,2019-11-14T14:00:44,false,3,,,,CHE,DE REMOUVAUX,54890,BAYONVILLE-SUR-MAD,,,54055,,,,,,,,,,,,,,,,,,,1997-12-25,F,,,,,74.2A,NAF1993,N,,,0,,,,,,
414006916,00012,41400691600012,O,1997-09-19,NN,,,2022-01-21T03:39:06,true,3,MME RUTTEN LAMBERT MARIA,6,,RUE,DES ROCHES,54890,BAYONVILLE-SUR-MAD,,,54055,,,,,,,,,,,,,,,,,,,2008-01-01,A,,,,,68.20A,NAFRev2,N,5.989218,49.011805,0.94,housenumber,6 Rue des Roches 54890 Bayonville-sur-Mad,54055_0061_00006,G,6 RUE DES ROCHES,
422062547,00019,42206254700019,O,1999-02-01,NN,,1071CB,2020-05-27T03:35:42,true,5,,8,,RUE,DE MEVILLE,54890,BAYONVILLE-SUR-MAD,,,54055,,,,,,,,,,,,,,,,,,,2017-03-07,F,,,,,10.71C,NAFRev2,N,5.990329,49.014729,0.95,housenumber,8 Rue de Méville 54890 Bayonville-sur-Mad,54055_0060_00008,G,8 RUE DE MEVILLE,
424181485,00287,42418148500287,O,2003-02-17,NN,,,2019-11-14T14:00:44,false,3,,16,,RUE,BRIARD,54890,BAYONVILLE-SUR-MAD,,,54055,,,,,,,,,,,,,,,,,,,2004-12-31,F,M LARICI FREDERIC,,,,74.4A,NAFRev1,N,5.992086,49.013887,0.74,housenumber,16 Rue de Biard 54890 Bayonville-sur-Mad,54055_0010_00016,G,16 RUE DE BIARD,
425024593,00013,42502459300013,O,1999-11-01,01,2020,,2023-05-12T19:38:15,true,4,,6,,RUE,DES ROCHES,54890,BAYONVILLE-SUR-MAD,,,54055,,,,,,,,,,,,,,,,,,,2013-12-31,A,,,,,02.10Z,NAFRev2,O,5.989218,49.011805,0.94,housenumber,6 Rue des Roches 54890 Bayonville-sur-Mad,54055_0061_00006,G,6 RUE DES ROCHES,
430460394,00017,43046039400017,O,2000-03-31,NN,,,2019-11-14T14:00:44,true,3,,33,,RUE,MEVILLE,54890,BAYONVILLE-SUR-MAD,,,54055,,,,,,,,,,,,,,,,,,,2008-01-01,A,,,,,68.20A,NAFRev2,N,5.988546,49.015249,0.94,housenumber,33 Rue de Méville 54890 Bayonville-sur-Mad,54055_0060_00033,G,33 RUE DE MEVILLE,
431431782,00017,43143178200017,O,2000-04-30,NN,,,2019-11-14T14:00:44,true,3,,33,,RUE,MEVILLE,54890,BAYONVILLE-SUR-MAD,,,54055,,,,,,,,,,,,,,,,,,,2006-09-30,F,,,,,52.5Z,NAFRev1,N,5.988546,49.015249,0.94,housenumber,33 Rue de Méville 54890 Bayonville-sur-Mad,54055_0060_00033,G,33 RUE DE MEVILLE,
431936947,00016,43193694700016,O,2000-06-01,NN,,,2019-11-14T14:00:44,true,1,,6,,RUE,DES ROCHES,54890,BAYONVILLE-SUR-MAD,,,54055,,,,,,,,,,,,,,,,,,,2001-06-12,F,,,,,51.5E,NAF1993,O,5.989218,49.011805,0.94,housenumber,6 Rue des Roches 54890 Bayonville-sur-Mad,54055_0061_00006,G,6 RUE DES ROCHES,
431991355,00014,43199135500014,O,2000-04-30,NN,,,2022-10-24T12:01:42,true,4,SARL LE MANOIR DU MAD,33,,RUE,MEVILLE,54890,BAYONVILLE-SUR-MAD,,,54055,,,,,,,,,,,,,,,,,,,2013-01-27,A,,,,,47.99A,NAFRev2,N,5.988546,49.015249,0.94,housenumber,33 Rue de Méville 54890 Bayonville-sur-Mad,54055_0060_00033,G,33 RUE DE MEVILLE,
438178089,00019,43817808900019,O,2001-05-03,NN,,,2022-12-06T19:36:39,true,3,MR RUTTEN LAMBERT,6,,RUE,DES ROCHES,54890,BAYONVILLE-SUR-MAD,,,54055,,,,,,,,,,,,,,,,,,,2008-01-01,A,,,,,68.20A,NAFRev2,N,5.989218,49.011805,0.94,housenumber,6 Rue des Roches 54890 Bayonville-sur-Mad,54055_0061_00006,G,6 RUE DES ROCHES,
438179632,00015,43817963200015,O,2001-03-28,NN,,,2023-05-26T03:38:24,true,4,MR RUTTEN LAMBERT,6,,RUE,DES ROCHES,54890,BAYONVILLE-SUR-MAD,,,54055,,,,,,,,,,,,,,,,,,,2023-04-11,F,,,,,68.20A,NAFRev2,N,5.989218,49.011805,0.94,housenumber,6 Rue des Roches 54890 Bayonville-sur-Mad,54055_0061_00006,G,6 RUE DES ROCHES,
438397846,00041,43839784600041,O,2007-07-01,,,,2019-11-14T14:00:44,true,3,,10,,RUE,DE BIARD,54890,BAYONVILLE-SUR-MAD,,,54055,,,,,,,,,,,,,,,,,,,2014-06-30,F,,,,,43.32B,NAFRev2,N,5.991665,49.013871,0.95,housenumber,10 Rue de Biard 54890 Bayonville-sur-Mad,54055_0010_00010,G,10 RUE DE BIARD,
438537110,00019,43853711000019,O,2001-07-02,NN,,,2019-11-14T14:00:44,true,3,,,,CHE,DE RAMONVAUX,54890,BAYONVILLE-SUR-MAD,,,54055,,,,,,,,,,,,,,,,,,,2004-11-30,F,,,,,74.1G,NAFRev1,N,5.990976,49.015184,0.36,street,Rue de Moncel 54890 Bayonville-sur-Mad,54055_0065,G,RUE DE MONCEL,
439573908,00019,43957390800019,O,2001-10-16,NN,,,2019-11-14T14:00:44,true,3,,6,,RUE,DE MEVILLE,54890,BAYONVILLE-SUR-MAD,,,54055,,,,,,,,,,,,,,,,,,,2006-06-30,F,,,,,55.4A,NAFRev1,N,5.990465,49.014371,0.95,housenumber,6 Rue de Méville 54890 Bayonville-sur-Mad,54055_0060_00006,G,6 RUE DE MEVILLE,
439597964,00014,43959796400014,O,2001-11-01,NN,,,2019-11-14T14:00:44,false,4,,26,,RUE,DE BIARD,54890,BAYONVILLE-SUR-MAD,,,54055,,,,,,,,,,,,,,,,,,,2015-02-01,F,,,,,85.59B,NAFRev2,N,5.993726,49.014173,0.95,housenumber,26 Rue de Biard 54890 Bayonville-sur-Mad,54055_0010_00026,G,26 RUE DE BIARD,
441569019,00025,44156901900025,O,2006-12-10,,,,2019-11-14T14:00:44,false,3,,,,,FERME DE MAZAGRAN,54890,BAYONVILLE-SUR-MAD,,,54055,,,,,,,,,,,,,,,,,,,2012-03-31,F,,,,,01.11Z,NAFRev2,N,,,0,,,,,,
442046876,00029,44204687600029,O,2005-01-06,,,,2019-11-14T14:00:44,true,3,,3,,RUE,DE BIARD,54890,BAYONVILLE-SUR-MAD,,,54055,,,,,,,,,,,,,,,,,,,2008-07-25,F,,,,,23.41Z,NAFRev2,N,5.991651,49.013978,0.95,housenumber,3 Rue de Biard 54890 Bayonville-sur-Mad,54055_0010_00003,G,3 RUE DE BIARD,
442089421,00014,44208942100014,O,2002-02-01,NN,,,2019-11-14T14:00:44,true,3,,,,CHE,DE REMONVAUX,54890,BAYONVILLE-SUR-MAD,,,54055,,,,,,,,,,,,,,,,,,,2008-01-01,A,,,,,81.10Z,NAFRev2,N,5.990976,49.015184,0.36,street,Rue de Moncel 54890 Bayonville-sur-Mad,54055_0065,G,RUE DE MONCEL,
444320014,00020,44432001400020,O,2018-01-03,,,,2021-02-23T13:27:00,true,1,,49,,RUE,BIARD,54890,BAYONVILLE-SUR-MAD,,,54055,,,,,,,,,,,,,,,,,,,2018-01-03,A,,,,,47.99A,NAFRev2,N,5.998486,49.015679,0.94,housenumber,49 Rue de Biard 54890 Bayonville-sur-Mad,54055_0010_00049,G,49 RUE DE BIARD,
453516585,00016,45351658500016,O,2004-01-23,NN,,,2019-11-14T14:00:44,true,5,,45,,RUE,DE BIARD,54890,BAYONVILLE-SUR-MAD,,,54055,,,,,,,,,,,,,,,,,,,2012-12-31,F,,,,,43.99C,NAFRev2,O,5.997425,49.015666,0.95,housenumber,45 Rue de Biard 54890 Bayonville-sur-Mad,54055_0010_00045,G,45 RUE DE BIARD,
453997330,00023,45399733000023,P,2012-09-01,,,,2020-01-17T03:51:36,false,4,[ND],[ND],[ND],[ND],[ND],[ND],BAYONVILLE-SUR-MAD,,[ND],54055,[ND],[ND],,,[ND],[ND],[ND],[ND],[ND],[ND],,,[ND],,[ND],[ND],,,2019-12-04,F,[ND],[ND],[ND],[ND],47.99A,NAFRev2,N,,,0,,,,,,
453997330,00031,45399733000031,P,2013-09-06,NN,,1071CB,2021-10-27T08:11:07,true,2,[ND],[ND],[ND],[ND],[ND],[ND],BAYONVILLE-SUR-MAD,,[ND],54055,[ND],[ND],,,[ND],[ND],[ND],[ND],[ND],[ND],,,[ND],,[ND],[ND],,,2019-12-04,F,[ND],[ND],[ND],[ND],10.71C,NAFRev2,O,,,0,,,,,,
483560207,00019,48356020700019,P,2005-08-09,NN,,,2021-09-17T03:38:20,false,5,[ND],[ND],[ND],[ND],[ND],[ND],BAYONVILLE-SUR-MAD,,[ND],54055,[ND],[ND],,,[ND],[ND],[ND],[ND],[ND],[ND],,,[ND],,[ND],[ND],,,2011-06-30,F,[ND],[ND],[ND],[ND],56.10C,NAFRev2,O,,,0,,,,,,
483560207,00027,48356020700027,P,2006-07-01,NN,,,2019-11-14T14:00:44,false,7,[ND],[ND],[ND],[ND],[ND],[ND],BAYONVILLE-SUR-MAD,,[ND],54055,[ND],[ND],,,[ND],[ND],[ND],[ND],[ND],[ND],,,[ND],,[ND],[ND],,,2010-07-13,F,[ND],[ND],[ND],[ND],56.10C,NAFRev2,N,,,0,,,,,,
491183646,00018,49118364600018,O,2006-07-05,NN,,,2019-11-14T14:00:44,true,5,,,,CHE,DE REMONVAUX,54890,BAYONVILLE-SUR-MAD,,,54055,,,,,,,,,,,,,,,,,,,2009-07-01,F,,,,,43.33Z,NAFRev2,N,5.990976,49.015184,0.36,street,Rue de Moncel 54890 Bayonville-sur-Mad,54055_0065,G,RUE DE MONCEL,
494173339,00024,49417333900024,O,2008-02-08,,,,2019-11-14T14:00:44,false,2,,7,,RUE,DE MEVILLE,54890,BAYONVILLE-SUR-MAD,,,54055,,,,,,,,,,,,,,,,,,,2013-08-30,F,,,,,68.20B,NAFRev2,N,5.990323,49.014363,0.95,housenumber,7 Rue de Méville 54890 Bayonville-sur-Mad,54055_0060_00007,G,7 RUE DE MEVILLE,
498110147,00051,49811014700051,O,2019-03-20,,,,2020-10-02T12:01:04,false,2,,3,,,MOULIN D ECORSE,54890,BAYONVILLE-SUR-MAD,,,54055,,,,,,,,,,,,,,,,,,,2020-10-01,F,,,,DISTRICT AUTO,47.91B,NAFRev2,N,6.000776,49.01583,0.78,housenumber,3 Moulin d’Ecorce 54890 Bayonville-sur-Mad,54055_b046_00003,G,3 MOULIN D ECORCE,
500578323,00023,50057832300023,O,2009-08-26,,,,2019-11-14T14:00:44,false,2,,7,,RUE,DE MEVILLE,54890,BAYONVILLE-SUR-MAD,,,54055,,,,,,,,,,,,,,,,,,,2013-08-31,F,,,,,68.20B,NAFRev2,N,5.990323,49.014363,0.95,housenumber,7 Rue de Méville 54890 Bayonville-sur-Mad,54055_0060_00007,G,7 RUE DE MEVILLE,
501491989,00015,50149198900015,O,2007-12-11,,,,2019-11-14T14:00:44,true,2,,,,,LE MOULIN D'ECORCE,54890,BAYONVILLE-SUR-MAD,,,54055,,,,,,,,,,,,,,,,,,,2008-01-01,A,,,,,46.44Z,NAFRev2,N,6.000776,49.01583,0.81,street,Moulin d’Ecorce 54890 Bayonville-sur-Mad,54055_B046,G,MOULIN D ECORCE,
503830259,00027,50383025900027,O,2009-08-26,,,,2019-11-14T14:00:44,true,2,,7,,RUE,DE MEVILLE,54890,BAYONVILLE-SUR-MAD,,,54055,,,,,,,,,,,,,,,,,,,2011-08-31,F,,,,,68.10Z,NAFRev2,N,5.990323,49.014363,0.95,housenumber,7 Rue de Méville 54890 Bayonville-sur-Mad,54055_0060_00007,G,7 RUE DE MEVILLE,
508925989,00016,50892598900016,O,2008-09-10,,,,2019-11-14T14:00:44,true,2,,3,,RUE,DE BIARD,54890,BAYONVILLE-SUR-MAD,,,54055,,,,,,,,,,,,,,,,,,,2009-07-13,F,,,,,90.03B,NAFRev2,N,5.991651,49.013978,0.95,housenumber,3 Rue de Biard 54890 Bayonville-sur-Mad,54055_0010_00003,G,3 RUE DE BIARD,
509046470,00019,50904647000019,O,2008-11-18,,,,2019-11-14T14:00:44,true,2,,12,,RUE,DE BIARD,54890,BAYONVILLE-SUR-MAD,,,54055,,,,,,,,,,,,,,,,,,,2009-09-09,F,,,,,70.22Z,NAFRev2,N,5.991792,49.013872,0.95,housenumber,12 Rue de Biard 54890 Bayonville-sur-Mad,54055_0010_00012,G,12 RUE DE BIARD,
512383191,00016,51238319100016,O,2009-05-06,,,,2023-03-11T20:09:40,false,3,,3,,,LE MOULIN D'ECORCES,54890,BAYONVILLE-SUR-MAD,,,54055,,,,,,,,,,,,,,,,,,,2014-12-31,F,LANZRO,,,,47.91A,NAFRev2,O,6.000776,49.01583,0.75,housenumber,3 Moulin d’Ecorce 54890 Bayonville-sur-Mad,54055_b046_00003,G,3 MOULIN D ECORCE,
512975152,00012,51297515200012,O,2009-06-15,,,,2019-11-14T14:00:44,false,2,,11,,RUE,MONCEL,54890,BAYONVILLE-SUR-MAD,,,54055,,,,,,,,,,,,,,,,,,,2009-10-01,F,,,,,73.20Z,NAFRev2,N,5.990624,49.015268,0.94,housenumber,11 Rue de Moncel 54890 Bayonville-sur-Mad,54055_0065_00011,G,11 RUE DE MONCEL,
514001064,00013,51400106400013,O,2009-07-13,,,,2023-01-07T06:34:37,true,2,,6,,RUE,DES ROCHES,54890,BAYONVILLE-SUR-MAD,,,54055,,,,,,,,,,,,,,,,,,,2021-03-01,A,,,,,66.30Z,NAFRev2,N,5.989218,49.011805,0.94,housenumber,6 Rue des Roches 54890 Bayonville-sur-Mad,54055_0061_00006,G,6 RUE DES ROCHES,
517523858,00010,51752385800010,O,2009-10-16,,,,2019-11-14T14:00:44,true,3,,,,,LES MOULINS DE L' ECORCE,54890,BAYONVILLE-SUR-MAD,,,54055,,,,,,,,,,,,,,,,,,,2009-12-31,A,L'APOTHEOSE,,,,56.30Z,NAFRev2,N,6.000776,49.01583,0.52,street,Moulin d’Ecorce 54890 Bayonville-sur-Mad,54055_B046,G,MOULIN D ECORCE,
522020684,00034,52202068400034,O,2016-10-31,,,1512ZA,2019-11-14T14:00:44,false,2,,6,,RUE,DE MEVILLE,54890,BAYONVILLE-SUR-MAD,,,54055,,,,,,,,,,,,,,,,,,,2017-10-01,F,,,,EVY'S BAG,15.12Z,NAFRev2,N,5.990465,49.014371,0.95,housenumber,6 Rue de Méville 54890 Bayonville-sur-Mad,54055_0060_00006,G,6 RUE DE MEVILLE,
523041614,00018,52304161400018,O,2010-07-01,,,,2019-11-14T14:00:44,true,4,,28,,RUE,DE BIARD,54890,BAYONVILLE-SUR-MAD,,,54055,,,,,,,,,,,,,,,,,,,2012-12-31,F,,,,,46.19B,NAFRev2,N,5.992644,49.013972,0.95,housenumber,28 Rue de Biard 54890 Bayonville-sur-Mad,54055_0010_00028,G,28 RUE DE BIARD,
525278834,00011,52527883400011,O,2010-08-13,,,,2019-11-14T14:00:44,false,2,,7,,RUE,DE MEVILLE,54890,BAYONVILLE-SUR-MAD,,,54055,,,,,,,,,,,,,,,,,,,2013-08-30,F,,,,,68.20B,NAFRev2,N,5.990323,49.014363,0.95,housenumber,7 Rue de Méville 54890 Bayonville-sur-Mad,54055_0060_00007,G,7 RUE DE MEVILLE,