siren,nic,siret,statutDiffusionEtablissement,dateCreationEtablissement,trancheEffectifsEtablissement,anneeEffectifsEtablissement,activitePrincipaleRegistreMetiersEtablissement,dateDernierTraitementEtablissement,etablissementSiege,nombrePeriodesEtablissement,complementAdresseEtablissement,numeroVoieEtablissement,indiceRepetitionEtablissement,typeVoieEtablissement,libelleVoieEtablissement,codePostalEtablissement,libelleCommuneEtablissement,libelleCommuneEtrangerEtablissement,distributionSpecialeEtablissement,codeCommuneEtablissement,codeCedexEtablissement,libelleCedexEtablissement,codePaysEtrangerEtablissement,libellePaysEtrangerEtablissement,complementAdresse2Etablissement,numeroVoie2Etablissement,indiceRepetition2Etablissement,typeVoie2Etablissement,libelleVoie2Etablissement,codePostal2Etablissement,libelleCommune2Etablissement,libelleCommuneEtranger2Etablissement,distributionSpeciale2Etablissement,codeCommune2Etablissement,codeCedex2Etablissement,libelleCedex2Etablissement,codePaysEtranger2Etablissement,libellePaysEtranger2Etablissement,dateDebut,etatAdministratifEtablissement,enseigne1Etablissement,enseigne2Etablissement,enseigne3Etablissement,denominationUsuelleEtablissement,activitePrincipaleEtablissement,nomenclatureActivitePrincipaleEtablissement,caractereEmployeurEtablissement,longitude,latitude,geo_score,geo_type,geo_adresse,geo_id,geo_ligne,geo_l4,geo_l5
178906616,00226,17890661600226,O,2006-01-01,,,,2019-11-14T14:01:04,false,3,,12,,RUE,CHARLES BOULLE,89150,SAINT-VALERIEN,,,89370,,,,,,,,,,,,,,,,,,,2009-01-01,F,CENTRE EXPLOITATION ST VALERIEN,,,,71.20A,NAFRev2,N,3.09373,48.177562,0.95,housenumber,12 Rue Charles Boullé 89150 Saint-Valérien,89370_0040_00012,G,12 RUE CHARLES BOULLE,
198900284,00011,19890028400011,O,1983-03-01,21,2020,,2022-08-29T09:04:47,true,4,,33,,RUE,CHARLES BOULLE,89150,SAINT-VALERIEN,,BP 14,89370,,,,,,,,,,,,,,,,,,,2008-01-01,A,,,,,85.31Z,NAFRev2,O,3.094102,48.174291,0.95,housenumber,33 Rue Charles Boullé 89150 Saint-Valérien,89370_0040_00033,G,33 RUE CHARLES BOULLE,
218903706,00016,21890370600016,O,1983-03-01,12,2020,,2022-08-29T09:09:26,true,4,,20,,RUE,DE LA REPUBLIQUE,89150,SAINT-VALERIEN,,,89370,,,,,,,,,,,,,,,,,,,2008-01-01,A,MAIRIE,,,,84.11Z,NAFRev2,O,3.096484,48.179151,0.96,housenumber,20 Rue de la République 89150 Saint-Valérien,89370_0265_00020,G,20 RUE DE LA REPUBLIQUE,
218903706,00024,21890370600024,O,1983-12-21,02,2020,,2022-08-29T09:09:26,false,3,,9,,RUE,DE LA REPUBLIQUE,89150,SAINT-VALERIEN,,,89370,,,,,,,,,,,,,,,,,,,2008-01-01,A,ECOLE MATERNELLE PUBLIQUE,,,,85.10Z,NAFRev2,N,3.09823,48.178937,0.96,housenumber,9 Rue de la République 89150 Saint-Valérien,89370_0265_00009,G,9 RUE DE LA REPUBLIQUE,
218903706,00032,21890370600032,O,1983-12-21,11,2020,,2022-08-29T09:09:26,false,4,,4,,RUE,CHARLES BOULLE,89150,SAINT-VALERIEN,,,89370,,,,,,,,,,,,,,,,,,,2022-05-13,A,ECOLE ELEMENTAIRE PUBLIQUE JEAN CHARLES BOULLE,,,,85.20Z,NAFRev2,N,3.093794,48.178639,0.95,housenumber,4 Rue Charles Boullé 89150 Saint-Valérien,89370_0040_00004,G,4 RUE CHARLES BOULLE,
218903706,00040,21890370600040,O,1996-12-25,NN,,,2019-11-14T14:01:04,false,2,MAIRIE,20,,RUE,DE LA REPUBLIQUE,89150,SAINT-VALERIEN,,,89370,,,,,,,,,,,,,,,,,,,2008-01-01,A,SERVICE ASSAINISSEMENT,,,,37.00Z,NAFRev2,N,3.096484,48.179151,0.96,housenumber,20 Rue de la République 89150 Saint-Valérien,89370_0265_00020,G,20 RUE DE LA REPUBLIQUE,
258901057,00012,25890105700012,O,1983-03-01,01,2020,,2022-08-29T09:10:14,true,3,MAIRIE,20,,RUE,DE LA REPUBLIQUE,89150,SAINT-VALERIEN,,,89370,,,,,,,,,,,,,,,,,,,2008-01-01,A,,,,,84.12Z,NAFRev2,N,3.096484,48.179151,0.96,housenumber,20 Rue de la République 89150 Saint-Valérien,89370_0265_00020,G,20 RUE DE LA REPUBLIQUE,
268903697,00012,26890369700012,O,1983-03-01,NN,,,2019-11-14T14:01:04,true,3,MAIRIE,20,,RUE,DE LA REPUBLIQUE,89150,SAINT-VALERIEN,,,89370,,,,,,,,,,,,,,,,,,,2008-01-01,A,CCAS,,,,88.99B,NAFRev2,N,3.096484,48.179151,0.96,housenumber,20 Rue de la République 89150 Saint-Valérien,89370_0265_00020,G,20 RUE DE LA REPUBLIQUE,
278900568,00017,27890056800017,O,,,,,2019-11-14T14:01:04,true,1,,,,,MAIRIE,89150,SAINT-VALERIEN,,,89370,,,,,,,,,,,,,,,,,,,1995-12-25,F,,,,,75.1A,NAF1993,N,3.0709671,50.6304695,0.92,poi.townhall,Hôtel de Ville Lille,https://osm.org/way/40917078,G,,
298903709,00012,29890370900012,O,,NN,,,2019-11-14T14:01:04,true,1,,,,,MAIRIE,89150,SAINT-VALERIEN,,,89370,,,,,,,,,,,,,,,,,,,1991-12-31,F,,,,,90.12,NAP,N,3.0709671,50.6304695,0.92,poi.townhall,Hôtel de Ville Lille,https://osm.org/way/40917078,G,,
298905373,00015,29890537300015,O,1965-12-03,01,2020,,2022-08-29T09:10:59,true,3,MAIRIE,20,,RUE,DE LA REPUBLIQUE,89150,SAINT-VALERIEN,,,89370,,,,,,,,,,,,,,,,,,,2008-01-01,A,,,,,42.99Z,NAFRev2,N,3.096484,48.179151,0.96,housenumber,20 Rue de la République 89150 Saint-Valérien,89370_0265_00020,G,20 RUE DE LA REPUBLIQUE,
301050241,00019,30105024100019,O,1974-01-01,NN,,9602AA,2019-11-14T14:01:04,true,6,,23,B,RUE,DE LA REPUBLIQUE,89150,SAINT-VALERIEN,,,89370,,,,,,,,,,,,,,,,,,,2014-09-27,F,,,,,96.02A,NAFRev2,N,3.096323,48.178927,0.96,housenumber,23b Rue de la République 89150 Saint-Valérien,89370_0265_00023_b,G,23B RUE DE LA REPUBLIQUE,
301210191,00013,30121019100013,O,,,,,2019-11-14T14:01:04,true,1,,39,,RUE,D'ENFER,89150,SAINT-VALERIEN,,,89370,,,,,,,,,,,,,,,,,,,1988-07-25,F,,,,,15.09,NAP,N,3.098454,48.173943,0.95,housenumber,39 Rue d’Enfer 89150 Saint-Valérien,89370_0075_00039,G,39 RUE D ENFER,
301845889,00015,30184588900015,O,1975-01-01,NN,,,2019-11-14T14:01:04,true,3,,62,,RUE,DE LA REPUBLIQUE,89150,SAINT-VALERIEN,,,89370,,,,,,,,,,,,,,,,,,,2007-09-30,F,,,,,45.3A,NAFRev1,N,3.090931,48.180283,0.96,housenumber,62 Rue de la République 89150 Saint-Valérien,89370_0265_00062,G,62 RUE DE LA REPUBLIQUE,
303465694,00014,30346569400014,O,2001-10-01,NN,,,2019-11-14T14:01:04,false,3,,45,,RUE,DE LA REPUBLIQUE,89150,SAINT-VALERIEN,,,89370,,,,,,,,,,,,,,,,,,,2001-12-25,F,,,,,51.2E,NAF1993,N,3.094448,48.17898,0.96,housenumber,45 Rue de la République 89150 Saint-Valérien,89370_0265_00045,G,45 RUE DE LA REPUBLIQUE,
304199367,00026,30419936700026,O,,NN,,,2019-11-14T14:01:04,true,1,,,,,LA GRANDE ROUE,89150,SAINT-VALERIEN,,,89370,,,,,,,,,,,,,,,,,,,2000-03-31,F,,,,,70.2C,NAF1993,N,3.093808,48.197709,0.94,locality,La Grande Roue 89150 Saint-Valérien,89370_B105,G,LA GRANDE ROUE,
304538465,00010,30453846500010,O,1963-01-01,NN,,,2019-11-14T14:01:04,true,4,,1,,RUE,DU GATINAIS,89150,SAINT-VALERIEN,,,89370,,,,,,,,,,,,,,,,,,,1998-12-25,F,,,,,29.3C,NAF1993,O,3.093189,48.179128,0.95,housenumber,1 Rue du Gâtinais 89150 Saint-Valérien,89370_0100_00001,G,1 RUE DU GATINAIS,
305505497,00019,30550549700019,O,1900-01-01,NN,,,2019-11-14T14:01:04,false,6,,43,,RUE,DE LA REPUBLIQUE,89150,SAINT-VALERIEN,,,89370,,,,,,,,,,,,,,,,,,,2010-10-01,F,,,,,86.21Z,NAFRev2,N,3.094661,48.178965,0.96,housenumber,43 Rue de la République 89150 Saint-Valérien,89370_0265_00043,G,43 RUE DE LA REPUBLIQUE,
305505497,00027,30550549700027,O,2010-10-01,,,,2019-11-14T14:01:04,true,3,,17,,CHE,DE LA LANCE LEVEE,89150,SAINT-VALERIEN,,,89370,,,,,,,,,,,,,,,,,,,2018-09-30,F,,,,,86.21Z,NAFRev2,N,3.08702,48.189849,0.87,housenumber,17 Chemin de la Lance Levee 89150 Saint-Valérien,89370_0130_00017,G,17 CHEMIN DE LA LANCE LEVEE,
305863623,00016,30586362300016,O,,NN,,,2019-11-14T14:01:04,true,1,,,,RUE,DES MARECHAUX,89150,SAINT-VALERIEN,,,89370,,,,,,,,,,,,,,,,,,,,F,,,,,22.02,NAP,N,3.092832,48.180289,0.95,street,Rue des Marèchaux 89150 Saint-Valérien,89370_0190,G,RUE DES MARECHAUX,
306213869,00010,30621386900010,O,,NN,,,2019-11-14T14:01:04,true,1,,15,,RUE,DE LA REPUBLIQUE,89150,SAINT-VALERIEN,,,89370,,,,,,,,,,,,,,,,,,,,F,,,,,55.10,NAP,N,3.09694,48.179084,0.96,housenumber,15 Rue de la République 89150 Saint-Valérien,89370_0265_00015,G,15 RUE DE LA REPUBLIQUE,
306326612,00026,30632661200026,O,,NN,,,2019-11-14T14:01:04,true,1,,,,,LA BORDE,89150,SAINT-VALERIEN,,,89370,,,,,,,,,,,,,,,,,,,1991-07-31,F,,,,,64.49,NAP,N,3.064711,48.186652,0.81,street,Lieu Dit la Petite Borde 89150 Saint-Valérien,89370_lzsuvm,G,LIEU DIT LA PETITE BORDE,
307012245,00022,30701224500022,P,1977-09-19,NN,,,2021-10-27T08:16:09,false,5,[ND],[ND],[ND],[ND],[ND],[ND],SAINT-VALERIEN,,[ND],89370,[ND],[ND],,,[ND],[ND],[ND],[ND],[ND],[ND],,,[ND],,[ND],[ND],,,2020-12-31,F,[ND],[ND],[ND],[ND],85.53Z,NAFRev2,N,,,0,,,,,,
307174847,00011,30717484700011,O,,,,,2019-11-14T14:01:04,true,1,,21,,RUE,DE LA REPUBLIQUE,89150,SAINT-VALERIEN,,,89370,,,,,,,,,,,,,,,,,,,1984-12-25,F,,,,,62.43,NAP,N,3.096592,48.178924,0.96,housenumber,21 Rue de la République 89150 Saint-Valérien,89370_0265_00021,G,21 RUE DE LA REPUBLIQUE,
309583771,00030,30958377100030,O,1985-02-20,NN,,,2019-11-14T14:01:04,true,1,,31,,RUE,DE LA REPUBLIQUE,89150,SAINT-VALERIEN,,,89370,,,,,,,,,,,,,,,,,,,1999-07-31,F,,,,,55.3A,NAF1993,O,3.095777,48.178865,0.96,housenumber,31 Rue de la République 89150 Saint-Valérien,89370_0265_00031,G,31 RUE DE LA REPUBLIQUE,
309967016,00010,30996701600010,O,1977-01-01,NN,,,2019-11-14T14:01:04,true,6,,14,,RUE,DES FLEURS,89150,SAINT-VALERIEN,,,89370,,,,,,,,,,,,,,,,,,,2004-03-31,F,,,,,18.2E,NAFRev1,N,3.099255,48.180335,0.95,housenumber,14 Rue des Fleurs 89150 Saint-Valérien,89370_0085_00014,G,14 RUE DES FLEURS,
310090196,00026,31009019600026,O,2012-12-14,,,,2020-10-21T03:36:12,true,4,,39,,RUE,D'ENFER,89150,SAINT-VALERIEN,,,89370,,,,,,,,,,,,,,,,,,,2019-07-12,F,,,,,68.20B,NAFRev2,N,3.098454,48.173943,0.95,housenumber,39 Rue d’Enfer 89150 Saint-Valérien,89370_0075_00039,G,39 RUE D ENFER,
310090535,00017,31009053500017,O,,,,,2019-11-14T14:01:04,true,1,,3,,RUE,DES MARECHAUX,89150,SAINT-VALERIEN,,,89370,,,,,,,,,,,,,,,,,,,1984-12-25,F,,,,,62.46,NAP,N,3.093962,48.179709,0.95,housenumber,3 Rue des Marèchaux 89150 Saint-Valérien,89370_0190_00003,G,3 RUE DES MARECHAUX,
311770721,00018,31177072100018,O,1900-01-01,,,,2019-11-14T14:01:04,true,4,ZI,,,,ZONE INDUSTRIELLE,89150,SAINT-VALERIEN,,BP 19,89370,,,,,,,,,,,,,,,,,,,2001-04-03,F,,,,,28.1A,NAF1993,N,5.0269111,45.7705982,0.92,poi.industrial,Zone Industrielle Meyzieu,https://osm.org/way/117589602,G,,
311808349,00014,31180834900014,O,1978-01-01,NN,,,2019-11-14T14:01:04,true,5,,3,,CHE,DE CESAR,89150,SAINT-VALERIEN,,,89370,,,,,,,,,,,,,,,,,,,2013-02-27,F,,,,,95.24Z,NAFRev2,O,3.096988,48.177488,0.83,housenumber,3 Chemin de César 89150 Saint-Valérien,89370_0050_00003,G,3 CHEMIN DE CESAR,
312571961,00035,31257196100035,O,2012-01-01,,,,2019-11-14T14:01:04,false,1,LE GRAND TAILLIS,,,,,89150,SAINT-VALERIEN,,,89370,,,,,,,,,,,,,,,,,,,2012-01-01,A,,,,,02.10Z,NAFRev2,N,3.122418,48.175096,0.36,locality,Le Goulot de Villiers 89150 Saint-Valérien,89370_B103,D,LE GOULOT DE VILLIERS,
313217499,00018,31321749900018,O,,,,,2019-11-14T14:01:04,true,1,,15,,RUE,DE LA REPUBLIQUE,89150,SAINT-VALERIEN,,,89370,,,,,,,,,,,,,,,,,,,1984-12-25,F,,,,,69.12,NAP,N,3.09694,48.179084,0.96,housenumber,15 Rue de la République 89150 Saint-Valérien,89370_0265_00015,G,15 RUE DE LA REPUBLIQUE,
313249591,00022,31324959100022,O,1989-04-01,NN,,,2019-11-14T14:01:04,false,2,,36,,RTE,DE FONTAINES,89150,SAINT-VALERIEN,,,89370,,,,,,,,,,,,,,,,,,,1996-02-02,F,,,,,,,,3.119559,48.192684,0.77,housenumber,36 Route de Fontaine 89150 Saint-Valérien,89370_0092_00036,G,36 ROUTE DE FONTAINE,
313249591,00048,31324959100048,O,2008-08-01,,,,2021-07-07T11:13:20,true,2,,36,,RTE,DE FONTAINES,89150,SAINT-VALERIEN,,,89370,,,,,,,,,,,,,,,,,,,2019-07-02,F,,,,,01.43Z,NAFRev2,N,3.119559,48.192684,0.77,housenumber,36 Route de Fontaine 89150 Saint-Valérien,89370_0092_00036,G,36 ROUTE DE FONTAINE,
313373037,00032,31337303700032,O,1995-11-20,NN,,,2019-11-14T14:01:04,false,4,,3,,PL,DE LA PAIX,89150,SAINT-VALERIEN,,,89370,,,,,,,,,,,,,,,,,,,1999-12-25,F,,,,,85.2Z,NAF1993,N,3.095296,48.178389,0.83,housenumber,3 Place de la Paix 89150 Saint-Valérien,89370_0235_00003,G,3 PLACE DE LA PAIX,
314632738,00014,31463273800014,O,,,,,2019-11-14T14:01:04,true,1,,,,LD,LA CHAMPAGNE,89150,SAINT-VALERIEN,,,89370,,,,,,,,,,,,,,,,,,,1985-08-08,F,,,,,01.50,NAP,N,3.08417,48.182479,0.45,street,Lieu Dit la Chardonnerie 89150 Saint-Valérien,89370_tinx2v,G,LIEU DIT LA CHARDONNERIE,
314670258,00024,31467025800024,O,1998-12-25,NN,,,2019-11-14T14:01:04,true,2,,,,,LA CARTAUDERIE,89150,SAINT-VALERIEN,,,89370,,,,,,,,,,,,,,,,,,,2005-12-31,F,,,,,01.3Z,NAFRev1,N,3.08417,48.182479,0.46,street,Lieu Dit la Chardonnerie 89150 Saint-Valérien,89370_tinx2v,G,LIEU DIT LA CHARDONNERIE,
314670274,00013,31467027400013,O,1978-01-01,,,,2019-11-14T14:01:04,true,4,,22,,CHE,DE CESAR,89150,SAINT-VALERIEN,,,89370,,,,,,,,,,,,,,,,,,,2008-01-01,F,,,,,01.11Z,NAFRev2,N,3.094282,48.177395,0.84,housenumber,22 Chemin de César 89150 Saint-Valérien,89370_0050_00022,G,22 CHEMIN DE CESAR,
314722596,00017,31472259600017,O,,,,,2019-11-14T14:01:04,true,1,,,,LD,LA RUE,89150,SAINT-VALERIEN,,,89370,,,,,,,,,,,,,,,,,,,1989-01-24,F,,,,,01.1A,NAF1993,N,3.092476,48.180087,0.93,street,Rue de la République 89150 Saint-Valérien,89370_0265,G,RUE DE LA REPUBLIQUE,
315677468,00037,31567746800037,O,1980-09-15,NN,,,2019-11-14T14:01:04,true,4,,45,,RUE,DE LA REPUBLIQUE,89150,SAINT-VALERIEN,,,89370,,,,,,,,,,,,,,,,,,,2017-10-11,F,,,,,86.90E,NAFRev2,N,3.094448,48.17898,0.96,housenumber,45 Rue de la République 89150 Saint-Valérien,89370_0265_00045,G,45 RUE DE LA REPUBLIQUE,
315831818,00010,31583181800010,O,,,,,2019-11-14T14:01:04,true,1,,57,,RUE,DE LA REPUBLIQUE,89150,SAINT-VALERIEN,,,89370,,,,,,,,,,,,,,,,,,,1985-12-25,F,,,,,65.06,NAP,N,3.092802,48.179568,0.96,housenumber,57 Rue de la République 89150 Saint-Valérien,89370_0265_00057,G,57 RUE DE LA REPUBLIQUE,
317250629,00019,31725062900019,O,,NN,,,2019-11-14T14:01:04,true,1,,44,,RUE,DE LA REPUBLIQUE,89150,SAINT-VALERIEN,,,89370,,,,,,,,,,,,,,,,,,,1989-11-24,F,,,,,62.43,NAP,N,3.093649,48.179314,0.96,housenumber,44 Rue de la République 89150 Saint-Valérien,89370_0265_00044,G,44 RUE DE LA REPUBLIQUE,
317835791,00011,31783579100011,O,1980-01-01,NN,,,2019-11-14T14:01:04,false,4,,77,,RUE,DE LA REPUBLIQUE,89150,SAINT-VALERIEN,,,89370,,,,,,,,,,,,,,,,,,,1996-06-30,F,,,,,45.2V,NAF1993,N,3.089313,48.180217,0.96,housenumber,77 Rue de la République 89150 Saint-Valérien,89370_0265_00077,G,77 RUE DE LA REPUBLIQUE,
317886521,00010,31788652100010,O,1900-01-01,NN,,,2019-11-14T14:01:04,false,4,,10,,CHE,DE CESAR,89150,SAINT-VALERIEN,,,89370,,,,,,,,,,,,,,,,,,,1994-06-29,F,,,,,01.3Z,NAF1993,N,3.096345,48.177534,0.84,housenumber,10 Chemin de César 89150 Saint-Valérien,89370_0050_00010,G,10 CHEMIN DE CESAR,
317886521,00028,31788652100028,O,2007-06-07,,,,2021-08-13T03:43:27,true,2,,105,,RUE,DE LA REPUBLIQUE,89150,SAINT-VALERIEN,,,89370,,,,,,,,,,,,,,,,,,,2008-01-01,A,,,,,01.50Z,NAFRev2,N,3.085412,48.181551,0.96,housenumber,105 Rue de la République 89150 Saint-Valérien,89370_0265_00105,G,105 RUE DE LA REPUBLIQUE,
318758653,00014,31875865300014,O,1980-01-01,NN,,,2019-11-14T14:01:04,true,3,,43,,RUE,DE LA REPUBLIQUE,89150,SAINT-VALERIEN,,,89370,,,,,,,,,,,,,,,,,,,2007-03-22,F,,,,,85.1C,NAFRev1,N,3.094661,48.178965,0.96,housenumber,43 Rue de la République 89150 Saint-Valérien,89370_0265_00043,G,43 RUE DE LA REPUBLIQUE,
319631644,00014,31963164400014,O,,NN,,,2019-11-14T14:01:04,true,1,,,,RUE,DU GATINAIS,89150,SAINT-VALERIEN,,,89370,,,,,,,,,,,,,,,,,,,,F,,,,,59.07,NAP,N,3.09045,48.17862,0.95,street,Rue du Gâtinais 89150 Saint-Valérien,89370_0100,G,RUE DU GATINAIS,
320774698,00023,32077469800023,O,1999-04-08,NN,,,2022-06-10T19:40:18,true,4,,105,,RUE,DE LA REPUBLIQUE,89150,SAINT-VALERIEN,,,89370,,,,,,,,,,,,,,,,,,,2022-06-09,F,,,,,01.11Z,NAFRev2,N,3.085412,48.181551,0.96,housenumber,105 Rue de la République 89150 Saint-Valérien,89370_0265_00105,G,105 RUE DE LA REPUBLIQUE,
321287518,00013,32128751800013,O,1980-11-07,NN,,,2019-11-14T14:01:04,true,1,,33,,RUE,DE LA REPUBLIQUE,89150,SAINT-VALERIEN,,,89370,,,,,,,,,,,,,,,,,,,1999-10-31,F,,,,,52.4V,NAF1993,O,3.095633,48.178874,0.96,housenumber,33 Rue de la République 89150 Saint-Valérien,89370_0265_00033,G,33 RUE DE LA REPUBLIQUE,
321734121,00015,32173412100015,O,1981-01-01,NN,,,2019-11-14T14:01:04,true,1,,,,,Z I LES MARTINIERES,89150,SAINT-VALERIEN,,,89370,,,,,,,,,,,,,,,,,,,2000-12-12,F,,,,,45.4C,NAF1993,O,,,0,,,,,,
321967309,00014,32196730900014,O,,,,,2019-11-14T14:01:04,true,1,,65,,RUE,DE LA REPUBLIQUE,89150,SAINT-VALERIEN,,,89370,,,,,,,,,,,,,,,,,,,1997-03-28,F,,,,,52.4E,NAF1993,N,3.092162,48.179876,0.96,housenumber,65 Rue de la République 89150 Saint-Valérien,89370_0265_00065,G,65 RUE DE LA REPUBLIQUE,
323231670,00015,32323167000015,O,,,,,2019-11-14T14:01:04,true,1,,,,,LA MERLUCHERIE,89150,SAINT-VALERIEN,,,89370,,,,,,,,,,,,,,,,,,,1984-12-25,F,,,,,64.49,NAP,N,3.087692,48.179778,0.51,locality,La Vigne au Merle 89150 Saint-Valérien,89370_B172,G,LA VIGNE AU MERLE,
323243782,00014,32324378200014,O,,,,,2019-11-14T14:01:04,true,1,,12,,RUE,DES ESPARS,89150,SAINT-VALERIEN,,,89370,,,,,,,,,,,,,,,,,,,,F,,,,,55.60,NAP,N,3.096257,48.175589,0.95,housenumber,12 Rue des Espars 89150 Saint-Valérien,89370_0078_00012,G,12 RUE DES ESPARS,
324083864,00011,32408386400011,O,1982-02-20,NN,,,2019-11-14T14:01:04,true,3,,22,,CHE,DE CESAR,89150,SAINT-VALERIEN,,,89370,,,,,,,,,,,,,,,,,,,2008-01-01,A,,,,,68.20B,NAFRev2,N,3.094282,48.177395,0.84,housenumber,22 Chemin de César 89150 Saint-Valérien,89370_0050_00022,G,22 CHEMIN DE CESAR,
324202175,00018,32420217500018,O,1900-01-01,NN,,,2019-11-14T14:01:04,false,4,,4,,RUE,DE LA REPUBLIQUE,89150,SAINT-VALERIEN,,,89370,,,,,,,,,,,,,,,,,,,1988-12-25,F,,,,,65.06,NAP,N,3.099811,48.179046,0.96,housenumber,4 Rue de la République 89150 Saint-Valérien,89370_0265_00004,G,4 RUE DE LA REPUBLIQUE,
324747294,00027,32474729400027,O,1985-07-11,NN,,,2019-11-14T14:01:04,true,3,,,,,LA FERME DES FREGERS,89150,SAINT-VALERIEN,,,89370,,,,,,,,,,,,,,,,,,,2008-01-01,A,,,,,01.11Z,NAFRev2,N,3.08613,48.169113,0.61,street,Route des Frégers 89150 Saint-Valérien,89370_0097,G,ROUTE DES FREGERS,
324858554,00011,32485855400011,O,,,,,2019-11-14T14:01:04,true,1,,11,,RUE,DE RHAUNEN,89150,SAINT-VALERIEN,,,89370,,,,,,,,,,,,,,,,,,,1984-12-25,F,,,,,55.40,NAP,N,3.096286,48.176693,0.95,housenumber,11 Rue de Rhaunen 89150 Saint-Valérien,89370_0270_00011,G,11 RUE DE RHAUNEN,
325693299,00019,32569329900019,O,,NN,,,2019-11-14T14:01:04,true,1,,18,,RUE,DE LA REPUBLIQUE,89150,SAINT-VALERIEN,,,89370,,,,,,,,,,,,,,,,,,,1987-04-01,F,,,,,67.01,NAP,N,3.096915,48.179277,0.96,housenumber,18 Rue de la République 89150 Saint-Valérien,89370_0265_00018,G,18 RUE DE LA REPUBLIQUE,
326091337,00013,32609133700013,O,,,,,2019-11-14T14:01:04,true,1,,1,,CHE,DE CESAR,89150,SAINT-VALERIEN,,,89370,,,,,,,,,,,,,,,,,,,1985-12-25,F,,,,,60.09,NAP,N,3.097497,48.177514,0.83,housenumber,1 Chemin de César 89150 Saint-Valérien,89370_0050_00001,G,1 CHEMIN DE CESAR,
326578986,00019,32657898600019,O,1983-01-15,01,2020,,2022-08-29T09:19:23,true,4,,,,,FERME DE LA RUE,89150,SAINT-VALERIEN,,,89370,,,,,,,,,,,,,,,,,,,2008-01-01,A,,,,,01.11Z,NAFRev2,N,3.093079,48.181606,0.64,street,Chemin de la Ferme 89150 Saint-Valérien,89370_0082,G,CHEMIN DE LA FERME,
327251401,00011,32725140100011,O,1983-02-01,NN,,,2019-11-14T14:01:04,true,3,,,,,LES MARTINIERES,89150,SAINT-VALERIEN,,,89370,,,,,,,,,,,,,,,,,,,2008-01-01,A,,,,,90.03B,NAFRev2,N,3.09083,48.189669,0.94,street,Les Martinieres 89150 Saint-Valérien,89370_2b7153,G,LES MARTINIERES,
327258612,00016,32725861200016,O,1983-05-10,NN,,,2019-11-14T14:01:04,true,3,FERME DE LA RUE,,,,,89150,SAINT-VALERIEN,,,89370,,,,,,,,,,,,,,,,,,,2008-01-01,A,,,,,68.20B,NAFRev2,N,3.093079,48.181606,0.64,street,Chemin de la Ferme 89150 Saint-Valérien,89370_0082,D,CHEMIN DE LA FERME,
327726287,00011,32772628700011,O,1983-01-01,NN,,,2019-11-14T14:01:04,true,4,,,,LD,LES FREGERS,89150,SAINT-VALERIEN,,,89370,,,,,,,,,,,,,,,,,,,2012-12-31,F,,,,,01.61Z,NAFRev2,N,3.08613,48.169113,0.78,street,Route des Frégers 89150 Saint-Valérien,89370_0097,G,ROUTE DES FREGERS,
328535307,00016,32853530700016,O,1983-10-04,NN,,,2019-11-14T14:01:04,true,1,,49,,RUE,DE LA REPUBLIQUE,89150,SAINT-VALERIEN,,,89370,,,,,,,,,,,,,,,,,,,2002-09-23,F,,,,,15.8C,NAF1993,O,3.094143,48.17898,0.96,housenumber,49 Rue de la République 89150 Saint-Valérien,89370_0265_00049,G,49 RUE DE LA REPUBLIQUE,
328675277,00011,32867527700011,O,1984-01-02,NN,,,2019-11-14T14:01:04,true,2,,,,,LA BORDE,89150,SAINT-VALERIEN,,,89370,,,,,,,,,,,,,,,,,,,1989-03-31,F,,,,,,,,3.064711,48.186652,0.81,street,Lieu Dit la Petite Borde 89150 Saint-Valérien,89370_lzsuvm,G,LIEU DIT LA PETITE BORDE,
328955828,00012,32895582800012,O,,,,,2019-11-14T14:01:04,true,1,,2,,CITE,DE L OASIS,89150,SAINT-VALERIEN,,,89370,,,,,,,,,,,,,,,,,,,1985-12-25,F,,,,,48.01,NAP,N,3.085818,48.191743,0.5,housenumber,2 Lieu Dit l’Oasis 89150 Saint-Valérien,89370_3670me_00002,G,2 LIEU DIT L OASIS,
329261465,00010,32926146500010,O,,,,,2019-11-14T14:01:04,true,1,,5,,RUE,DE L ETANG BOUVIER,89150,SAINT-VALERIEN,,,89370,,,,,,,,,,,,,,,,,,,1985-12-25,F,,,,,77.10,NAP,N,3.095414,48.176085,0.95,housenumber,5 Rue de l’Etang Bouvier 89150 Saint-Valérien,89370_0080_00005,G,5 RUE DE L ETANG BOUVIER,
330415886,00010,33041588600010,O,1984-07-02,NN,,,2019-11-14T14:01:04,true,5,,12,,RUE,CHARLES BOULLE,89150,SAINT-VALERIEN,,,89370,,,,,,,,,,,,,,,,,,,2004-07-30,F,,,,,85.3K,NAFRev1,N,3.09373,48.177562,0.95,housenumber,12 Rue Charles Boullé 89150 Saint-Valérien,89370_0040_00012,G,12 RUE CHARLES BOULLE,
330896127,00017,33089612700017,O,1984-10-04,NN,,,2022-12-23T04:00:02,true,3,,,,LD,L ECCARIES,89150,SAINT-VALERIEN,,,89370,,,,,,,,,,,,,,,,,,,2008-01-01,A,,,,,01.11Z,NAFRev2,N,3.083183,48.161872,0.52,street,Route de l’Ecarris 89150 Saint-Valérien,89370_0066,G,ROUTE DE L ECARRIS,
330922576,00013,33092257600013,O,1984-10-11,,,,2019-11-14T14:01:04,true,5,,,,LD,LE MOULIN DE L ECLUSE,89150,SAINT-VALERIEN,,,89370,,,,,,,,,,,,,,,,,,,2015-01-01,F,,,,,01.49Z,NAFRev2,N,3.104806,48.191178,0.94,locality,Le Moulin de l’Ecluse 89150 Saint-Valérien,89370_B132,G,LE MOULIN DE L ECLUSE,
331170324,00015,33117032400015,O,1984-11-01,NN,,,2019-11-14T14:01:04,false,5,,,,DOM,LES MARTINIERES,89150,SAINT-VALERIEN,,,89370,,,,,,,,,,,,,,,,,,,2006-03-31,F,HARAS LES MARTINIERES,,,,92.7C,NAFRev1,N,3.09083,48.189669,0.77,street,Les Martinieres 89150 Saint-Valérien,89370_2b7153,G,LES MARTINIERES,
331465781,00010,33146578100010,O,1984-11-01,NN,,,2019-11-14T14:01:04,true,1,,,,HAM,FONTAINE,89150,SAINT-VALERIEN,,,89370,,,,,,,,,,,,,,,,,,,1998-08-31,F,,,,,01.1A,NAF1993,N,3.118375,48.191668,0.93,street,Route de Fontaine 89150 Saint-Valérien,89370_0092,G,ROUTE DE FONTAINE,
331468694,00012,33146869400012,O,1934-07-01,NN,,,2019-11-14T14:01:04,true,4,,3,,RUE,DE L AGRICULTURE,89150,SAINT-VALERIEN,,BP 9,89370,,,,,,,,,,,,,,,,,,,2005-07-01,F,,,,,51.2A,NAFRev1,O,3.089851,48.179594,0.95,housenumber,3 Rue de l’Agriculture 89150 Saint-Valérien,89370_0010_00003,G,3 RUE DE L AGRICULTURE,
332260876,00013,33226087600013,O,,NN,,,2019-11-14T14:01:04,true,1,,,,,COLEUVRAT,89150,SAINT-VALERIEN,,,89370,,,,,,,,,,,,,,,,,,,,F,,,,,49.01,NAP,N,3.087091,48.163234,0.94,street,Coleuvrat 89150 Saint-Valérien,89370_uzbsq8,G,COLEUVRAT,
333016749,00017,33301674900017,O,,NN,,,2019-11-14T14:01:04,true,1,,1,,RTE,DE SENS,89150,SAINT-VALERIEN,,,89370,,,,,,,,,,,,,,,,,,,,F,,,,,65.06,NAP,N,3.100113,48.178767,0.81,housenumber,1 Route de Sens 89150 Saint-Valérien,89370_0285_00001,G,1 ROUTE DE SENS,
333169100,00034,33316910000034,O,2013-03-12,,,4334ZC,2019-11-14T14:01:04,true,2,,55,,RTE,DE L'ECARRIS,89150,SAINT-VALERIEN,,,89370,,,,,,,,,,,,,,,,,,,2018-09-30,F,,,,,43.34Z,NAFRev2,N,3.081063,48.161847,0.86,housenumber,55 Route de l’Ecarris 89150 Saint-Valérien,89370_0066_00055,G,55 ROUTE DE L ECARRIS,
333204493,00014,33320449300014,O,1985-07-01,NN,,,2019-11-14T14:01:04,true,4,,43,,RUE,DE LA REPUBLIQUE,89150,SAINT-VALERIEN,,,89370,,,,,,,,,,,,,,,,,,,2008-09-15,F,,,,,68.20B,NAFRev2,N,3.094661,48.178965,0.96,housenumber,43 Rue de la République 89150 Saint-Valérien,89370_0265_00043,G,43 RUE DE LA REPUBLIQUE,
333572360,00068,33357236000068,O,2014-09-01,,,,2020-06-25T13:37:46,true,2,ZI LES FRENELLERIES,,,,,89150,SAINT-VALERIEN,,,89370,,,,,,,,,,,,,,,,,,,2020-06-30,F,,,,GRANULES 89,47.78B,NAFRev2,N,,,0,,,,,,