siren,nic,siret,statutDiffusionEtablissement,dateCreationEtablissement,trancheEffectifsEtablissement,anneeEffectifsEtablissement,activitePrincipaleRegistreMetiersEtablissement,dateDernierTraitementEtablissement,etablissementSiege,nombrePeriodesEtablissement,complementAdresseEtablissement,numeroVoieEtablissement,indiceRepetitionEtablissement,typeVoieEtablissement,libelleVoieEtablissement,codePostalEtablissement,libelleCommuneEtablissement,libelleCommuneEtrangerEtablissement,distributionSpecialeEtablissement,codeCommuneEtablissement,codeCedexEtablissement,libelleCedexEtablissement,codePaysEtrangerEtablissement,libellePaysEtrangerEtablissement,complementAdresse2Etablissement,numeroVoie2Etablissement,indiceRepetition2Etablissement,typeVoie2Etablissement,libelleVoie2Etablissement,codePostal2Etablissement,libelleCommune2Etablissement,libelleCommuneEtranger2Etablissement,distributionSpeciale2Etablissement,codeCommune2Etablissement,codeCedex2Etablissement,libelleCedex2Etablissement,codePaysEtranger2Etablissement,libellePaysEtranger2Etablissement,dateDebut,etatAdministratifEtablissement,enseigne1Etablissement,enseigne2Etablissement,enseigne3Etablissement,denominationUsuelleEtablissement,activitePrincipaleEtablissement,nomenclatureActivitePrincipaleEtablissement,caractereEmployeurEtablissement,longitude,latitude,geo_score,geo_type,geo_adresse,geo_id,geo_ligne,geo_l4,geo_l5
216700369,00012,21670036900012,O,1983-03-01,03,2020,,2022-08-29T09:08:25,true,4,,26,,RUE,PRINCIPALE,67320,BETTWILLER,,,67036,,,,,,,,,,,,,,,,,,,2008-01-01,A,MAIRIE,,,,84.11Z,NAFRev2,O,7.179044,48.884726,0.95,housenumber,26 Rue Principale 67320 Bettwiller,67036_0030_00026,G,26 RUE PRINCIPALE,
216700369,00020,21670036900020,O,1983-12-21,01,2020,,2022-08-29T09:08:25,false,3,,26,,RUE,PRINCIPALE,67320,BETTWILLER,,,67036,,,,,,,,,,,,,,,,,,,2008-01-01,A,ECOLE PRIMAIRE PUBLIQUE,,,,85.20Z,NAFRev2,N,7.179044,48.884726,0.95,housenumber,26 Rue Principale 67320 Bettwiller,67036_0030_00026,G,26 RUE PRINCIPALE,
216700369,00038,21670036900038,O,2000-01-01,NN,,,2008-01-04T18:39:41,false,3,MAIRIE,26,,RUE,PRINCIAPLE,67320,BETTWILLER,,,67036,,,,,,,,,,,,,,,,,,,2008-01-01,A,LOTISSEMENT,,,,42.99Z,NAFRev2,N,7.179044,48.884726,0.75,housenumber,26 Rue Principale 67320 Bettwiller,67036_0030_00026,G,26 RUE PRINCIPALE,
216700369,00046,21670036900046,O,1999-12-25,NN,,,2010-04-18T03:13:18,false,2,MAIRIE,26,,RUE,PRINCIPALE,67320,BETTWILLER,,,67036,,,,,,,,,,,,,,,,,,,2008-01-01,A,SERVICE D'ASSAINISSEMENT,,,,37.00Z,NAFRev2,N,7.179044,48.884726,0.95,housenumber,26 Rue Principale 67320 Bettwiller,67036_0030_00026,G,26 RUE PRINCIPALE,
266704931,00010,26670493100010,O,1995-12-25,NN,,,2017-10-13T16:25:21,true,3,MAIRIE,26,,RUE,PRINCIPALE,67320,BETTWILLER,,,67036,,,,,,,,,,,,,,,,,,,2016-01-01,F,CCAS,,,,88.99B,NAFRev2,N,7.179044,48.884726,0.95,housenumber,26 Rue Principale 67320 Bettwiller,67036_0030_00026,G,26 RUE PRINCIPALE,
296703903,00017,29670390300017,O,1991-11-01,NN,,,2008-01-04T19:07:42,true,4,MAIRIE,26,,RUE,PRINCIPALE,67320,BETTWILLER,,,67036,,,,,,,,,,,,,,,,,,,2008-01-01,A,,,,,42.99Z,NAFRev2,O,7.179044,48.884726,0.95,housenumber,26 Rue Principale 67320 Bettwiller,67036_0030_00026,G,26 RUE PRINCIPALE,
307086819,00017,30708681900017,O,,NN,,,,true,1,,21,,RUE,PRINCIPALE,67320,BETTWILLER,,,67036,,,,,,,,,,,,,,,,,,,1992-07-31,F,,,,,70.2C,NAF1993,N,7.179832,48.88618,0.95,housenumber,21 Rue Principale 67320 Bettwiller,67036_0030_00021,G,21 RUE PRINCIPALE,
317873818,00015,31787381800015,O,1900-01-01,,,,,false,4,,,,,,67320,BETTWILLER,,,67036,,,,,,,,,,,,,,,,,,,1993-11-10,F,,,,,67.2Z,NAF1993,N,,,0,,,,,,
324013200,00013,32401320000013,O,,NN,,,,true,1,,,,LOT,WOLFSGAERTEN,67320,BETTWILLER,,,67036,,,,,,,,,,,,,,,,,,,1991-03-01,F,,,,,87.03,NAP,N,,,0,,,,,,
326123064,00023,32612306400023,O,2012-09-05,,,,2014-07-17T15:08:57,true,2,,17,,RTE,PRINCIPALE,67320,BETTWILLER,,,67036,,,,,,,,,,,,,,,,,,,2014-03-01,F,,,,,47.22Z,NAFRev2,N,7.179417,48.886548,0.8,housenumber,17 Rue Principale 67320 Bettwiller,67036_0030_00017,G,17 RUE PRINCIPALE,
329809602,00017,32980960200017,O,,NN,,,,true,1,,27,,RUE,PRINCIPALE,67320,BETTWILLER,,,67036,,,,,,,,,,,,,,,,,,,1994-11-30,F,,,,,92.3A,NAF1993,N,7.178027,48.884325,0.95,housenumber,27 Rue Principale 67320 Bettwiller,67036_0030_00027,G,27 RUE PRINCIPALE,
340199223,00017,34019922300017,O,1987-01-30,NN,,,2020-12-16T03:41:07,true,5,,2,,RUE,PRINCIPALE,67320,BETTWILLER,,,67036,,,,,,,,,,,,,,,,,,,2020-12-31,F,,,,,68.20B,NAFRev2,N,7.176945,48.88804,0.95,housenumber,2 Rue Principale 67320 Bettwiller,67036_0030_00002,G,2 RUE PRINCIPALE,
348582958,00024,34858295800024,O,1991-12-31,NN,,,2008-01-04T22:53:38,true,3,,51,,RUE,PRINCIPALE,67320,BETTWILLER,,,67036,,,,,,,,,,,,,,,,,,,2008-01-01,A,,,,,68.31Z,NAFRev2,N,7.180013,48.886514,0.95,housenumber,51 Rue Principale 67320 Bettwiller,67036_0030_00051,G,51 RUE PRINCIPALE,
348582958,00032,34858295800032,O,1985-12-31,NN,,,,false,3,,51,,RUE,PRINCIPALE,67320,BETTWILLER,,,67036,,,,,,,,,,,,,,,,,,,2003-06-01,F,,,,,01.1A,NAFRev1,N,7.180013,48.886514,0.95,housenumber,51 Rue Principale 67320 Bettwiller,67036_0030_00051,G,51 RUE PRINCIPALE,
383039112,00016,38303911200016,O,1991-07-01,NN,,,2017-05-04T02:36:13,true,4,,,,,FERME VIEUX MOULIN,67320,BETTWILLER,,,67036,,,,,,,,,,,,,,,,,,,2015-01-15,F,,,,,01.41Z,NAFRev2,N,7.178608,48.893978,0.88,street,Ferme du Vieux Moulin 67320 Bettwiller,67036_B052,G,FERME DU VIEUX MOULIN,
383641123,00013,38364112300013,O,1991-11-19,NN,,,,false,3,,12,,RUE,DU PRINTEMPS,67320,BETTWILLER,,,67036,,,,,,,,,,,,,,,,,,,1994-02-01,F,,,,,52.6E,NAF1993,,7.169799,48.88454,0.94,housenumber,12 Rue du Printemps 67320 Bettwiller,67036_0035_00012,G,12 RUE DU PRINTEMPS,
384057105,00015,38405710500015,O,1991-07-01,NN,,,2011-06-29T03:58:59,true,4,,,,,FERME VIEUX MOULIN,67320,BETTWILLER,,,67036,,,,,,,,,,,,,,,,,,,2010-12-31,F,,,,,68.20B,NAFRev2,N,7.178608,48.893978,0.88,street,Ferme du Vieux Moulin 67320 Bettwiller,67036_B052,G,FERME DU VIEUX MOULIN,
390002749,00013,39000274900013,O,1993-01-01,NN,,,2010-01-29T05:45:14,true,4,,11,,RUE,PRINCIPALE,67320,BETTWILLER,,,67036,,,,,,,,,,,,,,,,,,,2009-12-31,F,,,,,01.42Z,NAFRev2,N,7.178748,48.887033,0.95,housenumber,11 Rue Principale 67320 Bettwiller,67036_0030_00011,G,11 RUE PRINCIPALE,
390116242,00012,39011624200012,O,,NN,,,,true,1,,44,,RUE,DE DURSTEL,67320,BETTWILLER,,,67036,,,,,,,,,,,,,,,,,,,1993-12-31,F,,,,,01.1A,NAF1993,N,7.18132,48.886574,0.41,housenumber,44 Rue Principale 67320 Bettwiller,67036_0030_00044,G,44 RUE PRINCIPALE,
391128808,00014,39112880800014,O,1993-03-19,NN,,,2022-02-02T03:44:27,false,4,,4,,RUE,PRINCIPALE,67320,BETTWILLER,,,67036,,,,,,,,,,,,,,,,,,,2021-12-04,F,,,,,68.20B,NAFRev2,N,7.177425,48.887714,0.95,housenumber,4 Rue Principale 67320 Bettwiller,67036_0030_00004,G,4 RUE PRINCIPALE,
391606621,00012,39160662100012,O,1984-01-01,NN,,,2006-10-28T01:46:04,true,3,,47,,RUE,PRINCIPALE,67320,BETTWILLER,,,67036,,,,,,,,,,,,,,,,,,,2004-12-31,F,,,,,01.1A,NAFRev1,N,7.180405,48.885929,0.95,housenumber,47 Rue Principale 67320 Bettwiller,67036_0030_00047,G,47 RUE PRINCIPALE,
391606787,00011,39160678700011,P,1980-01-01,NN,,,2012-05-05T04:36:49,false,4,[ND],[ND],[ND],[ND],[ND],[ND],BETTWILLER,,[ND],67036,[ND],[ND],,,[ND],[ND],[ND],[ND],[ND],[ND],,,[ND],,[ND],[ND],,,2010-05-19,F,[ND],[ND],[ND],[ND],01.41Z,NAFRev2,N,,,0,,,,,,
391606787,00029,39160678700029,P,2010-05-19,NN,,,2019-06-24T13:17:58,false,3,[ND],[ND],[ND],[ND],[ND],[ND],BETTWILLER,,[ND],67036,[ND],[ND],,,[ND],[ND],[ND],[ND],[ND],[ND],,,[ND],,[ND],[ND],,,2017-03-31,F,[ND],[ND],[ND],[ND],01.42Z,NAFRev2,O,,,0,,,,,,
392300596,00013,39230059600013,O,,NN,,,,true,1,,28,A,RUE,DU STADE,67320,BETTWILLER,,,67036,,,,,,,,,,,,,,,,,,,1995-12-01,F,,,,,92.3A,NAF1993,N,7.176074,48.883861,0.93,housenumber,28a Rue du Stade 67320 Bettwiller,67036_7pvs6n_00028_a,G,28A RUE DU STADE,
399894120,00019,39989412000019,O,1990-01-01,NN,,,,true,1,,,,,,67320,BETTWILLER,,,67036,,,,,,,,,,,,,,,,,,,1999-01-21,F,,,,,71.3A,NAF1993,N,,,0,,,,,,
402631337,00035,40263133700035,O,2015-03-01,,,,2022-09-29T09:24:27,true,2,,30,,RUE,PRINCIPALE,67320,BETTWILLER,,,67036,,,,,,,,,,,,,,,,,,,2021-12-31,F,WJM MULTI SERVICES,,,WETZEL JEAN-MICHEL MULTI-SERVICES,47.89Z,NAFRev2,N,7.178379,48.884362,0.95,housenumber,30 Rue Principale 67320 Bettwiller,67036_0030_00030,G,30 RUE PRINCIPALE,
409744125,00017,40974412500017,O,1985-12-31,NN,,,2010-03-19T04:42:43,true,4,,,,,,67320,BETTWILLER,,,67036,,,,,,,,,,,,,,,,,,,2008-12-31,F,,,,,01.11Z,NAFRev2,N,,,0,,,,,,
410419626,00016,41041962600016,O,1985-12-31,NN,,,2008-01-04T21:43:09,true,3,,,,,,67320,BETTWILLER,,,67036,,,,,,,,,,,,,,,,,,,2007-05-16,F,,,,,01.1A,NAFRev1,N,,,0,,,,,,
410419634,00010,41041963400010,O,1989-01-01,NN,,,2015-11-04T04:26:18,true,4,,59,,RUE,PRINCIPALE,67320,BETTWILLER,,,67036,,,,,,,,,,,,,,,,,,,2015-10-01,F,,,,,01.50Z,NAFRev2,N,7.178527,48.887225,0.95,housenumber,59 Rue Principale 67320 Bettwiller,67036_0030_00059,G,59 RUE PRINCIPALE,
412689861,00026,41268986100026,O,2012-04-18,,,9511ZZ,2018-01-09T19:35:03,true,2,,7,,RUE,PRINCIPALE,67320,BETTWILLER,,,67036,,,,,,,,,,,,,,,,,,,2017-12-31,F,PHENIXAT  PHENIX@T,,,,62.01Z,NAFRev2,N,7.177833,48.887486,0.95,housenumber,7 Rue Principale 67320 Bettwiller,67036_0030_00007,G,7 RUE PRINCIPALE,
441621349,00014,44162134900014,O,1980-01-01,NN,,,2020-11-13T11:25:58,true,4,,70,A,RUE,PRINCIPALE,67320,BETTWILLER,,,67036,,,,,,,,,,,,,,,,,,,2009-12-31,F,,,,,01.50Z,NAFRev2,N,7.17486,48.889069,0.95,housenumber,70a Rue Principale 67320 Bettwiller,67036_0030_00070_a,G,70A RUE PRINCIPALE,
442134532,00013,44213453200013,O,1999-01-01,NN,,,,true,3,,1,,RUE,DE LA FORET,67320,BETTWILLER,,,67036,,,,,,,,,,,,,,,,,,,2003-12-31,F,,,,,01.1A,NAFRev1,N,7.167947,48.885129,0.94,housenumber,1 Rue de la Forêt 67320 Bettwiller,67036_0015_00001,G,1 RUE DE LA FORET,
448692806,00012,44869280600012,O,2003-06-01,NN,,,2022-02-01T03:45:19,true,4,,51,,RUE,PRINCIPALE,67320,BETTWILLER,,,67036,,,,,,,,,,,,,,,,,,,2021-12-23,A,,,,,01.11Z,NAFRev2,N,7.180013,48.886514,0.95,housenumber,51 Rue Principale 67320 Bettwiller,67036_0030_00051,G,51 RUE PRINCIPALE,
450507801,00014,45050780100014,O,2003-09-01,NN,,,2022-02-01T03:45:19,true,4,,51,,RUE,PRINCIPALE,67320,BETTWILLER,,,67036,,,,,,,,,,,,,,,,,,,2021-12-22,F,,,,,01.50Z,NAFRev2,N,7.180013,48.886514,0.95,housenumber,51 Rue Principale 67320 Bettwiller,67036_0030_00051,G,51 RUE PRINCIPALE,
478578354,00019,47857835400019,O,2004-07-01,,,,2008-01-05T03:45:20,true,3,,2,,RUE,PRINCIPALE,67320,BETTWILLER,,,67036,,,,,,,,,,,,,,,,,,,2008-01-01,A,,,,,01.42Z,NAFRev2,N,7.176945,48.88804,0.95,housenumber,2 Rue Principale 67320 Bettwiller,67036_0030_00002,G,2 RUE PRINCIPALE,
479471302,00014,47947130200014,O,2004-11-01,NN,,,2014-06-14T02:03:45,false,7,,62,,RUE,PRINCIPALE,67320,BETTWILLER,,,67036,,,,,,,,,,,,,,,,,,,2012-11-15,F,,,,,46.49Z,NAFRev2,O,7.178085,48.887434,0.95,housenumber,62 Rue Principale 67320 Bettwiller,67036_0030_00062,G,62 RUE PRINCIPALE,
482053568,00010,48205356800010,O,2005-02-24,,,,2008-01-05T21:48:57,true,2,,17,,RUE,PRINCIPALE,67320,BETTWILLER,,,67036,,,,,,,,,,,,,,,,,,,2008-01-01,A,,,,,68.20B,NAFRev2,N,7.179417,48.886548,0.95,housenumber,17 Rue Principale 67320 Bettwiller,67036_0030_00017,G,17 RUE PRINCIPALE,
483675815,00011,48367581500011,O,2005-08-09,NN,,,2009-06-27T12:18:37,true,4,,5,,RUE,PRINCIPALE,67320,BETTWILLER,,,67036,,,,,,,,,,,,,,,,,,,2009-02-10,F,,,,,43.99C,NAFRev2,N,7.177601,48.887597,0.95,housenumber,5 Rue Principale 67320 Bettwiller,67036_0030_00005,G,5 RUE PRINCIPALE,
484305768,00026,48430576800026,O,2015-05-01,,,4333ZZ,2017-01-10T20:00:47,true,2,,5,,RUE,PRINCIPALE,67320,BETTWILLER,,,67036,,,,,,,,,,,,,,,,,,,2016-10-31,F,KM,,,,43.99C,NAFRev2,N,7.177601,48.887597,0.95,housenumber,5 Rue Principale 67320 Bettwiller,67036_0030_00005,G,5 RUE PRINCIPALE,
487876906,00024,48787690600024,O,2011-12-21,,,,2012-11-13T05:33:37,true,2,,8,,RUE,DU PRINTEMPS,67320,BETTWILLER,,,67036,,,,,,,,,,,,,,,,,,,2012-09-18,F,UN BRIN JOLI,,,,46.42Z,NAFRev2,N,7.1687,48.884752,0.94,housenumber,8 Rue du Printemps 67320 Bettwiller,67036_0035_00008,G,8 RUE DU PRINTEMPS,
492588934,00017,49258893400017,O,2006-10-24,,,,2010-03-13T12:25:22,true,3,,31,B,RUE,PRINCIPALE,67320,BETTWILLER,,,67036,,,,,,,,,,,,,,,,,,,2009-11-24,F,,,,,43.99B,NAFRev2,O,7.17964,48.884246,0.95,housenumber,31b Rue Principale 67320 Bettwiller,67036_0030_00031_b,G,31B RUE PRINCIPALE,
492758792,00013,49275879200013,O,2020-01-01,01,2020,,2022-08-29T09:25:36,true,4,,31,B,RUE,PRINCIPALE,67320,BETTWILLER,,,67036,,,,,,,,,,,,,,,,,,,2020-01-01,A,,,,,01.41Z,NAFRev2,O,7.17964,48.884246,0.95,housenumber,31b Rue Principale 67320 Bettwiller,67036_0030_00031_b,G,31B RUE PRINCIPALE,
499141521,00017,49914152100017,O,2007-07-02,,,4322BA,2014-06-27T00:50:08,true,2,,58,,RUE,PRINCIPALE,67320,BETTWILLER,,,67036,,,,,,,,,,,,,,,,,,,2008-01-01,A,,,,,43.22B,NAFRev2,N,7.178688,48.88713,0.95,housenumber,58 Rue Principale 67320 Bettwiller,67036_0030_00058,G,58 RUE PRINCIPALE,
508716156,00023,50871615600023,O,2020-07-15,,,,2020-10-06T03:43:52,true,1,,39,,RUE,PRINCIPALE,67320,BETTWILLER,,,67036,,,,,,,,,,,,,,,,,,,2020-07-15,A,,,,,68.20B,NAFRev2,N,7.182036,48.88576,0.95,housenumber,39 Rue Principale 67320 Bettwiller,67036_0030_00039,G,39 RUE PRINCIPALE,
528415714,00039,52841571400039,O,2013-01-14,,,,2021-02-23T15:45:08,true,1,,1,,RUE,DU NOYER,67320,BETTWILLER,,,67036,,,,,,,,,,,,,,,,,,,2013-01-14,A,,,,,46.90Z,NAFRev2,N,7.17022,48.884749,0.94,housenumber,1 Rue du Noyer 67320 Bettwiller,67036_0022_00001,G,1 RUE DU NOYER,
533926739,00012,53392673900012,O,2011-05-01,,,,2014-12-09T08:32:55,true,2,,29,,RUE,PRINCIPALE,67320,BETTWILLER,,,67036,,,,,,,,,,,,,,,,,,,2015-01-01,F,,,,,47.99A,NAFRev2,N,7.177656,48.884108,0.95,housenumber,29 Rue Principale 67320 Bettwiller,67036_0030_00029,G,29 RUE PRINCIPALE,
534154778,00011,53415477800011,O,2011-09-01,,,,2013-01-06T05:48:06,true,2,,7,,RUE,PRINTEMPS,67320,BETTWILLER,,,67036,,,,,,,,,,,,,,,,,,,2012-12-31,F,,,,,77.29Z,NAFRev2,N,7.168537,48.884704,0.88,housenumber,7 Rue du Printemps 67320 Bettwiller,67036_0035_00007,G,7 RUE DU PRINTEMPS,
675671036,00019,67567103600019,O,,,,,,true,1,,58,,,,67320,BETTWILLER,,,67036,,,,,,,,,,,,,,,,,,,1984-12-25,F,,,,,22.02,NAP,N,,,0,,,,,,
676077662,00010,67607766200010,O,,,,,,true,1,,28,,,,67320,BETTWILLER,,,67036,,,,,,,,,,,,,,,,,,,1984-12-25,F,,,,,00.97,NAP,N,,,0,,,,,,
676471253,00010,67647125300010,O,,,,,,true,1,,37,,,,67320,BETTWILLER,,,67036,,,,,,,,,,,,,,,,,,,1984-12-25,F,,,,,67.05,NAP,N,,,0,,,,,,
676770357,00017,67677035700017,O,,,,,,true,1,,70,,,,67320,BETTWILLER,,,67036,,,,,,,,,,,,,,,,,,,1984-12-25,F,,,,,69.12,NAP,N,,,0,,,,,,
676780034,00010,67678003400010,O,,,,,,true,1,,21,,RUE,PRINCIPALE,67320,BETTWILLER,,,67036,,,,,,,,,,,,,,,,,,,1992-07-30,F,,,,,74.8K,NAF1993,N,7.179832,48.88618,0.95,housenumber,21 Rue Principale 67320 Bettwiller,67036_0030_00021,G,21 RUE PRINCIPALE,
751320383,00019,75132038300019,O,2012-05-01,,,,2016-11-17T03:56:18,true,2,,5,,RUE,A L'OREE DU BOIS,67320,BETTWILLER,,,67036,,,,,,,,,,,,,,,,,,,2015-12-31,F,,,,,96.09Z,NAFRev2,N,7.169982,48.886626,0.94,housenumber,5 Rue à l’Oree du Bois 67320 Bettwiller,67036_0003_00005,G,5 RUE A L OREE DU BOIS,
778731349,00016,77873134900016,O,,,,,,true,1,,,,,,67320,BETTWILLER,,,67036,,,,,,,,,,,,,,,,,,,1984-12-25,F,,,,,59.09,NAP,N,,,0,,,,,,
778731356,00011,77873135600011,O,,,,,,true,1,,25,A,,,67320,BETTWILLER,,,67036,,,,,,,,,,,,,,,,,,,1990-05-01,F,,,,,89.03,NAP,N,,,0,,,,,,
778744581,00142,77874458100142,O,1990-05-01,NN,,,,false,3,NO 25,,,,,67320,BETTWILLER,,,67036,,,,,,,,,,,,,,,,,,,1999-12-31,F,,,,,65.1D,NAF1993,N,,,0,,,,,,
788821809,00027,78882180900027,O,2015-11-04,,,1610AQ,2019-08-14T12:48:36,true,3,(1A),1,A,RUE,PRINCIPALE,67320,BETTWILLER,,,67036,,,,,,,,,,,,,,,,,,,2019-08-19,A,,,,,16.10A,NAFRev2,N,7.175387,48.888624,0.95,housenumber,1a Rue Principale 67320 Bettwiller,67036_0030_00001_a,G,1A RUE PRINCIPALE,
790478432,00012,79047843200012,O,2012-12-01,,,,2013-11-06T08:31:11,true,2,,4,,RUE,A L'OREE DU BOIS,67320,BETTWILLER,,,67036,,,,,,,,,,,,,,,,,,,2013-11-04,F,,,,,47.99A,NAFRev2,N,7.169444,48.886765,0.94,housenumber,4 Rue à l’Oree du Bois 67320 Bettwiller,67036_0003_00004,G,4 RUE A L OREE DU BOIS,
795074152,00021,79507415200021,O,2020-01-01,,,,2021-02-23T16:24:30,true,1,,71,,RUE,PRINCIPALE,67320,BETTWILLER,,,67036,,,,,,,,,,,,,,,,,,,2020-01-01,A,,,,,90.03B,NAFRev2,N,7.175476,48.891357,0.95,housenumber,71 Rue Principale 67320 Bettwiller,67036_0030_00071,G,71 RUE PRINCIPALE,
798583845,00028,79858384500028,O,2022-11-01,,,,2023-06-25T03:33:28,true,2,,90,,RUE,PRINCIPALE,67320,BETTWILLER,,,67036,,,,,,,,,,,,,,,,,,,2023-04-30,F,,,,TOITURE CLAUDE,43.91B,NAFRev2,N,7.17843,48.886949,0.81,street,Rue Principale 67320 Bettwiller,67036_0030,G,RUE PRINCIPALE,
802407833,00010,80240783300010,O,2014-06-01,,,,2021-02-23T17:18:00,true,1,,3,,RUE,DU BERGER,67320,BETTWILLER,,,67036,,,,,,,,,,,,,,,,,,,2014-06-01,A,,,,,66.22Z,NAFRev2,N,7.169174,48.885118,0.94,housenumber,3 Rue du Berger 67320 Bettwiller,67036_0008_00003,G,3 RUE DU BERGER,
807773486,00012,80777348600012,O,2014-09-01,,,,2015-11-24T08:25:24,true,2,,62,,RUE,PRINCIPALE,67320,BETTWILLER,,,67036,,,,,,,,,,,,,,,,,,,2015-09-30,F,,,,,74.90B,NAFRev2,N,7.178085,48.887434,0.95,housenumber,62 Rue Principale 67320 Bettwiller,67036_0030_00062,G,62 RUE PRINCIPALE,
813536208,00016,81353620800016,O,2015-08-01,,,,2021-11-26T04:00:32,false,2,,5,,RUE,DU PRINTEMPS,67320,BETTWILLER,,,67036,,,,,,,,,,,,,,,,,,,2021-04-23,F,,,,,68.20B,NAFRev2,N,7.168124,48.884717,0.94,housenumber,5 Rue du Printemps 67320 Bettwiller,67036_0035_00005,G,5 RUE DU PRINTEMPS,
814467205,00013,81446720500013,O,2015-10-02,,,,2018-04-10T16:03:35,true,1,,59,,RUE,PRINCIPALE,67320,BETTWILLER,,,67036,,,,,,,,,,,,,,,,,,,2015-10-02,A,,,,,01.50Z,NAFRev2,N,7.178527,48.887225,0.95,housenumber,59 Rue Principale 67320 Bettwiller,67036_0030_00059,G,59 RUE PRINCIPALE,
822652855,00013,82265285500013,O,2016-09-26,,,,2022-09-16T09:10:27,true,2,,14,,RUE,PRINCIPALE,67320,BETTWILLER,,,67036,,,,,,,,,,,,,,,,,,,2021-12-31,F,,,,,93.29Z,NAFRev2,N,7.179056,48.886784,0.95,housenumber,14 Rue Principale 67320 Bettwiller,67036_0030_00014,G,14 RUE PRINCIPALE,
824856678,00019,82485667800019,O,2016-11-14,,,1071CB,2017-01-11T09:57:45,true,1,,28,B,RUE,PRINCIPALE,67320,BETTWILLER,,,67036,,,,,,,,,,,,,,,,,,,2016-11-14,A,TROGNONS ET PEPAINS,,,TROGNONS ET PEPAINS,10.71C,NAFRev2,N,7.177399,48.884123,0.95,housenumber,28b Rue Principale 67320 Bettwiller,67036_0030_00028_b,G,28B RUE PRINCIPALE,
828855874,00016,82885587400016,O,2017-04-01,NN,,,2021-10-27T09:33:05,true,2,,31,B,RUE,PRINCIPALE,67320,BETTWILLER,,,67036,,,,,,,,,,,,,,,,,,,2020-01-01,A,,,,,68.20B,NAFRev2,N,7.17964,48.884246,0.95,housenumber,31b Rue Principale 67320 Bettwiller,67036_0030_00031_b,G,31B RUE PRINCIPALE,
828855874,00024,82885587400024,O,2019-07-01,,,,2021-02-23T17:48:06,false,1,,31,B,RUE,PRINCIPALE,67320,BETTWILLER,,,67036,,,,,,,,,,,,,,,,,,,2019-07-01,A,,,,,68.20A,NAFRev2,N,7.17964,48.884246,0.95,housenumber,31b Rue Principale 67320 Bettwiller,67036_0030_00031_b,G,31B RUE PRINCIPALE,
830243770,00013,83024377000013,O,2017-03-16,,,,2020-09-07T08:38:55,true,2,,8,,RUE,DU NOYER,67320,BETTWILLER,,,67036,,,,,,,,,,,,,,,,,,,2019-03-08,F,,,,,47.99A,NAFRev2,N,7.169385,48.885509,0.94,housenumber,8 Rue du Noyer 67320 Bettwiller,67036_0022_00008,G,8 RUE DU NOYER,
831365960,00010,83136596000010,O,2017-08-02,,,,2021-05-26T08:54:34,false,2,,9,,,LOTISSEMENT A L'OREE DU BOIS,67320,BETTWILLER,,,67036,,,,,,,,,,,,,,,,,,,2021-02-04,F,,,,,86.90D,NAFRev2,N,7.170195,48.886153,0.61,housenumber,9 A l’Oree du Bois 67320 Bettwiller,67036_0l1nwy_00009,G,9 A L OREE DU BOIS,
832212997,00023,83221299700023,P,2018-06-01,,,,2020-10-26T08:33:37,true,2,[ND],[ND],[ND],[ND],[ND],[ND],BETTWILLER,,[ND],67036,[ND],[ND],,,[ND],[ND],[ND],[ND],[ND],[ND],,,[ND],,[ND],[ND],,,2020-10-22,F,[ND],[ND],[ND],[ND],74.30Z,NAFRev2,N,,,0,,,,,,
839048733,00027,83904873300027,P,2022-02-01,,,,2022-03-05T13:38:06,true,1,[ND],[ND],[ND],[ND],[ND],[ND],BETTWILLER,,[ND],67036,[ND],[ND],,,[ND],[ND],[ND],[ND],[ND],[ND],,,[ND],,[ND],[ND],,,2022-02-01,A,[ND],[ND],[ND],[ND],46.19B,NAFRev2,N,,,0,,,,,,
839181047,00029,83918104700029,P,2022-02-01,,,,2022-03-05T13:06:18,true,1,[ND],[ND],[ND],[ND],[ND],[ND],BETTWILLER,,[ND],67036,[ND],[ND],,,[ND],[ND],[ND],[ND],[ND],[ND],,,[ND],,[ND],[ND],,,2022-02-01,A,[ND],[ND],[ND],[ND],46.19B,NAFRev2,N,,,0,,,,,,
885065771,00010,88506577100010,P,2020-07-17,,,,2020-07-17T07:57:54,true,1,[ND],[ND],[ND],[ND],[ND],[ND],BETTWILLER,,[ND],67036,[ND],[ND],,,[ND],[ND],[ND],[ND],[ND],[ND],,,[ND],,[ND],[ND],,,2020-07-17,A,[ND],[ND],[ND],[ND],46.19B,NAFRev2,N,,,0,,,,,,
893622910,00014,89362291000014,O,2020-11-23,,,1071CB,2021-02-03T19:32:32,true,1,,15,,RUE,DU NOYER,67320,BETTWILLER,,,67036,,,,,,,,,,,,,,,,,,,2020-11-23,A,,,,PATISSERIE DE LOLO,10.71A,NAFRev2,N,7.168788,48.886002,0.94,housenumber,15 Rue du Noyer 67320 Bettwiller,67036_0022_00015,G,15 RUE DU NOYER,
910750645,00012,91075064500012,P,2022-02-23,,,,2022-02-28T08:43:21,true,1,[ND],[ND],[ND],[ND],[ND],[ND],BETTWILLER,,[ND],67036,[ND],[ND],,,[ND],[ND],[ND],[ND],[ND],[ND],,,[ND],,[ND],[ND],,,2022-02-23,A,[ND],[ND],[ND],[ND],68.31Z,NAFRev2,N,,,0,,,,,,
918118126,00013,91811812600013,O,2022-08-01,,,,2022-08-16T14:43:23,true,1,,73,,R,PRINCIPALE,67320,BETTWILLER,,,67036,,,,,,,,,,,,,,,,,,,2022-08-01,A,,,,,01.13Z,NAFRev2,N,7.176392,48.898678,0.74,housenumber,73 Rue Principale 67320 Bettwiller,67036_0030_00073,G,73 RUE PRINCIPALE,
918420795,00018,91842079500018,O,2022-08-05,,,,2022-08-18T07:15:00,true,1,,4,,R,DU PRINTEMPS,67320,BETTWILLER,,,67036,,,,,,,,,,,,,,,,,,,2022-08-05,A,,,,,68.20B,NAFRev2,N,7.167707,48.884745,0.74,housenumber,4 Rue du Printemps 67320 Bettwiller,67036_0035_00004,G,4 RUE DU PRINTEMPS,
919939322,00021,91993932200021,O,2022-09-15,,,,2023-05-16T08:34:38,false,2,,5,,RUE,PRINCIPALE,67320,BETTWILLER,,,67036,,,,,,,,,,,,,,,,,,,2023-05-12,A,OCEAN KEBAB,,,OCEAN KEBAB,56.10C,NAFRev2,O,7.177601,48.887597,0.95,housenumber,5 Rue Principale 67320 Bettwiller,67036_0030_00005,G,5 RUE PRINCIPALE,
922123591,00013,92212359100013,O,2022-09-01,,,1419ZE,2022-12-12T11:46:09,true,1,,5,,RUE,DU NOYER,67320,BETTWILLER,,,67036,,,,,,,,,,,,,,,,,,,2022-09-01,A,,,,,14.19Z,NAFRev2,N,7.169849,48.885166,0.94,housenumber,5 Rue du Noyer 67320 Bettwiller,67036_0022_00005,G,5 RUE DU NOYER,
948459052,00015,94845905200015,P,2023-01-05,,,,2023-02-04T16:26:00,true,1,[ND],[ND],[ND],[ND],[ND],[ND],BETTWILLER,,[ND],67036,[ND],[ND],,,[ND],[ND],[ND],[ND],[ND],[ND],,,[ND],,[ND],[ND],,,2023-01-05,A,[ND],[ND],[ND],[ND],33.20A,NAFRev2,N,,,0,,,,,,
