siren,nic,siret,statutDiffusionEtablissement,dateCreationEtablissement,trancheEffectifsEtablissement,anneeEffectifsEtablissement,activitePrincipaleRegistreMetiersEtablissement,dateDernierTraitementEtablissement,etablissementSiege,nombrePeriodesEtablissement,complementAdresseEtablissement,numeroVoieEtablissement,indiceRepetitionEtablissement,typeVoieEtablissement,libelleVoieEtablissement,codePostalEtablissement,libelleCommuneEtablissement,libelleCommuneEtrangerEtablissement,distributionSpecialeEtablissement,codeCommuneEtablissement,codeCedexEtablissement,libelleCedexEtablissement,codePaysEtrangerEtablissement,libellePaysEtrangerEtablissement,complementAdresse2Etablissement,numeroVoie2Etablissement,indiceRepetition2Etablissement,typeVoie2Etablissement,libelleVoie2Etablissement,codePostal2Etablissement,libelleCommune2Etablissement,libelleCommuneEtranger2Etablissement,distributionSpeciale2Etablissement,codeCommune2Etablissement,codeCedex2Etablissement,libelleCedex2Etablissement,codePaysEtranger2Etablissement,libellePaysEtranger2Etablissement,dateDebut,etatAdministratifEtablissement,enseigne1Etablissement,enseigne2Etablissement,enseigne3Etablissement,denominationUsuelleEtablissement,activitePrincipaleEtablissement,nomenclatureActivitePrincipaleEtablissement,caractereEmployeurEtablissement,longitude,latitude,geo_score,geo_type,geo_adresse,geo_id,geo_ligne,geo_l4,geo_l5
210900510,00012,21090051000012,O,1983-03-01,02,2020,,2022-08-29T09:05:51,true,3,,,,,,09300,BENAIX,,,09051,,,,,,,,,,,,,,,,,,,2008-01-01,A,MAIRIE,,,,84.11Z,NAFRev2,N,,,0,,,,,,
210900510,00020,21090051000020,O,1997-01-01,NN,,,2007-06-05T11:03:29,false,3,MAIRIE,,,,,09300,BENAIX,,,09051,,,,,,,,,,,,,,,,,,,2005-03-03,F,BUDGET ANNEXE EAU,,,,41.0Z,NAFRev1,N,,,0,,,,,,
260901707,00018,26090170700018,O,1984-09-17,NN,,,2010-06-26T03:03:58,true,3,,,,,MAIRIE,09300,BENAIX,,,09051,,,,,,,,,,,,,,,,,,,2008-01-01,A,CCAS,,,,88.99B,NAFRev2,N,3.0709671,50.6304695,0.92,poi.townhall,Hôtel de Ville Lille,https://osm.org/way/40917078,G,,
311690309,00027,31169030900027,O,,,,,,true,1,,,,,LE TURRAT,09300,BENAIX,,,09051,,,,,,,,,,,,,,,,,,,1985-12-25,F,,,,,00.10,NAP,N,1.844754,42.906468,0.91,street,Lieu Dit le Turrat 09300 Bénaix,09051_y5kr7u,G,LIEU DIT LE TURRAT,
313880361,00024,31388036100024,P,1900-01-01,NN,,,2022-01-12T04:35:59,true,6,[ND],[ND],[ND],[ND],[ND],[ND],BENAIX,,[ND],09051,[ND],[ND],,,[ND],[ND],[ND],[ND],[ND],[ND],,,[ND],,[ND],[ND],,,2021-12-31,F,[ND],[ND],[ND],[ND],74.10Z,NAFRev2,N,,,0,,,,,,
324944669,00021,32494466900021,O,1993-07-01,NN,,,2008-11-07T00:42:02,false,3,,,,,MATIBOT,09300,BENAIX,,,09051,,,,,,,,,,,,,,,,,,,1996-12-31,F,,,,,20.5A,NAF1993,N,1.832673,42.904639,0.91,street,Matibot Hameau 09300 Bénaix,09051_B046,G,MATIBOT HAMEAU,
324944669,00039,32494466900039,O,1997-04-01,NN,,1629ZA,2018-05-02T19:31:44,true,4,,,,,HAMEAU DE MORENCI,09300,BENAIX,,,09051,,,,,,,,,,,,,,,,,,,2018-04-30,F,,,,,16.29Z,NAFRev2,N,1.856859,42.890796,0.48,street,Lieu Dit Morenci 09300 Bénaix,09051_1piokw,G,LIEU DIT MORENCI,
326661089,00028,32666108900028,O,2007-09-30,00,2020,,2022-08-29T09:19:25,true,8,,,,LD,LES ROUSSEAU,09300,BENAIX,,,09051,,,,,,,,,,,,,,,,,,,2020-06-30,A,,,,,43.29A,NAFRev2,N,1.86347,42.909273,0.5,street,Barberousse Hameau 09300 Bénaix,09051_B003,G,BARBEROUSSE HAMEAU,
333504306,00015,33350430600015,O,,NN,,,,true,1,,,,,MATIBOT,09300,BENAIX,,,09051,,,,,,,,,,,,,,,,,,,1995-12-31,F,,,,,02.0B,NAF1993,N,1.832673,42.904639,0.91,street,Matibot Hameau 09300 Bénaix,09051_B046,G,MATIBOT HAMEAU,
334723616,00010,33472361600010,O,1986-01-01,NN,,,2009-01-18T05:49:13,true,3,,,,,,09300,BENAIX,,,09051,,,,,,,,,,,,,,,,,,,2001-09-01,F,,,,,01.2A,NAF1993,,,,0,,,,,,
337753198,00023,33775319800023,O,1996-03-12,NN,,7420ZQ,2015-03-17T00:23:17,true,3,,,,LD,BARBEROUSSE,09300,BENAIX,,,09051,,,,,,,,,,,,,,,,,,,2008-01-01,A,,,,,74.20Z,NAFRev2,N,1.86347,42.909273,0.92,street,Barberousse Hameau 09300 Bénaix,09051_B003,G,BARBEROUSSE HAMEAU,
337753198,00031,33775319800031,O,2010-06-01,,,,2021-02-23T10:54:30,false,1,,,,LD,BARBEROUSSE,09300,BENAIX,,,09051,,,,,,,,,,,,,,,,,,,2010-06-01,A,DOMAINE DE BARBEROUSSE,,,,01.13Z,NAFRev2,N,1.86347,42.909273,0.92,street,Barberousse Hameau 09300 Bénaix,09051_B003,G,BARBEROUSSE HAMEAU,
348455023,00013,34845502300013,O,1988-01-27,NN,,,2013-11-22T10:23:28,false,4,,,,,,09300,BENAIX,,,09051,,,,,,,,,,,,,,,,,,,2013-11-06,F,,,,,02.40Z,NAFRev2,N,,,0,,,,,,
351573936,00025,35157393600025,O,1991-12-01,NN,,,2016-09-22T04:52:28,true,4,,,,,LE JOULA,09300,BENAIX,,,09051,,,,,,,,,,,,,,,,,,,2016-06-30,F,,,,,86.90D,NAFRev2,N,1.853038,42.907327,0.64,street,Joula 09300 Bénaix,09051_6qguz8,G,JOULA,
351627377,00010,35162737700010,O,,NN,,,,true,1,,,,,L ECOLE,09300,BENAIX,,,09051,,,,,,,,,,,,,,,,,,,1993-03-15,F,,,,,02.0B,NAF1993,N,1.861974,42.906575,0.33,street,Place de l'Église 09300 Bénaix,09051_s7nvn3,G,PLACE DE L EGLISE,
353695737,00018,35369573700018,O,1990-02-20,NN,,,2014-03-04T19:36:06,true,4,,,,,MERIGOU,09300,BENAIX,,,09051,,,,,,,,,,,,,,,,,,,2014-02-20,F,,,,,01.45Z,NAFRev2,N,1.859274,42.908397,0.91,street,Merigou Hameau 09300 Bénaix,09051_B051,G,MERIGOU HAMEAU,
378474456,00019,37847445600019,O,,,,,,true,1,,,,,,09300,BENAIX,,,09051,,,,,,,,,,,,,,,,,,,1990-07-01,F,,,,,86.08,NAP,N,,,0,,,,,,
378610620,00023,37861062000023,O,,NN,,,,true,1,,,,,SERRELONGUE,09300,BENAIX,,,09051,,,,,,,,,,,,,,,,,,,1996-09-08,F,,,,,52.6D,NAF1993,N,1.84975,42.883662,0.93,street,Serrelongue 09300 Bénaix,09051_k2vijr,G,SERRELONGUE,
390615995,00011,39061599500011,O,,NN,,,,true,1,,,,,HAMEAU DE SERRELONGUE,09300,BENAIX,,,09051,,,,,,,,,,,,,,,,,,,1993-06-30,F,,,,,52.6E,NAF1993,N,1.849915,42.883648,0.94,street,Hameau de Serrelongue 09300 Bénaix,09051_c3zrer,G,HAMEAU DE SERRELONGUE,
402796338,00018,40279633800018,O,1980-01-01,NN,,,,true,1,,,,,LAJOURDANE,09300,BENAIX,,,09051,,,,,,,,,,,,,,,,,,,2000-09-30,F,,,,,01.2A,NAF1993,N,,,0,,,,,,
403166531,00018,40316653100018,O,1995-11-15,NN,,,2018-11-23T04:15:33,true,3,,,,,MAMEAU DES MOUREOUS,09300,BENAIX,,,09051,,,,,,,,,,,,,,,,,,,2008-01-01,A,,,,,68.20A,NAFRev2,N,1.841984,42.888206,0.6,street,Moureous Hameau 09300 Bénaix,09051_B055,G,MOUREOUS HAMEAU,
404981599,00016,40498159900016,O,,NN,,,,true,1,,,,,EPX CARBONNEAU G,09300,BENAIX,,,09051,,,,,,,,,,,,,,,,,,,1996-12-31,F,,,,,01.1A,NAF1993,N,,,0,,,,,,
404981607,00017,40498160700017,O,1965-01-01,NN,,,2006-10-28T03:25:42,true,3,,,,,,09300,BENAIX,,,09051,,,,,,,,,,,,,,,,,,,2004-06-30,F,,,,,01.1A,NAFRev1,N,,,0,,,,,,
404981615,00010,40498161500010,O,1980-06-10,NN,,,2016-01-12T00:17:11,true,3,LES ROUSSEAUX,,,,,09300,BENAIX,,,09051,,,,,,,,,,,,,,,,,,,2008-01-01,A,,,,,01.45Z,NAFRev2,N,1.877462,42.907444,0.44,street,Rousseou 09300 Bénaix,09051_j6a0va,D,ROUSSEOU,
404981623,00014,40498162300014,O,1984-04-01,NN,,,2021-02-23T11:29:17,true,5,,,,,LES ROUSSEAUX,09300,BENAIX,,,09051,,,,,,,,,,,,,,,,,,,2014-04-01,A,,,,,68.20B,NAFRev2,N,1.877462,42.907444,0.44,street,Rousseou 09300 Bénaix,09051_j6a0va,G,ROUSSEOU,
404981631,00017,40498163100017,O,1982-09-01,NN,,,,true,4,,,,,,09300,BENAIX,,,09051,,,,,,,,,,,,,,,,,,,2003-05-31,F,,,,,01.1A,NAFRev1,N,,,0,,,,,,
408204261,00015,40820426100015,O,1995-03-01,NN,,,2023-05-05T20:50:23,true,4,,,,,,09300,BENAIX,,,09051,,,,,,,,,,,,,,,,,,,2014-12-25,F,,,,,01.42Z,NAFRev2,N,,,0,,,,,,
417493129,00015,41749312900015,O,1997-07-15,NN,,,2008-01-04T23:05:07,true,3,CHEZ MR KERHINO,,,,,09300,BENAIX,,,09051,,,,,,,,,,,,,,,,,,,2008-01-01,A,,,,,90.01Z,NAFRev2,N,,,0,,,,,,
423474717,00018,42347471700018,O,1999-07-01,NN,,,2006-11-25T16:29:24,false,3,,,,,SERRELONGUE,09300,BENAIX,,,09051,,,,,,,,,,,,,,,,,,,2005-01-01,F,,,,,92.3A,NAFRev1,N,1.84975,42.883662,0.93,street,Serrelongue 09300 Bénaix,09051_k2vijr,G,SERRELONGUE,
439585969,00017,43958596900017,O,2001-10-17,NN,,,2008-11-08T02:08:31,false,3,,,,,SERRELONGUE,09300,BENAIX,,,09051,,,,,,,,,,,,,,,,,,,2003-12-16,F,CARIOCA,,,,26.1J,NAFRev1,N,1.84975,42.883662,0.93,street,Serrelongue 09300 Bénaix,09051_k2vijr,G,SERRELONGUE,
442046983,00031,44204698300031,O,2017-01-30,,,4334ZB,2022-04-13T19:33:22,true,2,,,,LD,LE BAYLE,09300,BENAIX,,,09051,,,,,,,,,,,,,,,,,,,2022-01-01,F,,,,,43.34Z,NAFRev2,N,1.871859,42.904566,0.9,street,Lieu Dit le Bayle 09300 Bénaix,09051_w5efzd,G,LIEU DIT LE BAYLE,
442497509,00020,44249750900020,O,2007-03-01,,,,2021-02-23T13:24:26,true,2,,,,HAM,DE SERRELONGUE,09300,BENAIX,,,09051,,,,,,,,,,,,,,,,,,,2008-01-01,A,,,,,93.29Z,NAFRev2,N,1.849915,42.883648,0.92,street,Hameau de Serrelongue 09300 Bénaix,09051_c3zrer,G,HAMEAU DE SERRELONGUE,
448258806,00018,44825880600018,P,2003-05-01,NN,,,2006-11-25T18:28:13,false,3,[ND],[ND],[ND],[ND],[ND],[ND],BENAIX,,[ND],09051,[ND],[ND],,,[ND],[ND],[ND],[ND],[ND],[ND],,,[ND],,[ND],[ND],,,2006-06-08,F,[ND],[ND],[ND],[ND],93.0N,NAFRev1,N,,,0,,,,,,
448258806,00026,44825880600026,P,2006-06-08,,,,2021-02-23T13:29:49,true,2,[ND],[ND],[ND],[ND],[ND],[ND],BENAIX,,[ND],09051,[ND],[ND],,,[ND],[ND],[ND],[ND],[ND],[ND],,,[ND],,[ND],[ND],,,2008-01-01,A,[ND],[ND],[ND],[ND],47.89Z,NAFRev2,N,,,0,,,,,,
450101985,00023,45010198500023,O,2008-12-01,NN,,,2021-02-23T13:32:42,true,1,,,,,BARBEROUSSE,09300,BENAIX,,,09051,,,,,,,,,,,,,,,,,,,2008-12-01,A,,,,,88.99B,NAFRev2,N,1.86347,42.909273,0.92,street,Barberousse Hameau 09300 Bénaix,09051_B003,G,BARBEROUSSE HAMEAU,
478123235,00010,47812323500010,O,2004-07-01,,,,2021-02-23T13:39:51,true,3,,,,HAM,MANDRAU,09300,BENAIX,,,09051,,,,,,,,,,,,,,,,,,,2008-01-01,A,,,,,01.42Z,NAFRev2,N,1.863714,42.907562,0.56,street,Mendrau Hameau 09300 Bénaix,09051_B047,G,MENDRAU HAMEAU,
480152909,00010,48015290900010,O,2004-12-18,NN,,,2008-01-05T21:44:21,true,3,,,,,LE VILLAGE,09300,BENAIX,,,09051,,,,,,,,,,,,,,,,,,,2008-01-01,A,,,,,68.20B,NAFRev2,N,1.859096,42.906991,0.66,street,Village de Bénaix 09300 Bénaix,09051_B087,G,VILLAGE DE BENAIX,
480249713,00086,48024971300086,P,2021-01-01,,,,2022-06-19T11:25:26,true,1,[ND],[ND],[ND],[ND],[ND],[ND],BENAIX,,[ND],09051,[ND],[ND],,,[ND],[ND],[ND],[ND],[ND],[ND],,,[ND],,[ND],[ND],,,2021-01-01,A,[ND],[ND],[ND],[ND],86.90E,NAFRev2,N,,,0,,,,,,
487444697,00329,48744469700329,O,2013-12-20,,,,2013-12-24T14:39:49,false,1,,,,LD,ROUSSEOU,09300,BENAIX,,,09051,,,,,,,,,,,,,,,,,,,2013-12-20,A,GEST ENVIRONNEMENT 39,,,,35.11Z,NAFRev2,N,1.877462,42.907444,0.94,street,Rousseou 09300 Bénaix,09051_j6a0va,G,ROUSSEOU,
487444697,00337,48744469700337,O,2013-12-20,,,,2013-12-24T14:41:05,false,1,,,,LD,ROUSSEOU,09300,BENAIX,,,09051,,,,,,,,,,,,,,,,,,,2013-12-20,A,GEST ENVIRONNEMENT 40,,,,35.11Z,NAFRev2,N,1.877462,42.907444,0.94,street,Rousseou 09300 Bénaix,09051_j6a0va,G,ROUSSEOU,
492305057,00019,49230505700019,O,2006-06-20,NN,,,2009-06-27T13:27:00,false,4,,,,LD,LES ROUSSEAU,09300,BENAIX,,,09051,,,,,,,,,,,,,,,,,,,2008-01-01,F,,,,,41.20A,NAFRev2,O,1.86347,42.909273,0.5,street,Barberousse Hameau 09300 Bénaix,09051_B003,G,BARBEROUSSE HAMEAU,
494053564,00014,49405356400014,P,2007-02-01,,,,2019-01-10T08:18:57,false,3,[ND],[ND],[ND],[ND],[ND],[ND],BENAIX,,[ND],09051,[ND],[ND],,,[ND],[ND],[ND],[ND],[ND],[ND],,,[ND],,[ND],[ND],,,2009-06-30,F,[ND],[ND],[ND],[ND],43.34Z,NAFRev2,N,,,0,,,,,,
499255982,00021,49925598200021,O,2008-02-29,NN,,,2014-07-10T00:54:59,false,5,,,,,LES ROUSSEAUX,09300,BENAIX,,,09051,,,,,,,,,,,,,,,,,,,2012-12-01,F,,,,,43.34Z,NAFRev2,O,1.877462,42.907444,0.44,street,Rousseou 09300 Bénaix,09051_j6a0va,G,ROUSSEOU,
502927858,00014,50292785800014,O,2008-03-01,,,,2014-01-29T03:22:16,true,2,CHEZ M. BERNARD DELATTRE,,,HAM,DE SERRELONGUE,09300,BENAIX,,,09051,,,,,,,,,,,,,,,,,,,2013-12-18,F,,,,,94.99Z,NAFRev2,N,1.849915,42.883648,0.92,street,Hameau de Serrelongue 09300 Bénaix,09051_c3zrer,G,HAMEAU DE SERRELONGUE,
505003467,00014,50500346700014,O,2008-08-01,,,5610CQ,2016-03-15T19:33:30,true,2,,,,,LA PRADE,09300,BENAIX,,,09051,,,,,,,,,,,,,,,,,,,2011-04-04,F,,,,,56.10C,NAFRev2,N,1.861488,42.906575,0.91,street,Lieu Dit la Prade 09300 Bénaix,09051_2umjae,G,LIEU DIT LA PRADE,
507504652,00029,50750465200029,O,2014-05-21,,,,2021-02-23T14:19:27,true,1,,,,,LA PRADE,09300,BENAIX,,,09051,,,,,,,,,,,,,,,,,,,2014-05-21,A,GRILLARD'INS,,,,56.10C,NAFRev2,N,1.861488,42.906575,0.91,street,Lieu Dit la Prade 09300 Bénaix,09051_2umjae,G,LIEU DIT LA PRADE,
518368352,00010,51836835200010,O,2009-11-21,,,,2013-01-09T19:41:02,true,1,,,,PL,DE L'EGLISE,09300,BENAIX,,,09051,,,,,,,,,,,,,,,,,,,2009-11-21,F,,,,,45.20A,NAFRev2,N,1.861974,42.906575,0.81,street,Place de l'Église 09300 Bénaix,09051_s7nvn3,G,PLACE DE L EGLISE,
750510802,00044,75051080200044,O,2018-01-01,,,,2021-03-30T09:31:50,false,2,JOULA LA GRANGE,,,,,09300,BENAIX,,,09051,,,,,,,,,,,,,,,,,,,2020-11-01,F,,,,,86.90D,NAFRev2,N,1.853038,42.907327,0.44,street,Joula 09300 Bénaix,09051_6qguz8,D,JOULA,
776648305,00014,77664830500014,O,1971-01-01,NN,,4332AA,2015-03-18T00:49:20,false,4,,,,LD,BARBEROUSSE,09300,BENAIX,,,09051,,,,,,,,,,,,,,,,,,,2001-09-14,F,,,,,45.4C,NAF1993,N,1.86347,42.909273,0.92,street,Barberousse Hameau 09300 Bénaix,09051_B003,G,BARBEROUSSE HAMEAU,
776688889,00034,77668888900034,O,1988-03-09,NN,,,2008-11-08T03:17:53,true,3,,,,,BIGOT,09300,BENAIX,,,09051,,,,,,,,,,,,,,,,,,,2006-03-31,F,,,,,45.4C,NAFRev1,O,1.845476,42.905277,0.92,street,Bigot Est 09300 Bénaix,09051_B009,G,BIGOT EST,
780062816,00019,78006281600019,O,,,,,,true,1,,,,,,09300,BENAIX,,,09051,,,,,,,,,,,,,,,,,,,2000-09-29,F,,,,,26.2A,NAF1993,N,,,0,,,,,,
791263916,00011,79126391600011,O,2013-02-19,,,,2015-11-27T14:39:21,true,2,,,,,PEYRIES,09300,BENAIX,,,09051,,,,,,,,,,,,,,,,,,,2015-12-01,F,,,,,90.03A,NAFRev2,N,1.84891,42.905886,0.56,street,Lieu Dit Perries 09300 Bénaix,09051_vpq4ig,G,LIEU DIT PERRIES,
797531910,00017,79753191000017,O,2013-10-01,,,,2019-01-29T14:11:01,true,2,RIOUBERNARD,,,HAM,LES MOUREOUS,09300,BENAIX,,,09051,,,,,,,,,,,,,,,,,,,2019-06-30,F,BOIS BALACH,,,,02.10Z,NAFRev2,N,1.841984,42.888206,0.63,street,Moureous Hameau 09300 Bénaix,09051_B055,G,MOUREOUS HAMEAU,
800774838,00018,80077483800018,O,2014-02-20,,,,2019-04-24T04:08:57,true,1,,,,LD,MERIGOU,09300,BENAIX,,,09051,,,,,,,,,,,,,,,,,,,2014-02-20,A,,,,,01.45Z,NAFRev2,N,1.859274,42.908397,0.91,street,Merigou Hameau 09300 Bénaix,09051_B051,G,MERIGOU HAMEAU,
801635822,00019,80163582200019,O,2014-04-01,NN,,,2017-03-21T03:45:55,true,1,,,,LD,LES ROUSSEAUX,09300,BENAIX,,,09051,,,,,,,,,,,,,,,,,,,2014-04-01,A,,,,,01.42Z,NAFRev2,O,1.877462,42.907444,0.44,street,Rousseou 09300 Bénaix,09051_j6a0va,G,ROUSSEOU,
801944059,00014,80194405900014,O,2014-01-01,,,,2015-08-20T19:28:33,true,2,MATIBOT,,,,,09300,BENAIX,,,09051,,,,,,,,,,,,,,,,,,,2014-12-31,F,,,,,01.45Z,NAFRev2,N,1.832673,42.904639,0.91,street,Matibot Hameau 09300 Bénaix,09051_B046,D,MATIBOT HAMEAU,
822481537,00022,82248153700022,O,2021-01-13,,,2332ZC,2021-02-23T17:42:19,true,1,,,,LD,BARBEROUSSE,09300,BENAIX,,,09051,,,,,,,,,,,,,,,,,,,2021-01-13,A,L'EMPOTE,,,L'EMPOTE,23.41Z,NAFRev2,N,1.86347,42.909273,0.92,street,Barberousse Hameau 09300 Bénaix,09051_B003,G,BARBEROUSSE HAMEAU,
824706634,00014,82470663400014,O,2017-01-01,,,,2020-12-21T16:40:31,false,2,,,,,BARBEROUSSE,09300,BENAIX,,,09051,,,,,,,,,,,,,,,,,,,2021-01-01,F,,,,ADEVAYA,47.91A,NAFRev2,N,1.86347,42.909273,0.92,street,Barberousse Hameau 09300 Bénaix,09051_B003,G,BARBEROUSSE HAMEAU,
830042552,00018,83004255200018,P,2017-06-01,,,,2019-05-01T04:14:19,true,4,[ND],[ND],[ND],[ND],[ND],[ND],BENAIX,,[ND],09051,[ND],[ND],,,[ND],[ND],[ND],[ND],[ND],[ND],,,[ND],,[ND],[ND],,,2019-03-01,F,[ND],[ND],[ND],[ND],96.04Z,NAFRev2,N,,,0,,,,,,
833157738,00018,83315773800018,O,2017-11-20,,,,2020-10-14T10:28:02,false,4,,,,,LA BIRADE,09300,BENAIX,,,09051,,,,,,,,,,,,,,,,,,,2020-09-28,F,,,,,86.90E,NAFRev2,N,1.861488,42.906575,0.55,street,Lieu Dit la Prade 09300 Bénaix,09051_2umjae,G,LIEU DIT LA PRADE,
838987154,00013,83898715400013,O,2018-05-01,,,1629ZA,2019-01-21T20:01:20,true,1,,,,,MORENCI,09300,BENAIX,,,09051,,,,,,,,,,,,,,,,,,,2018-05-01,A,L'ATELIER DU COIN,,,L'ATELIER DU COIN,16.29Z,NAFRev2,N,1.856859,42.890796,0.91,street,Lieu Dit Morenci 09300 Bénaix,09051_1piokw,G,LIEU DIT MORENCI,
839668605,00018,83966860500018,O,2018-05-27,,,,2018-11-30T04:16:07,true,2,,,,,JOULA LA GRANGE,09300,BENAIX,,,09051,,,,,,,,,,,,,,,,,,,2018-07-30,F,,,,,86.90D,NAFRev2,N,1.853038,42.907327,0.44,street,Joula 09300 Bénaix,09051_6qguz8,G,JOULA,
842974453,00016,84297445300016,O,2018-10-01,,,,2021-04-30T15:16:21,false,2,,,,,JOULA LA GRANGE,09300,BENAIX,,,09051,,,,,,,,,,,,,,,,,,,2021-01-01,F,,,,,86.90D,NAFRev2,N,1.853038,42.907327,0.44,street,Joula 09300 Bénaix,09051_6qguz8,G,JOULA,
848474706,00019,84847470600019,O,2019-01-28,,,,2019-02-20T14:36:36,true,1,,,,,SERRELONGUE,09300,BENAIX,,,09051,,,,,,,,,,,,,,,,,,,2019-01-28,A,,,,,85.51Z,NAFRev2,N,1.84975,42.883662,0.93,street,Serrelongue 09300 Bénaix,09051_k2vijr,G,SERRELONGUE,
879713162,00011,87971316200011,O,2019-12-10,,,1072ZZ,2019-12-11T19:33:19,true,1,CHEZ MME CLOTTES,,,PL,DE L'EGLISE,09300,BENAIX,,,09051,,,,,,,,,,,,,,,,,,,2019-12-10,A,,,,LE PLAISIR D'AVEYRON,10.72Z,NAFRev2,N,1.861974,42.906575,0.81,street,Place de l'Église 09300 Bénaix,09051_s7nvn3,G,PLACE DE L EGLISE,
888803137,00015,88880313700015,O,2020-09-09,,,,2021-02-09T09:33:09,true,1,,,,,LE BAYLE,09300,BENAIX,,,09051,,,,,,,,,,,,,,,,,,,2020-09-09,A,,,,,68.20B,NAFRev2,N,1.871859,42.904566,0.9,street,Lieu Dit le Bayle 09300 Bénaix,09051_w5efzd,G,LIEU DIT LE BAYLE,
894554583,00019,89455458300019,O,2021-02-01,,,,2021-02-26T10:58:48,true,1,,,,,HAMEAU DE SERRELONGUE,09300,BENAIX,,,09051,,,,,,,,,,,,,,,,,,,2021-02-01,A,,,,,85.60Z,NAFRev2,N,1.849915,42.883648,0.94,street,Hameau de Serrelongue 09300 Bénaix,09051_c3zrer,G,HAMEAU DE SERRELONGUE,
904865243,00011,90486524300011,O,2021-10-01,,,,2021-11-05T03:41:14,true,1,,,,,MERIGOU,09300,BENAIX,,,09051,,,,,,,,,,,,,,,,,,,2021-10-01,A,,,,,81.30Z,NAFRev2,N,1.859274,42.908397,0.91,street,Merigou Hameau 09300 Bénaix,09051_B051,G,MERIGOU HAMEAU,
909655714,00014,90965571400014,O,2022-02-01,,,2332ZA,2022-01-27T08:33:30,true,1,,,,LD,LE BAYLE,09300,BENAIX,,,09051,,,,,,,,,,,,,,,,,,,2022-02-01,A,,,,,74.90B,NAFRev2,N,1.871859,42.904566,0.9,street,Lieu Dit le Bayle 09300 Bénaix,09051_w5efzd,G,LIEU DIT LE BAYLE,
909844581,00027,90984458100027,O,2022-03-17,,,2420ZZ,2022-06-04T13:27:38,true,1,,,,LD,PEYTROUTIL,09300,BENAIX,,,09051,,,,,,,,,,,,,,,,,,,2022-03-17,A,,,,INES M,33.20A,NAFRev2,N,1.861895,42.903159,0.66,street,Lieu Dit Peyroutil 09300 Bénaix,09051_9eel2i,G,LIEU DIT PEYROUTIL,
910646249,00011,91064624900011,O,2022-03-01,,,,2022-02-24T03:37:41,true,1,,,,LD,LE BAYLE,09300,BENAIX,,,09051,,,,,,,,,,,,,,,,,,,2022-03-01,A,,,,,01.49Z,NAFRev2,N,1.871859,42.904566,0.9,street,Lieu Dit le Bayle 09300 Bénaix,09051_w5efzd,G,LIEU DIT LE BAYLE,
914966353,00015,91496635300015,O,2022-07-01,,,,2022-06-28T13:54:18,true,1,,,,HAM,DE SERRELONGUE,09300,BENAIX,,,09051,,,,,,,,,,,,,,,,,,,2022-07-01,A,,,,CT COMMUNITY MANAGEMENT,70.21Z,NAFRev2,N,1.849915,42.883648,0.92,street,Hameau de Serrelongue 09300 Bénaix,09051_c3zrer,G,HAMEAU DE SERRELONGUE,
922404769,00015,92240476900015,O,2022-12-13,,,,2022-12-22T03:48:56,true,1,,,,,,09300,BENAIX,,,09051,,,,,,,,,,,,,,,,,,,2022-12-13,A,,,,,02.10Z,NAFRev2,N,,,0,,,,,,
937072007,00019,93707200700019,O,,,,,,true,1,,,,,,09300,BENAIX,,,09051,,,,,,,,,,,,,,,,,,,1984-12-25,F,,,,,57.05,NAP,N,,,0,,,,,,
948074976,00010,94807497600010,P,2023-01-10,,,,2023-01-12T23:28:44,true,1,[ND],[ND],[ND],[ND],[ND],[ND],BENAIX,,[ND],09051,[ND],[ND],,,[ND],[ND],[ND],[ND],[ND],[ND],,,[ND],,[ND],[ND],,,2023-01-10,A,[ND],[ND],[ND],[ND],45.11Z,NAFRev2,N,,,0,,,,,,
952189264,00015,95218926400015,P,2023-09-01,,,,2023-05-05T06:10:37,true,1,[ND],[ND],[ND],[ND],[ND],[ND],BENAIX,,[ND],09051,[ND],[ND],,,[ND],[ND],[ND],[ND],[ND],[ND],,,[ND],,[ND],[ND],,,2023-09-01,A,[ND],[ND],[ND],[ND],96.09Z,NAFRev2,N,,,0,,,,,,
952830180,00016,95283018000016,O,2023-05-24,,,,2023-06-03T13:11:02,true,1,,,,,DARDENNE,09300,BENAIX,,,09051,,,,,,,,,,,,,,,,,,,2023-05-24,A,,,,,68.20B,NAFRev2,N,1.848192,42.905676,0.93,street,Dardenne 09300 Bénaix,09051_3dma5y,G,DARDENNE,
