siren,nic,siret,statutDiffusionEtablissement,dateCreationEtablissement,trancheEffectifsEtablissement,anneeEffectifsEtablissement,activitePrincipaleRegistreMetiersEtablissement,dateDernierTraitementEtablissement,etablissementSiege,nombrePeriodesEtablissement,complementAdresseEtablissement,numeroVoieEtablissement,indiceRepetitionEtablissement,typeVoieEtablissement,libelleVoieEtablissement,codePostalEtablissement,libelleCommuneEtablissement,libelleCommuneEtrangerEtablissement,distributionSpecialeEtablissement,codeCommuneEtablissement,codeCedexEtablissement,libelleCedexEtablissement,codePaysEtrangerEtablissement,libellePaysEtrangerEtablissement,complementAdresse2Etablissement,numeroVoie2Etablissement,indiceRepetition2Etablissement,typeVoie2Etablissement,libelleVoie2Etablissement,codePostal2Etablissement,libelleCommune2Etablissement,libelleCommuneEtranger2Etablissement,distributionSpeciale2Etablissement,codeCommune2Etablissement,codeCedex2Etablissement,libelleCedex2Etablissement,codePaysEtranger2Etablissement,libellePaysEtranger2Etablissement,dateDebut,etatAdministratifEtablissement,enseigne1Etablissement,enseigne2Etablissement,enseigne3Etablissement,denominationUsuelleEtablissement,activitePrincipaleEtablissement,nomenclatureActivitePrincipaleEtablissement,caractereEmployeurEtablissement,longitude,latitude,geo_score,geo_type,geo_adresse,geo_id,geo_ligne,geo_l4,geo_l5
200019404,00017,20001940400017,O,2009-01-01,,,,2009-03-18T11:42:45,true,1,MAIRIE,,,,LE BOURG,12210,CASSUEJOULS,,,12058,,,,,,,,,,,,,,,,,,,2009-01-01,A,,,,,84.11Z,NAFRev2,N,2.813398,44.732655,0.5,street,le Bosc 12210 Cassuéjouls,12058_02jtrq,G,LE BOSC,
211200589,00011,21120058900011,O,1983-03-01,01,2020,,2022-08-29T09:05:56,true,5,,,,,LE BOURG,12210,CASSUEJOULS,,,12058,,,,,,,,,,,,,,,,,,,2010-01-17,A,MAIRIE,,,,84.11Z,NAFRev2,O,2.813398,44.732655,0.5,street,le Bosc 12210 Cassuéjouls,12058_02jtrq,G,LE BOSC,
211200589,00029,21120058900029,O,1983-12-21,NN,,,,false,3,,,,,,12210,CASSUEJOULS,,,12058,,,,,,,,,,,,,,,,,,,2003-08-31,F,ECOLE PRIMAIRE PUBLIQUE,,,,80.1Z,NAFRev1,N,,,0,,,,,,
211200589,00037,21120058900037,O,1994-12-25,NN,,,2010-01-24T19:08:50,false,4,MAIRIE,,,,LE BOURG,12210,CASSUEJOULS,,,12058,,,,,,,,,,,,,,,,,,,2010-01-24,A,SERVICE D'EAU ET ASSAINISSEMENT,,,,36.00Z,NAFRev2,O,2.813398,44.732655,0.5,street,le Bosc 12210 Cassuéjouls,12058_02jtrq,G,LE BOSC,
261201784,00012,26120178400012,O,1984-10-01,NN,,,2016-07-23T12:06:45,true,5,MAIRIE,,,,LE BOURG,12210,CASSUEJOULS,,,12058,,,,,,,,,,,,,,,,,,,2016-01-01,F,,,,,88.99B,NAFRev2,N,2.813398,44.732655,0.5,street,le Bosc 12210 Cassuéjouls,12058_02jtrq,G,LE BOSC,
315740803,00012,31574080300012,O,,NN,,,,true,1,,,,,,12210,CASSUEJOULS,,,12058,,,,,,,,,,,,,,,,,,,1995-10-31,F,,,,,52.1B,NAF1993,N,,,0,,,,,,
316041227,00018,31604122700018,O,,NN,,,,true,1,,,,,,12210,CASSUEJOULS,,,12058,,,,,,,,,,,,,,,,,,,2003-02-22,F,,,,,57.02,NAP,N,,,0,,,,,,
316840172,00019,31684017200019,O,1968-01-01,01,2020,,2022-08-29T09:15:22,true,10,,,,,LA BANCALERIE,12210,CASSUEJOULS,,,12058,,,,,,,,,,,,,,,,,,,2013-07-29,A,,,,,46.23Z,NAFRev2,O,2.825622,44.721761,0.92,street,Route de la Bancalerie 12210 Cassuéjouls,12058_8y4ug9,G,ROUTE DE LA BANCALERIE,
316840172,00027,31684017200027,O,1967-01-01,NN,,,2011-05-16T11:16:06,false,3,,,,,BANCALLERIE CASSUE,12210,CASSUEJOULS,,,12058,,,,,,,,,,,,,,,,,,,2008-01-01,A,,,,,01.42Z,NAFRev2,N,2.825622,44.721761,0.78,street,Route de la Bancalerie 12210 Cassuéjouls,12058_8y4ug9,G,ROUTE DE LA BANCALERIE,
316840180,00012,31684018000012,O,,,,,,true,1,,,,,,12210,CASSUEJOULS,,,12058,,,,,,,,,,,,,,,,,,,1993-03-31,F,,,,,45.4C,NAF1993,N,,,0,,,,,,
317140424,00019,31714042400019,O,,NN,,,,true,1,,,,,,12210,CASSUEJOULS,,,12058,,,,,,,,,,,,,,,,,,,1987-12-25,F,,,,,67.08,NAP,N,,,0,,,,,,
317728087,00022,31772808700022,O,,NN,,,,true,1,,,,,,12210,CASSUEJOULS,,,12058,,,,,,,,,,,,,,,,,,,1989-03-31,F,,,,,55.60,NAP,N,,,0,,,,,,
330032210,00016,33003221000016,O,1984-05-20,NN,,,2008-01-04T19:55:32,true,3,,,,,MAIRIE,12210,CASSUEJOULS,,,12058,,,,,,,,,,,,,,,,,,,2008-01-01,A,,,,,01.61Z,NAFRev2,N,2.785534,44.71374,0.5,street,Route des Prairies 12210 Cassuéjouls,12058_yw14ep,G,ROUTE DES PRAIRIES,
351482617,00047,35148261700047,O,2022-06-07,,,,2023-01-02T17:33:28,true,1,,4,,IMP,DU FOUR,12210,CASSUEJOULS,,,12058,,,,,,,,,,,,,,,,,,,2022-06-07,A,,,,,68.20B,NAFRev2,N,2.817566,44.72558,0.8,housenumber,4 Impasse du Four 12210 Cassuéjouls,12058_myf0lb_00004,G,4 IMPASSE DU FOUR,
351944467,00015,35194446700015,O,1989-10-02,NN,,,2008-01-04T23:36:43,true,5,,,,,,12210,CASSUEJOULS,,,12058,,,,,,,,,,,,,,,,,,,2008-01-01,A,,,,,01.42Z,NAFRev2,N,,,0,,,,,,
353483696,00012,35348369600012,O,1990-02-05,NN,,4332AA,2015-03-18T01:04:30,true,6,,,,,,12210,CASSUEJOULS,,,12058,,,,,,,,,,,,,,,,,,,2011-04-12,F,,,,,43.32A,NAFRev2,N,,,0,,,,,,
381759588,00019,38175958800019,O,1991-04-15,NN,,,2013-12-03T04:20:24,true,4,,,,,SOULAGES,12210,CASSUEJOULS,,,12058,,,,,,,,,,,,,,,,,,,2013-12-31,F,,,,,01.61Z,NAFRev2,N,2.826669,44.734016,0.92,street,Hameau Soulages 12210 Cassuéjouls,12058_06ps10,G,HAMEAU SOULAGES,
390551364,00024,39055136400024,O,1993-01-01,NN,,,2008-01-04T23:41:30,false,3,,,,,SOULAGES,12210,CASSUEJOULS,,,12058,,,,,,,,,,,,,,,,,,,2008-01-01,A,,,,,68.20B,NAFRev2,N,2.826669,44.734016,0.92,street,Hameau Soulages 12210 Cassuéjouls,12058_06ps10,G,HAMEAU SOULAGES,
390551539,00021,39055153900021,O,1993-01-01,NN,,,2017-10-09T10:05:06,false,4,,,,,SOULAGES,12210,CASSUEJOULS,,,12058,,,,,,,,,,,,,,,,,,,2018-03-26,F,,,,,01.42Z,NAFRev2,N,2.826669,44.734016,0.92,street,Hameau Soulages 12210 Cassuéjouls,12058_06ps10,G,HAMEAU SOULAGES,
390964799,00014,39096479900014,O,1993-03-01,NN,,,2009-04-21T07:39:44,true,4,,,,,CLAPIERES,12210,CASSUEJOULS,,,12058,,,,,,,,,,,,,,,,,,,2008-12-31,F,,,,,01.42Z,NAFRev2,N,2.829611,44.727388,0.91,street,Lieu Dit Clapieres 12210 Cassuéjouls,12058_tx8bk9,G,LIEU DIT CLAPIERES,
390987485,00013,39098748500013,O,1993-04-10,00,2020,,2022-08-29T09:15:22,true,4,,,,,,12210,CASSUEJOULS,,,12058,,,,,,,,,,,,,,,,,,,2008-01-01,A,,,,,56.10A,NAFRev2,O,,,0,,,,,,
391145364,00025,39114536400025,O,2006-01-01,,,,2019-09-25T10:06:16,false,3,,,,,SOULAGES,12210,CASSUEJOULS,,,12058,,,,,,,,,,,,,,,,,,,2019-03-31,F,,,,,01.19Z,NAFRev2,N,2.826669,44.734016,0.92,street,Hameau Soulages 12210 Cassuéjouls,12058_06ps10,G,HAMEAU SOULAGES,
398699371,00017,39869937100017,O,1989-07-24,NN,,,2011-05-02T14:44:33,true,4,,,,LD,LA BARTHE,12210,CASSUEJOULS,,,12058,,,,,,,,,,,,,,,,,,,2008-01-01,A,,,,,01.42Z,NAFRev2,N,2.794647,44.719893,0.91,street,Lieu Dit la Barthe 12210 Cassuéjouls,12058_238st0,G,LIEU DIT LA BARTHE,
398699371,00025,39869937100025,O,2007-04-01,,,,2021-02-23T11:22:29,false,2,,,,LD,LA BARTHE,12210,CASSUEJOULS,,,12058,,,,,,,,,,,,,,,,,,,2008-01-01,A,,,,,01.61Z,NAFRev2,N,2.794647,44.719893,0.91,street,Lieu Dit la Barthe 12210 Cassuéjouls,12058_238st0,G,LIEU DIT LA BARTHE,
398805937,00024,39880593700024,O,2017-08-16,,,,2018-07-17T10:23:04,true,1,,,,,CASSUEJOULS,12210,CASSUEJOULS,,,12058,,,,,,,,,,,,,,,,,,,2017-08-16,A,,,,,68.20B,NAFRev2,N,2.817385,44.72553,0.93,street,Cassuéjouls,12058_lj32qr,G,CASSUEJOULS,
399903962,00013,39990396200013,O,1991-01-01,NN,,,2012-02-22T09:59:56,true,4,,,,,SOULAGES,12210,CASSUEJOULS,,,12058,,,,,,,,,,,,,,,,,,,2011-12-31,F,,,,,01.42Z,NAFRev2,N,2.826669,44.734016,0.92,street,Hameau Soulages 12210 Cassuéjouls,12058_06ps10,G,HAMEAU SOULAGES,
399904416,00019,39990441600019,O,1990-01-01,NN,,,2015-02-16T09:26:10,true,2,,,,,GALDUN,12210,CASSUEJOULS,,,12058,,,,,,,,,,,,,,,,,,,1999-01-14,F,,,,,,,,2.785377,44.706727,0.91,street,Lieu Dit Galdun 12210 Cassuéjouls,12058_8yz86u,G,LIEU DIT GALDUN,
399905223,00018,39990522300018,O,1985-12-01,NN,,,2014-01-21T03:13:35,true,4,,,,,ROUSTAN,12210,CASSUEJOULS,,,12058,,,,,,,,,,,,,,,,,,,2013-12-31,F,,,,,01.42Z,NAFRev2,N,2.802231,44.724101,0.81,street,Roustans 12210 Cassuéjouls,12058_payw3b,G,ROUSTANS,
400414876,00013,40041487600013,P,1995-04-03,NN,,,2008-11-08T01:08:59,false,4,[ND],[ND],[ND],[ND],[ND],[ND],CASSUEJOULS,,[ND],12058,[ND],[ND],,,[ND],[ND],[ND],[ND],[ND],[ND],,,[ND],,[ND],[ND],,,2003-10-01,F,[ND],[ND],[ND],[ND],45.2V,NAFRev1,N,,,0,,,,,,
402836035,00012,40283603500012,O,1980-03-01,NN,,,2020-12-10T11:45:02,true,4,,,,,,12210,CASSUEJOULS,,,12058,,,,,,,,,,,,,,,,,,,2020-12-31,F,,,,,01.42Z,NAFRev2,N,,,0,,,,,,
403268816,00010,40326881600010,O,1985-01-01,NN,,,2021-02-23T11:27:29,true,4,,,,,MANDY HAUT,12210,CASSUEJOULS,,,12058,,,,,,,,,,,,,,,,,,,2015-11-01,A,,,,,68.20B,NAFRev2,N,2.791049,44.715637,0.91,street,Lieu Dit Mandy Haut 12210 Cassuéjouls,12058_B246,G,LIEU DIT MANDY HAUT,
403268923,00014,40326892300014,O,,,,,,true,1,,,,,SOULAGES,12210,CASSUEJOULS,,,12058,,,,,,,,,,,,,,,,,,,1997-01-31,F,,,,,01.2A,NAF1993,N,2.826669,44.734016,0.92,street,Hameau Soulages 12210 Cassuéjouls,12058_06ps10,G,HAMEAU SOULAGES,
403314776,00010,40331477600010,O,1995-12-19,NN,,,2008-01-04T20:20:23,true,4,,,,,LA BARTHE,12210,CASSUEJOULS,,,12058,,,,,,,,,,,,,,,,,,,2008-01-01,A,,,,,01.42Z,NAFRev2,N,2.794647,44.719893,0.91,street,Lieu Dit la Barthe 12210 Cassuéjouls,12058_238st0,G,LIEU DIT LA BARTHE,
403323819,00017,40332381900017,O,1989-10-01,NN,,,2019-02-26T04:02:56,true,4,,,,,,12210,CASSUEJOULS,,,12058,,,,,,,,,,,,,,,,,,,2018-12-31,F,,,,,01.42Z,NAFRev2,N,,,0,,,,,,
403323983,00011,40332398300011,O,1983-02-01,NN,,,2007-04-23T13:12:19,true,3,,,,,,12210,CASSUEJOULS,,,12058,,,,,,,,,,,,,,,,,,,2007-02-28,F,,,,,01.2A,NAFRev1,N,,,0,,,,,,
403337231,00019,40333723100019,O,1994-07-15,NN,,,2008-08-25T03:43:32,true,3,,,,,,12210,CASSUEJOULS,,,12058,,,,,,,,,,,,,,,,,,,2003-06-12,F,,,,,70.2C,NAFRev1,N,,,0,,,,,,
403958192,00011,40395819200011,O,,NN,,,,true,1,,,,,A ANGLARES,12210,CASSUEJOULS,,,12058,,,,,,,,,,,,,,,,,,,1997-11-30,F,,,,,01.3Z,NAF1993,N,2.785819,44.714468,0.78,street,Anglares 12210 Cassuéjouls,12058_fqstks,G,ANGLARES,
403958200,00012,40395820000012,O,1969-01-01,NN,,,,true,1,,,,,GALBRUN,12210,CASSUEJOULS,,,12058,,,,,,,,,,,,,,,,,,,2000-12-31,F,,,,,01.2A,NAF1993,N,2.785377,44.706727,0.44,street,Lieu Dit Galdun 12210 Cassuéjouls,12058_8yz86u,G,LIEU DIT GALDUN,
403958218,00014,40395821800014,O,1971-01-01,NN,,,2006-12-14T05:56:23,true,3,,,,,MANDY BAS CASSUEL,12210,CASSUEJOULS,,,12058,,,,,,,,,,,,,,,,,,,2006-12-31,F,,,,,01.3Z,NAFRev1,N,2.789177,44.71617,0.82,street,Lieu Dit Mandy Bas 12210 Cassuéjouls,12058_B245,G,LIEU DIT MANDY BAS,
403958226,00017,40395822600017,O,1981-03-20,NN,,,2008-01-04T20:32:04,true,3,,,,,LA BARTHE,12210,CASSUEJOULS,,,12058,,,,,,,,,,,,,,,,,,,2008-01-01,A,,,,,01.42Z,NAFRev2,N,2.794647,44.719893,0.91,street,Lieu Dit la Barthe 12210 Cassuéjouls,12058_238st0,G,LIEU DIT LA BARTHE,
403958234,00011,40395823400011,O,1973-07-15,NN,,,2006-10-28T03:18:25,true,3,,,,,SOULAGES CASSUEJOUL,12210,CASSUEJOULS,,,12058,,,,,,,,,,,,,,,,,,,2005-08-11,F,,,,,01.3Z,NAFRev1,N,2.826669,44.734016,0.88,street,Hameau Soulages 12210 Cassuéjouls,12058_06ps10,G,HAMEAU SOULAGES,
403958242,00014,40395824200014,O,,NN,,,,true,1,,,,,,12210,CASSUEJOULS,,,12058,,,,,,,,,,,,,,,,,,,1997-03-31,F,,,,,01.3Z,NAF1993,N,,,0,,,,,,
403958259,00018,40395825900018,O,1990-03-20,NN,,,2006-10-28T03:18:25,true,3,,,,,LA BARTHE,12210,CASSUEJOULS,,,12058,,,,,,,,,,,,,,,,,,,2005-01-31,F,,,,,01.3Z,NAFRev1,N,2.794647,44.719893,0.91,street,Lieu Dit la Barthe 12210 Cassuéjouls,12058_238st0,G,LIEU DIT LA BARTHE,
407963685,00018,40796368500018,O,1961-01-01,NN,,,2017-01-23T09:33:29,true,4,,,,,SOULAGES CASSUEJOUS,12210,CASSUEJOULS,,,12058,,,,,,,,,,,,,,,,,,,2016-12-31,F,,,,,01.42Z,NAFRev2,N,2.826669,44.734016,0.84,street,Hameau Soulages 12210 Cassuéjouls,12058_06ps10,G,HAMEAU SOULAGES,
407963693,00012,40796369300012,O,1988-12-13,NN,,,2013-11-03T03:28:35,true,4,,,,,SOULAGES,12210,CASSUEJOULS,,,12058,,,,,,,,,,,,,,,,,,,2013-09-30,F,,,,,01.42Z,NAFRev2,N,2.826669,44.734016,0.92,street,Hameau Soulages 12210 Cassuéjouls,12058_06ps10,G,HAMEAU SOULAGES,
407963701,00013,40796370100013,O,1992-08-01,NN,,,2008-01-04T21:02:15,true,3,,,,,,12210,CASSUEJOULS,,,12058,,,,,,,,,,,,,,,,,,,2008-01-01,A,,,,,78.30Z,NAFRev2,N,,,0,,,,,,
407976067,00022,40797606700022,O,2001-01-01,NN,,,2016-06-20T09:44:01,true,3,,,,,GALDUN,12210,CASSUEJOULS,,,12058,,,,,,,,,,,,,,,,,,,2008-01-01,A,,,,,01.42Z,NAFRev2,N,2.785377,44.706727,0.91,street,Lieu Dit Galdun 12210 Cassuéjouls,12058_8yz86u,G,LIEU DIT GALDUN,
407996982,00010,40799698200010,O,1989-09-01,NN,,,2009-01-14T07:52:34,true,4,,,,,ANGLARES,12210,CASSUEJOULS,,,12058,,,,,,,,,,,,,,,,,,,2009-01-01,F,,,,,01.43Z,NAFRev2,N,2.785819,44.714468,0.93,street,Anglares 12210 Cassuéjouls,12058_fqstks,G,ANGLARES,
411265077,00015,41126507700015,O,1997-02-01,NN,,,2019-05-21T03:38:36,true,4,,,,,SOULAGES,12210,CASSUEJOULS,,,12058,,,,,,,,,,,,,,,,,,,2018-12-31,F,,,,,68.20B,NAFRev2,N,2.826669,44.734016,0.92,street,Hameau Soulages 12210 Cassuéjouls,12058_06ps10,G,HAMEAU SOULAGES,
412523862,00016,41252386200016,O,1997-02-01,NN,,,2018-05-24T14:33:52,true,3,,,,,SOULAGES,12210,CASSUEJOULS,,,12058,,,,,,,,,,,,,,,,,,,2008-01-01,A,,,,,01.41Z,NAFRev2,N,2.826669,44.734016,0.92,street,Hameau Soulages 12210 Cassuéjouls,12058_06ps10,G,HAMEAU SOULAGES,
412531519,00020,41253151900020,O,2009-01-01,,,,2009-05-12T05:04:41,true,2,,,,,ANGLARES,12210,CASSUEJOULS,,,12058,,,,,,,,,,,,,,,,,,,2009-05-01,F,,,,,01.42Z,NAFRev2,N,2.785819,44.714468,0.93,street,Anglares 12210 Cassuéjouls,12058_fqstks,G,ANGLARES,
414152108,00018,41415210800018,O,1997-12-01,NN,,,2023-07-03T20:41:45,true,4,,,,,ANGLARES,12210,CASSUEJOULS,,,12058,,,,,,,,,,,,,,,,,,,2018-12-25,F,,,,,01.42Z,NAFRev2,N,2.785819,44.714468,0.93,street,Anglares 12210 Cassuéjouls,12058_fqstks,G,ANGLARES,
420120248,00026,42012024800026,O,2008-06-01,NN,,,2014-07-08T01:54:57,false,3,,,,,LE BOURG,12210,CASSUEJOULS,,,12058,,,,,,,,,,,,,,,,,,,2010-08-01,F,,,,,43.99D,NAFRev2,N,2.813398,44.732655,0.5,street,le Bosc 12210 Cassuéjouls,12058_02jtrq,G,LE BOSC,
422781252,00016,42278125200016,O,1999-01-15,NN,,,2017-05-04T01:40:47,true,4,,,,,GALDUN,12210,CASSUEJOULS,,,12058,,,,,,,,,,,,,,,,,,,2014-12-31,A,,,,,01.42Z,NAFRev2,O,2.785377,44.706727,0.91,street,Lieu Dit Galdun 12210 Cassuéjouls,12058_8yz86u,G,LIEU DIT GALDUN,
431512524,00015,43151252400015,O,1980-09-01,NN,,,,true,3,,,,,SOULAGES,12210,CASSUEJOULS,,,12058,,,,,,,,,,,,,,,,,,,2003-06-30,F,,,,,60.2E,NAFRev1,N,2.826669,44.734016,0.92,street,Hameau Soulages 12210 Cassuéjouls,12058_06ps10,G,HAMEAU SOULAGES,
434075909,00011,43407590900011,O,2001-01-03,NN,,4399CZ,2019-06-17T14:44:09,true,4,,,,,ECOLE,12210,CASSUEJOULS,,,12058,,,,,,,,,,,,,,,,,,,2019-05-28,A,,,,,71.12B,NAFRev2,N,2.0519618,48.8989297,0.9,poi.school,(École) Chambourcy,https://osm.org/relation/2351076,G,,
441430857,00017,44143085700017,O,2002-01-01,NN,,,2008-01-04T21:19:35,true,3,,,,,LES VIGNES,12210,CASSUEJOULS,,,12058,,,,,,,,,,,,,,,,,,,2008-01-01,A,,,,,01.42Z,NAFRev2,N,2.788738,44.722238,0.45,street,Lieu Dit les Vernhettes 12210 Cassuéjouls,12058_mg84z2,G,LIEU DIT LES VERNHETTES,
449719996,00018,44971999600018,O,2003-08-28,NN,,3240ZZ,2018-10-08T20:42:22,true,4,,,,LD,SOULAGES,12210,CASSUEJOULS,,,12058,,,,,,,,,,,,,,,,,,,2017-08-25,A,,,,,32.40Z,NAFRev2,N,2.826669,44.734016,0.92,street,Hameau Soulages 12210 Cassuéjouls,12058_06ps10,G,HAMEAU SOULAGES,
449719996,00026,44971999600026,O,2018-10-01,,,,2019-04-30T11:05:38,false,2,,,,,SOULAGES,12210,CASSUEJOULS,,,12058,,,,,,,,,,,,,,,,,,,2019-04-30,F,,,,,01.11Z,NAFRev2,N,2.826669,44.734016,0.92,street,Hameau Soulages 12210 Cassuéjouls,12058_06ps10,G,HAMEAU SOULAGES,
450574678,00014,45057467800014,O,2003-10-01,11,2020,1623ZZ,2023-07-02T20:28:16,true,3,,4511,,RTE,D'HUPARLAC,12210,CASSUEJOULS,,,12058,,,,,,,,,,,,,,,,,,,2008-01-01,A,,,,,16.23Z,NAFRev2,O,2.789705,44.726251,0.84,housenumber,4511 Route d’Huparlac 12210 Cassuéjouls,12058_ly6c5u_04511,G,4511 ROUTE D HUPARLAC,
481253169,00017,48125316900017,O,2005-02-01,NN,,,2015-05-14T06:39:20,true,3,,,,,LA BARTHE,12210,CASSUEJOULS,,,12058,,,,,,,,,,,,,,,,,,,2014-11-25,F,,,,,01.42Z,NAFRev2,N,2.794647,44.719893,0.91,street,Lieu Dit la Barthe 12210 Cassuéjouls,12058_238st0,G,LIEU DIT LA BARTHE,
481348548,00019,48134854800019,O,2005-01-01,,,,2008-01-05T00:26:40,true,2,,,,LD,ANGLARES,12210,CASSUEJOULS,,,12058,,,,,,,,,,,,,,,,,,,2008-01-01,A,,,,,01.42Z,NAFRev2,N,2.785819,44.714468,0.93,street,Anglares 12210 Cassuéjouls,12058_fqstks,G,ANGLARES,
482748449,00022,48274844900022,O,2005-02-01,NN,,,2007-05-22T01:16:20,false,1,,,,,LA BARTHE,12210,CASSUEJOULS,,,12058,,,,,,,,,,,,,,,,,,,2005-02-01,F,,,,,51.2E,NAFRev1,N,2.794647,44.719893,0.91,street,Lieu Dit la Barthe 12210 Cassuéjouls,12058_238st0,G,LIEU DIT LA BARTHE,
493262562,00017,49326256200017,O,2007-01-01,,,,2019-07-20T03:55:17,true,3,MANDY BAS,,,,,12210,CASSUEJOULS,,,12058,,,,,,,,,,,,,,,,,,,2019-07-01,A,,,,,68.20B,NAFRev2,N,2.789177,44.71617,0.91,street,Lieu Dit Mandy Bas 12210 Cassuéjouls,12058_B245,D,LIEU DIT MANDY BAS,
495095465,00029,49509546500029,O,2023-05-22,,,,2023-06-13T14:15:34,true,1,,4,,IMP,DU FOUR,12210,CASSUEJOULS,,,12058,,,,,,,,,,,,,,,,,,,2023-05-22,A,,,,,68.20B,NAFRev2,N,2.817566,44.72558,0.8,housenumber,4 Impasse du Four 12210 Cassuéjouls,12058_myf0lb_00004,G,4 IMPASSE DU FOUR,
497616961,00015,49761696100015,O,2007-03-01,01,2020,,2022-08-29T09:29:14,true,3,,,,,,12210,CASSUEJOULS,,,12058,,,,,,,,,,,,,,,,,,,2016-03-27,A,,,,,01.42Z,NAFRev2,O,,,0,,,,,,
499501732,00014,49950173200014,O,2007-06-29,NN,,,2019-03-22T04:29:34,true,4,,,,LD,LE BOSC,12210,CASSUEJOULS,,,12058,,,,,,,,,,,,,,,,,,,2008-01-01,A,,,,,68.20B,NAFRev2,N,2.813398,44.732655,0.93,street,le Bosc 12210 Cassuéjouls,12058_02jtrq,G,LE BOSC,
503660649,00016,50366064900016,O,2008-04-01,,,,2008-09-15T13:38:11,false,2,,,,,LE BOURG,12210,CASSUEJOULS,,,12058,,,,,,,,,,,,,,,,,,,2008-09-01,F,,,,,71.20B,NAFRev2,N,2.813398,44.732655,0.5,street,le Bosc 12210 Cassuéjouls,12058_02jtrq,G,LE BOSC,
504227091,00015,50422709100015,O,2008-01-01,01,2020,,2022-08-29T09:07:58,true,1,,,,,MAIRIE,12210,CASSUEJOULS,,,12058,,,,,,,,,,,,,,,,,,,2008-01-01,A,,,,,78.30Z,NAFRev2,N,2.785534,44.71374,0.5,street,Route des Prairies 12210 Cassuéjouls,12058_yw14ep,G,ROUTE DES PRAIRIES,
510758071,00144,51075807100144,O,2009-07-08,,,,2009-07-21T06:03:56,false,1,,,,LD,SOULAGES,12210,CASSUEJOULS,,,12058,,,,,,,,,,,,,,,,,,,2009-07-08,A,,,,,35.11Z,NAFRev2,N,2.826669,44.734016,0.92,street,Hameau Soulages 12210 Cassuéjouls,12058_06ps10,G,HAMEAU SOULAGES,
511832396,00028,51183239600028,O,2011-09-30,,,,2021-02-23T15:20:37,true,1,SOULAGES,,,,,12210,CASSUEJOULS,,,12058,,,,,,,,,,,,,,,,,,,2011-09-30,A,,,,,01.42Z,NAFRev2,N,2.826669,44.734016,0.92,street,Hameau Soulages 12210 Cassuéjouls,12058_06ps10,D,HAMEAU SOULAGES,
511922999,00012,51192299900012,O,2009-01-01,,,,2009-04-21T07:39:44,true,1,,,,,CLAPIERES,12210,CASSUEJOULS,,,12058,,,,,,,,,,,,,,,,,,,2009-01-01,A,,,,,01.42Z,NAFRev2,N,2.829611,44.727388,0.91,street,Lieu Dit Clapieres 12210 Cassuéjouls,12058_tx8bk9,G,LIEU DIT CLAPIERES,
512214206,00017,51221420600017,O,2009-05-01,02,2020,,2022-08-29T09:15:51,true,1,,,,,ANGLARES,12210,CASSUEJOULS,,,12058,,,,,,,,,,,,,,,,,,,2009-05-01,A,,,,,01.42Z,NAFRev2,N,2.785819,44.714468,0.93,street,Anglares 12210 Cassuéjouls,12058_fqstks,G,ANGLARES,
514499334,00035,51449933400035,O,2017-01-01,,,,2017-01-23T09:42:38,true,1,,,,,SOULAGES,12210,CASSUEJOULS,,,12058,,,,,,,,,,,,,,,,,,,2017-01-01,A,,,,,01.42Z,NAFRev2,N,2.826669,44.734016,0.92,street,Hameau Soulages 12210 Cassuéjouls,12058_06ps10,G,HAMEAU SOULAGES,
522360197,00019,52236019700019,O,2010-04-01,,,,2018-07-24T16:35:27,true,1,,,,,LA VAYSSE,12210,CASSUEJOULS,,,12058,,,,,,,,,,,,,,,,,,,2010-04-01,A,,,,,68.20B,NAFRev2,N,2.817539,44.725436,0.46,street,Impasse de la Source 12210 Cassuéjouls,12058_2cjl84,G,IMPASSE DE LA SOURCE,
522360197,00035,52236019700035,O,2017-08-16,,,,2018-07-24T16:32:52,false,1,,,,,CASSUEJOULS,12210,CASSUEJOULS,,,12058,,,,,,,,,,,,,,,,,,,2017-08-16,F,,,,,68.20B,NAFRev2,N,2.817385,44.72553,0.93,street,Cassuéjouls,12058_lj32qr,G,CASSUEJOULS,
530146992,00017,53014699200017,O,2010-12-21,,,,2014-09-04T04:19:18,true,2,,,,,ANGLARES,12210,CASSUEJOULS,,,12058,,,,,,,,,,,,,,,,,,,2014-08-28,F,,,,,68.20B,NAFRev2,N,2.785819,44.714468,0.93,street,Anglares 12210 Cassuéjouls,12058_fqstks,G,ANGLARES,
533083812,00016,53308381200016,O,2010-11-01,,,,2011-06-21T10:35:49,true,1,CHEZ M NAYROLLES BERTRAND,,,LD,GALDUN,12210,CASSUEJOULS,,,12058,,,,,,,,,,,,,,,,,,,2010-11-01,A,,,,,78.30Z,NAFRev2,N,2.785377,44.706727,0.91,street,Lieu Dit Galdun 12210 Cassuéjouls,12058_8yz86u,G,LIEU DIT GALDUN,
538352501,00018,53835250100018,O,2011-10-01,,,,2021-06-18T03:46:08,true,2,SOULAGES,,,,,12210,CASSUEJOULS,,,12058,,,,,,,,,,,,,,,,,,,2020-12-31,F,,,,,68.20A,NAFRev2,N,2.826669,44.734016,0.92,street,Hameau Soulages 12210 Cassuéjouls,12058_06ps10,D,HAMEAU SOULAGES,
750312456,00015,75031245600015,O,2012-03-01,,,,2021-02-23T16:05:01,true,1,,,,,LE BOURG,12210,CASSUEJOULS,,,12058,,,,,,,,,,,,,,,,,,,2012-03-01,A,,,,,43.21A,NAFRev2,N,2.813398,44.732655,0.5,street,le Bosc 12210 Cassuéjouls,12058_02jtrq,G,LE BOSC,
753299783,00013,75329978300013,O,2006-08-01,,,,2012-08-14T08:20:50,true,1,LE BOURG,,,,,12210,CASSUEJOULS,,,12058,,,,,,,,,,,,,,,,,,,2006-08-01,A,,,,,55.20Z,NAFRev2,N,2.813398,44.732655,0.5,street,le Bosc 12210 Cassuéjouls,12058_02jtrq,D,LE BOSC,
776699183,00013,77669918300013,O,,,,,,true,1,,,,,,12210,CASSUEJOULS,,,12058,,,,,,,,,,,,,,,,,,,1993-03-31,F,,,,,45.4C,NAF1993,N,,,0,,,,,,
776699225,00012,77669922500012,O,,NN,,,,true,1,,,,,,12210,CASSUEJOULS,,,12058,,,,,,,,,,,,,,,,,,,,F,,,,,97.22,NAP,N,,,0,,,,,,
798245924,00013,79824592400013,O,2013-10-01,,,,2021-01-22T03:33:36,true,2,,,,,SOULAGES,12210,CASSUEJOULS,,,12058,,,,,,,,,,,,,,,,,,,2020-12-17,F,,,,,01.42Z,NAFRev2,N,2.826669,44.734016,0.92,street,Hameau Soulages 12210 Cassuéjouls,12058_06ps10,G,HAMEAU SOULAGES,
799056627,00018,79905662700018,O,2013-12-01,00,2020,,2022-08-29T09:54:30,true,2,,,,,SOULAGES,12210,CASSUEJOULS,,,12058,,,,,,,,,,,,,,,,,,,2021-03-01,A,,,,,68.20B,NAFRev2,N,2.826669,44.734016,0.92,street,Hameau Soulages 12210 Cassuéjouls,12058_06ps10,G,HAMEAU SOULAGES,
799769997,00013,79976999700013,O,2014-01-01,,,,2014-01-27T09:43:03,true,1,,,,,ROUSTAN,12210,CASSUEJOULS,,,12058,,,,,,,,,,,,,,,,,,,2014-01-01,A,,,,,01.42Z,NAFRev2,N,2.802231,44.724101,0.81,street,Roustans 12210 Cassuéjouls,12058_payw3b,G,ROUSTANS,
800078040,00014,80007804000014,O,2014-01-01,,,,2014-02-02T04:00:54,true,1,,,,,LA BARTHE,12210,CASSUEJOULS,,,12058,,,,,,,,,,,,,,,,,,,2014-01-01,A,,,,,01.42Z,NAFRev2,N,2.794647,44.719893,0.91,street,Lieu Dit la Barthe 12210 Cassuéjouls,12058_238st0,G,LIEU DIT LA BARTHE,
802443689,00012,80244368900012,O,2011-04-15,,,,2014-05-22T13:47:33,true,1,MAIRIE,,,,,12210,CASSUEJOULS,,,12058,,,,,,,,,,,,,,,,,,,2011-04-15,A,,,,,94.99Z,NAFRev2,N,2.785534,44.71374,0.5,street,Route des Prairies 12210 Cassuéjouls,12058_yw14ep,D,ROUTE DES PRAIRIES,
815127469,00014,81512746900014,O,2015-11-01,,,,2016-01-29T05:14:32,true,1,,,,,MANDY HAUT,12210,CASSUEJOULS,,,12058,,,,,,,,,,,,,,,,,,,2015-11-01,A,,,,,01.42Z,NAFRev2,N,2.791049,44.715637,0.91,street,Lieu Dit Mandy Haut 12210 Cassuéjouls,12058_B246,G,LIEU DIT MANDY HAUT,
817794688,00017,81779468800017,O,2016-01-01,,,,2018-12-27T08:58:17,false,2,,,,,GALDUN,12210,CASSUEJOULS,,,12058,,,,,,,,,,,,,,,,,,,2018-09-30,F,,,,,01.29Z,NAFRev2,N,2.785377,44.706727,0.91,street,Lieu Dit Galdun 12210 Cassuéjouls,12058_8yz86u,G,LIEU DIT GALDUN,
819802182,00017,81980218200017,O,2016-04-01,,,,2016-04-20T08:58:42,true,1,,,,RTE,D'HUPARLAC,12210,CASSUEJOULS,,,12058,,,,,,,,,,,,,,,,,,,2016-04-01,A,,,,,68.20B,NAFRev2,N,2.789705,44.726251,0.81,street,Route d’Huparlac 12210 Cassuéjouls,12058_ly6c5u,G,ROUTE D HUPARLAC,
834274144,00015,83427414400015,O,2017-12-01,,,,2021-04-03T11:48:59,true,2,,,,,SOULAGES,12210,CASSUEJOULS,,,12058,,,,,,,,,,,,,,,,,,,2021-03-01,A,,,,,68.20B,NAFRev2,N,2.826669,44.734016,0.92,street,Hameau Soulages 12210 Cassuéjouls,12058_06ps10,G,HAMEAU SOULAGES,
848570636,00011,84857063600011,O,2019-01-01,,,,2021-11-19T03:46:02,true,1,,,,,LE BOURG,12210,CASSUEJOULS,,,12058,,,,,,,,,,,,,,,,,,,2019-01-01,A,,,,,01.42Z,NAFRev2,N,2.813398,44.732655,0.5,street,le Bosc 12210 Cassuéjouls,12058_02jtrq,G,LE BOSC,