siren,nic,siret,statutDiffusionEtablissement,dateCreationEtablissement,trancheEffectifsEtablissement,anneeEffectifsEtablissement,activitePrincipaleRegistreMetiersEtablissement,dateDernierTraitementEtablissement,etablissementSiege,nombrePeriodesEtablissement,complementAdresseEtablissement,numeroVoieEtablissement,indiceRepetitionEtablissement,typeVoieEtablissement,libelleVoieEtablissement,codePostalEtablissement,libelleCommuneEtablissement,libelleCommuneEtrangerEtablissement,distributionSpecialeEtablissement,codeCommuneEtablissement,codeCedexEtablissement,libelleCedexEtablissement,codePaysEtrangerEtablissement,libellePaysEtrangerEtablissement,complementAdresse2Etablissement,numeroVoie2Etablissement,indiceRepetition2Etablissement,typeVoie2Etablissement,libelleVoie2Etablissement,codePostal2Etablissement,libelleCommune2Etablissement,libelleCommuneEtranger2Etablissement,distributionSpeciale2Etablissement,codeCommune2Etablissement,codeCedex2Etablissement,libelleCedex2Etablissement,codePaysEtranger2Etablissement,libellePaysEtranger2Etablissement,dateDebut,etatAdministratifEtablissement,enseigne1Etablissement,enseigne2Etablissement,enseigne3Etablissement,denominationUsuelleEtablissement,activitePrincipaleEtablissement,nomenclatureActivitePrincipaleEtablissement,caractereEmployeurEtablissement,longitude,latitude,geo_score,geo_type,geo_adresse,geo_id,geo_ligne,geo_l4,geo_l5
212104277,00018,21210427700018,O,1983-03-01,01,2020,,2022-08-29T09:06:17,true,4,,,,RUE,DESSUS DE LA VELLE,21360,MONTCEAU-ET-ECHARNANT,,,21427,,,,,,,,,,,,,,,,,,,2008-01-01,A,MAIRIE,,,,84.11Z,NAFRev2,O,,,0,,,,,,
262105513,00010,26210551300010,O,1986-01-01,NN,,,2019-11-14T14:00:23,true,4,MAIRIE,,,RUE,DESSUS DE LA VELLE,21360,MONTCEAU-ET-ECHARNANT,,,21427,,,,,,,,,,,,,,,,,,,2017-12-31,F,CCAS,,,,88.99B,NAFRev2,N,,,0,,,,,,
292101649,00013,29210164900013,O,1985-06-24,NN,,,2019-11-14T14:00:23,true,3,MAIRIE,,,RUE,DESSUS DE LA VELLE,21360,MONTCEAU-ET-ECHARNANT,,,21427,,,,,,,,,,,,,,,,,,,2008-01-01,A,,,,,42.99Z,NAFRev2,N,,,0,,,,,,
302241955,00012,30224195500012,O,1900-01-01,NN,,,2019-11-14T14:00:23,true,4,,,,,,21360,MONTCEAU-ET-ECHARNANT,,BP 250,21427,,,,,,,,,,,,,,,,,,,1994-12-25,F,,,,,51.1N,NAF1993,O,,,0,,,,,,
304144595,00010,30414459500010,O,,,,,2019-11-14T14:00:23,true,1,,,,,,21360,MONTCEAU-ET-ECHARNANT,,,21427,,,,,,,,,,,,,,,,,,,1985-12-25,F,,,,,67.01,NAP,N,,,0,,,,,,
314707704,00016,31470770400016,O,,NN,,,2019-11-14T14:00:23,true,1,,,,,,21360,MONTCEAU-ET-ECHARNANT,,,21427,,,,,,,,,,,,,,,,,,,,F,,,,,62.46,NAP,N,,,0,,,,,,
317433662,00028,31743366200028,O,1994-11-02,NN,,,2019-11-14T14:00:23,true,4,,,,RUE,DU SAULT,21360,MONTCEAU-ET-ECHARNANT,,,21427,,,,,,,,,,,,,,,,,,,2014-09-30,F,,,,,46.18Z,NAFRev2,N,4.65468,47.060852,0.5,locality,Rue du Gué d'Amont 21360 Montceau-et-Écharnant,21427_0083,G,RUE DU GUE D AMONT,
320464720,00012,32046472000012,O,,NN,,,2019-11-14T14:00:23,true,1,,,,,GRANDMONT,21360,MONTCEAU-ET-ECHARNANT,,,21427,,,,,,,,,,,,,,,,,,,,F,,,,,57.05,NAP,N,4.651885,47.068853,0.91,locality,Ham de Grandmont 21360 Montceau-et-Écharnant,21427_0080,G,HAM DE GRANDMONT,
324459106,00013,32445910600013,O,,,,,2019-11-14T14:00:23,true,1,,,,,,21360,MONTCEAU-ET-ECHARNANT,,,21427,,,,,,,,,,,,,,,,,,,1984-12-25,F,,,,,01.07,NAP,N,,,0,,,,,,
324459114,00017,32445911400017,O,1982-04-01,NN,,,2019-11-14T14:00:23,true,5,,,,,,21360,MONTCEAU-ET-ECHARNANT,,,21427,,,,,,,,,,,,,,,,,,,2017-10-31,F,,,,,68.20B,NAFRev2,N,,,0,,,,,,
324952142,00028,32495214200028,O,1993-08-31,NN,,,2019-11-14T14:00:23,true,1,,,,,FERME DU CHEVAL ROI,21360,MONTCEAU-ET-ECHARNANT,,,21427,,,,,,,,,,,,,,,,,,,2001-12-31,F,,,,,01.2C,NAF1993,N,,,0,,,,,,
327378659,00012,32737865900012,O,1983-01-01,NN,,,2021-02-23T10:49:00,true,3,,,,LD,GRANDMONT,21360,MONTCEAU-ET-ECHARNANT,,,21427,,,,,,,,,,,,,,,,,,,2008-01-01,A,,,,,01.50Z,NAFRev2,N,4.651885,47.068853,0.91,locality,Ham de Grandmont 21360 Montceau-et-Écharnant,21427_0080,G,HAM DE GRANDMONT,
330469040,00019,33046904000019,O,,NN,,,2019-11-14T14:00:23,true,1,,,,LD,GRANDMONT,21360,MONTCEAU-ET-ECHARNANT,,,21427,,,,,,,,,,,,,,,,,,,,F,,,,,55.60,NAP,N,4.651885,47.068853,0.91,locality,Ham de Grandmont 21360 Montceau-et-Écharnant,21427_0080,G,HAM DE GRANDMONT,
332486752,00014,33248675200014,O,1985-04-24,NN,,4399CZ,2021-02-23T10:52:14,true,8,,,,,,21360,MONTCEAU-ET-ECHARNANT,,,21427,,,,,,,,,,,,,,,,,,,2015-01-01,A,,,,,81.30Z,NAFRev2,N,,,0,,,,,,
334644754,00031,33464475400031,O,2005-07-01,,,,2019-11-14T14:00:23,false,3,,,,RUE,DU GUE,21360,MONTCEAU-ET-ECHARNANT,,,21427,,,,,,,,,,,,,,,,,,,2008-05-19,F,,,,,13.92Z,NAFRev2,N,4.65468,47.060852,0.91,locality,Rue du Gué d'Amont 21360 Montceau-et-Écharnant,21427_0083,G,RUE DU GUE D AMONT,
335036869,00014,33503686900014,O,,NN,,,2019-11-14T14:00:23,true,1,,,,RUE,MOINGEON,21360,MONTCEAU-ET-ECHARNANT,,,21427,,,,,,,,,,,,,,,,,,,1988-06-27,F,,,,,67.08,NAP,N,4.65468,47.060852,0.37,locality,Rue du Gué d'Amont 21360 Montceau-et-Écharnant,21427_0083,G,RUE DU GUE D AMONT,
345397681,00015,34539768100015,O,1988-05-20,NN,,,2019-11-14T14:00:23,true,1,,,,RUE,MOINGEON,21360,MONTCEAU-ET-ECHARNANT,,,21427,,,,,,,,,,,,,,,,,,,2000-09-30,F,,,,,55.1A,NAF1993,N,4.65468,47.060852,0.37,locality,Rue du Gué d'Amont 21360 Montceau-et-Écharnant,21427_0083,G,RUE DU GUE D AMONT,
350585592,00024,35058559200024,O,2002-02-01,NN,,,2019-11-14T14:00:23,false,2,,,,RUE,MOINGEON,21360,MONTCEAU-ET-ECHARNANT,,,21427,,,,,,,,,,,,,,,,,,,2002-10-09,F,,,,,,,,4.65468,47.060852,0.37,locality,Rue du Gué d'Amont 21360 Montceau-et-Écharnant,21427_0083,G,RUE DU GUE D AMONT,
380000125,00019,38000012500019,O,1990-08-15,NN,,,2019-11-14T14:00:23,true,5,,,,,FERME EQUESTRE DU CHEVAL ROI,21360,MONTCEAU-ET-ECHARNANT,,,21427,,,,,,,,,,,,,,,,,,,2018-04-01,F,,,,,01.19Z,NAFRev2,N,,,0,,,,,,
394113724,00014,39411372400014,O,1989-09-01,NN,,,2019-11-14T14:00:23,true,4,,,,,,21360,MONTCEAU-ET-ECHARNANT,,,21427,,,,,,,,,,,,,,,,,,,2014-12-31,F,,,,,01.50Z,NAFRev2,N,,,0,,,,,,
398259234,00027,39825923400027,O,2005-05-24,,,,2019-11-14T14:00:23,true,2,,,,,GRANDMONT,21360,MONTCEAU-ET-ECHARNANT,,,21427,,,,,,,,,,,,,,,,,,,2006-11-30,F,,,,,01.4B,NAFRev1,N,4.651885,47.068853,0.91,locality,Ham de Grandmont 21360 Montceau-et-Écharnant,21427_0080,G,HAM DE GRANDMONT,
403281231,00049,40328123100049,O,2022-06-09,,,,2022-07-27T04:15:17,false,1,,,,,RUE DU DESSUS DE LA VELLE,21360,MONTCEAU-ET-ECHARNANT,,,21427,,,,,,,,,,,,,,,,,,,2022-06-09,A,,,,,68.20A,NAFRev2,N,,,0,,,,,,
405060674,00018,40506067400018,O,1982-12-31,NN,,,2019-11-14T14:00:23,true,3,GRANDMONT,,,,,21360,MONTCEAU-ET-ECHARNANT,,,21427,,,,,,,,,,,,,,,,,,,2005-12-30,F,,,,,01.1A,NAFRev1,N,4.651885,47.068853,0.91,locality,Ham de Grandmont 21360 Montceau-et-Écharnant,21427_0080,D,HAM DE GRANDMONT,
410238133,00012,41023813300012,O,1996-11-01,NN,,,2019-11-14T14:00:23,false,4,,,,,,21360,MONTCEAU-ET-ECHARNANT,,,21427,,,,,,,,,,,,,,,,,,,2011-11-01,F,,,,,01.11Z,NAFRev2,N,,,0,,,,,,
420287336,00010,42028733600010,O,1998-10-01,NN,,,2019-11-14T14:00:23,false,4,,7,,RUE,DU DESSUS DE LA VELLE,21360,MONTCEAU-ET-ECHARNANT,,,21427,,,,,,,,,,,,,,,,,,,2001-10-01,F,,,,,51.1T,NAF1993,N,,,0,,,,,,
433084118,00010,43308411800010,O,2000-10-23,NN,,4776ZP,2019-11-14T14:00:23,true,3,,,,RUE,DESSOUS DE LA VELLE,21360,MONTCEAU-ET-ECHARNANT,,,21427,,,,,,,,,,,,,,,,,,,2008-01-01,A,,,,,81.30Z,NAFRev2,N,4.7603638,47.0368787,0.74,poi.river,Ruisseau de dessous la Velle (Rivière) Nantoux,https://osm.org/way/34319375,G,,
434907077,00011,43490707700011,P,2001-07-03,NN,,,2019-11-14T14:00:23,false,4,[ND],[ND],[ND],[ND],[ND],[ND],MONTCEAU-ET-ECHARNANT,,[ND],21427,[ND],[ND],,,[ND],[ND],[ND],[ND],[ND],[ND],,,[ND],,[ND],[ND],,,2005-03-29,F,[ND],[ND],[ND],[ND],92.3A,NAFRev1,O,,,0,,,,,,
434907077,00029,43490707700029,P,2017-11-15,,,,2021-02-23T13:16:56,true,1,[ND],[ND],[ND],[ND],[ND],[ND],MONTCEAU-ET-ECHARNANT,,[ND],21427,[ND],[ND],,,[ND],[ND],[ND],[ND],[ND],[ND],,,[ND],,[ND],[ND],,,2017-11-15,A,[ND],[ND],[ND],[ND],46.19B,NAFRev2,N,,,0,,,,,,
438753923,00046,43875392300046,O,2018-01-01,,,,2019-11-14T14:00:23,true,1,,,,RUE,DES CURTIL,21360,MONTCEAU-ET-ECHARNANT,,,21427,,,,,,,,,,,,,,,,,,,2018-01-01,A,,,,,46.73A,NAFRev2,N,4.65468,47.060852,0.33,locality,Rue du Gué d'Amont 21360 Montceau-et-Écharnant,21427_0083,G,RUE DU GUE D AMONT,
442190989,00016,44219098900016,O,2002-05-15,NN,,,2023-06-09T08:49:52,false,3,,,,RUE,DU SAULT,21360,MONTCEAU-ET-ECHARNANT,,,21427,,,,,,,,,,,,,,,,,,,2004-02-29,F,,,,,51.1R,NAFRev1,N,4.65468,47.060852,0.5,locality,Rue du Gué d'Amont 21360 Montceau-et-Écharnant,21427_0083,G,RUE DU GUE D AMONT,
451318505,00018,45131850500018,O,2003-10-01,NN,,,2019-11-14T14:00:23,true,3,,,,,,21360,MONTCEAU-ET-ECHARNANT,,,21427,,,,,,,,,,,,,,,,,,,2008-01-01,A,,,,,01.11Z,NAFRev2,N,,,0,,,,,,
451456255,00038,45145625500038,P,2020-02-01,,,,2021-02-23T13:34:50,true,1,[ND],[ND],[ND],[ND],[ND],[ND],MONTCEAU-ET-ECHARNANT,,[ND],21427,[ND],[ND],,,[ND],[ND],[ND],[ND],[ND],[ND],,,[ND],,[ND],[ND],,,2020-02-01,A,[ND],[ND],[ND],[ND],47.89Z,NAFRev2,N,,,0,,,,,,
453199986,00010,45319998600010,O,2004-03-01,NN,,,2019-11-14T14:00:23,false,4,,,,RUE,DE SAULT,21360,MONTCEAU-ET-ECHARNANT,,,21427,,,,,,,,,,,,,,,,,,,2008-03-01,F,,,,,46.17B,NAFRev2,O,4.65468,47.060852,0.37,locality,Rue du Gué d'Amont 21360 Montceau-et-Écharnant,21427_0083,G,RUE DU GUE D AMONT,
453199986,00028,45319998600028,O,2008-03-01,NN,,,2019-11-14T14:00:23,false,2,,,,LD,DE GRANDMONT,21360,MONTCEAU-ET-ECHARNANT,,,21427,,,,,,,,,,,,,,,,,,,2015-10-01,F,,,,,46.17B,NAFRev2,O,4.651885,47.068853,0.92,locality,Ham de Grandmont 21360 Montceau-et-Écharnant,21427_0080,G,HAM DE GRANDMONT,
480204486,00017,48020448600017,O,2005-01-01,,,,2019-11-14T14:00:23,true,3,,,,HAM,GRANDMONT,21360,MONTCEAU-ET-ECHARNANT,,,21427,,,,,,,,,,,,,,,,,,,2011-09-30,F,,,,,01.11Z,NAFRev2,N,4.651885,47.068853,0.91,locality,Ham de Grandmont 21360 Montceau-et-Écharnant,21427_0080,G,HAM DE GRANDMONT,
481902815,00010,48190281500010,O,2005-01-01,,,,2019-11-14T14:00:23,true,2,,,,PL,DU PUITS NEUF,21360,MONTCEAU-ET-ECHARNANT,,,21427,,,,,,,,,,,,,,,,,,,2008-01-01,A,,,,,68.20B,NAFRev2,N,,,0,,,,,,
482325206,00019,48232520600019,O,2005-03-14,NN,,,2019-11-14T14:00:23,false,1,LES ALLUETS,,,,,21360,MONTCEAU-ET-ECHARNANT,,,21427,,,,,,,,,,,,,,,,,,,2005-03-14,F,,,,,92.3A,NAFRev1,N,,,0,,,,,,
482325206,00035,48232520600035,O,2005-07-01,,,,2019-11-14T14:00:23,false,2,LES ALLUETS,,,,,21360,MONTCEAU-ET-ECHARNANT,,,21427,,,,,,,,,,,,,,,,,,,2005-12-31,F,,,,,92.3A,NAFRev1,N,,,0,,,,,,
482767449,00036,48276744900036,O,2008-05-01,,,9511ZZ,2019-11-14T14:00:23,true,2,,,,RUE,MOINGEON,21360,MONTCEAU-ET-ECHARNANT,,,21427,,,,,,,,,,,,,,,,,,,2014-12-31,F,,,,,95.11Z,NAFRev2,N,4.65468,47.060852,0.37,locality,Rue du Gué d'Amont 21360 Montceau-et-Écharnant,21427_0083,G,RUE DU GUE D AMONT,
487595415,00018,48759541500018,O,2006-01-01,,,,2019-11-14T14:00:23,true,3,GRANDMONT,,,,,21360,MONTCEAU-ET-ECHARNANT,,,21427,,,,,,,,,,,,,,,,,,,2011-09-30,F,,,,,01.11Z,NAFRev2,N,4.651885,47.068853,0.91,locality,Ham de Grandmont 21360 Montceau-et-Écharnant,21427_0080,D,HAM DE GRANDMONT,
488371659,00019,48837165900019,O,2005-11-05,01,2020,,2022-08-29T09:20:22,true,3,,,,RUE,DU CREUX BOUILLOT,21360,MONTCEAU-ET-ECHARNANT,,,21427,,,,,,,,,,,,,,,,,,,2010-06-15,A,,,,,55.20Z,NAFRev2,O,,,0,,,,,,
488529876,00028,48852987600028,O,2006-04-01,NN,,,2019-11-14T14:00:23,true,2,,,,,GRANDMONT,21360,MONTCEAU-ET-ECHARNANT,,,21427,,,,,,,,,,,,,,,,,,,2007-05-04,F,,,,,20.3Z,NAFRev1,O,4.651885,47.068853,0.91,locality,Ham de Grandmont 21360 Montceau-et-Écharnant,21427_0080,G,HAM DE GRANDMONT,
488983339,00018,48898333900018,O,2006-01-01,00,2020,,2022-08-29T09:21:04,true,3,,,,,MAIRIE,21360,MONTCEAU-ET-ECHARNANT,,,21427,,,,,,,,,,,,,,,,,,,2011-11-13,A,,,,,94.99Z,NAFRev2,O,3.0709671,50.6304695,0.92,poi.townhall,Hôtel de Ville Lille,https://osm.org/way/40917078,G,,
492012406,00038,49201240600038,O,2012-01-01,,,,2021-02-23T13:58:40,true,1,,,,,LES ALLUETS,21360,MONTCEAU-ET-ECHARNANT,,,21427,,,,,,,,,,,,,,,,,,,2012-01-01,A,,,,CHRISTOPHE DUCHESNE,02.40Z,NAFRev2,N,1.9176607,48.9135266,0.89,poi.bar,(Bar) Les Alluets-le-Roi,https://osm.org/node/1905675336,G,,
494303746,00023,49430374600023,O,2007-04-11,,,,2019-11-14T14:00:23,false,2,,,,LD,LA CHAUME,21360,MONTCEAU-ET-ECHARNANT,,,21427,,,,,,,,,,,,,,,,,,,2008-01-01,A,,,,,35.11Z,NAFRev2,N,4.657267,47.050416,0.9,locality,La Chaume Saint Vincent 21360 Montceau-et-Écharnant,21427_B065,G,LA CHAUME SAINT VINCENT,
497990036,00038,49799003600038,O,2016-03-01,,,,2020-11-16T10:25:15,true,1,,,,,CREUX BOUILLOT,21360,MONTCEAU-ET-ECHARNANT,,,21427,,,,,,,,,,,,,,,,,,,2016-03-01,A,,,,,01.43Z,NAFRev2,N,,,0,,,,,,
497990036,00046,49799003600046,O,2016-05-01,,,,2021-02-23T14:05:35,false,3,,,,RUE,DU CREUX BOUILLOT,21360,MONTCEAU-ET-ECHARNANT,,,21427,,,,,,,,,,,,,,,,,,,2020-11-13,A,,,,LA PIERRE LEVEE,23.70Z,NAFRev2,N,,,0,,,,,,
499160422,00014,49916042200014,O,2007-07-19,,,,2019-11-14T14:00:23,false,4,,,,PL,PUITS NEUF,21360,MONTCEAU-ET-ECHARNANT,,,21427,,,,,,,,,,,,,,,,,,,2011-01-20,F,,,,,68.31Z,NAFRev2,N,,,0,,,,,,
499160422,00022,49916042200022,O,2009-01-13,,,,2019-11-14T14:00:23,true,3,,,,,PUITS NEUF,21360,MONTCEAU-ET-ECHARNANT,,,21427,,,,,,,,,,,,,,,,,,,2011-01-20,F,,,,,46.19B,NAFRev2,N,5.4298193,43.6647182,0.89,poi.shelter,Le Puits Neuf (Abri) Le Puy-Sainte-Réparade,https://osm.org/node/4687272743,G,,
499401859,00024,49940185900024,O,2011-07-01,,,,2021-02-23T14:07:57,true,1,HAMEAU DE GRANDMONT,,,RUE,DU CHATEAU,21360,MONTCEAU-ET-ECHARNANT,,,21427,,,,,,,,,,,,,,,,,,,2011-07-01,A,DOMAINE LEPRINCE FREDERIC MAISON,,,,46.34Z,NAFRev2,N,4.65146,47.071388,0.93,street,Rue du Chateau 21360 Montceau-et-Écharnant,21427_0030,G,RUE DU CHATEAU,
500360110,00018,50036011000018,O,2007-10-15,,,,2019-11-14T14:00:23,false,5,,,,RUE,DU BAS DE LA VELLE,21360,MONTCEAU-ET-ECHARNANT,,,21427,,,,,,,,,,,,,,,,,,,2013-09-20,F,,,,EXP'AIR 21,71.12B,NAFRev2,O,4.664007,47.057764,0.36,locality,Au Bas du Sot 21360 Montceau-et-Écharnant,21427_B026,G,AU BAS DU SOT,
502998388,00016,50299838800016,O,2008-03-12,,,,2022-09-16T04:08:13,true,2,,,,RUE,MOINGEON,21360,MONTCEAU-ET-ECHARNANT,,,21427,,,,,,,,,,,,,,,,,,,2022-08-01,F,,,,,47.91A,NAFRev2,N,4.65468,47.060852,0.37,locality,Rue du Gué d'Amont 21360 Montceau-et-Écharnant,21427_0083,G,RUE DU GUE D AMONT,
503560559,00018,50356055900018,O,2004-01-01,,,,2019-11-14T14:00:23,false,2,,,,RUE,BAS DE LA VELLE,21360,MONTCEAU-ET-ECHARNANT,,,21427,,,,,,,,,,,,,,,,,,,2017-10-05,F,,,,,01.21Z,NAFRev2,N,4.657875,47.061855,0.39,locality,Le Pertuis de la Clef 21360 Montceau-et-Écharnant,21427_B203,G,LE PERTUIS DE LA CLEF,
503908261,00012,50390826100012,O,2008-05-01,,,2341ZZ,2021-02-09T03:37:46,true,2,,,,HAM,DE GRANDMONT,21360,MONTCEAU-ET-ECHARNANT,,,21427,,,,,,,,,,,,,,,,,,,2020-10-31,F,,,,,23.41Z,NAFRev2,N,4.651885,47.068853,0.92,locality,Ham de Grandmont 21360 Montceau-et-Écharnant,21427_0080,G,HAM DE GRANDMONT,
503925968,00011,50392596800011,P,2008-05-01,,,,2022-09-12T09:40:56,true,3,[ND],[ND],[ND],[ND],[ND],[ND],MONTCEAU-ET-ECHARNANT,,[ND],21427,[ND],[ND],,,[ND],[ND],[ND],[ND],[ND],[ND],,,[ND],,[ND],[ND],,,2022-08-25,A,[ND],[ND],[ND],[ND],68.31Z,NAFRev2,N,,,0,,,,,,
509995387,00016,50999538700016,O,2009-01-02,,,,2019-11-14T14:00:23,true,2,,,,RUE,DU BAS DE LA VELLE,21360,MONTCEAU-ET-ECHARNANT,,,21427,,,,,,,,,,,,,,,,,,,2013-07-12,F,,,,,71.12B,NAFRev2,N,4.664007,47.057764,0.36,locality,Au Bas du Sot 21360 Montceau-et-Écharnant,21427_B026,G,AU BAS DU SOT,
511462756,00012,51146275600012,O,2009-04-01,,,,2019-11-14T14:00:23,true,1,,,,,LE LARREY,21360,MONTCEAU-ET-ECHARNANT,,,21427,,,,,,,,,,,,,,,,,,,2009-04-01,A,,,,,79.90Z,NAFRev2,N,4.66409,47.06105,0.46,locality,Le Crot de la Cros 21360 Montceau-et-Écharnant,21427_B275,G,LE CROT DE LA CROS,
511675191,00015,51167519100015,P,2009-04-06,,,,2020-06-25T04:04:10,false,2,[ND],[ND],[ND],[ND],[ND],[ND],MONTCEAU-ET-ECHARNANT,,[ND],21427,[ND],[ND],,,[ND],[ND],[ND],[ND],[ND],[ND],,,[ND],,[ND],[ND],,,2011-03-31,F,[ND],[ND],[ND],[ND],46.18Z,NAFRev2,N,,,0,,,,,,
511675191,00023,51167519100023,P,2019-06-01,,,,2021-08-30T11:09:24,true,1,[ND],[ND],[ND],[ND],[ND],[ND],MONTCEAU-ET-ECHARNANT,,[ND],21427,[ND],[ND],,,[ND],[ND],[ND],[ND],[ND],[ND],,,[ND],,[ND],[ND],,,2019-06-01,A,[ND],[ND],[ND],[ND],68.20A,NAFRev2,N,,,0,,,,,,
515410934,00019,51541093400019,O,,NN,,,2019-11-14T14:00:23,true,1,,,,,,21360,MONTCEAU-ET-ECHARNANT,,,21427,,,,,,,,,,,,,,,,,,,1992-12-31,F,,,,,52.1B,NAF1993,N,,,0,,,,,,
516011491,00011,51601149100011,O,1960-01-01,NN,,,2019-11-14T14:00:23,true,1,,,,,,21360,MONTCEAU-ET-ECHARNANT,,,21427,,,,,,,,,,,,,,,,,,,2000-02-26,F,,,,,55.4B,NAF1993,N,,,0,,,,,,
516310786,00012,51631078600012,O,,,,,2019-11-14T14:00:23,true,1,,,,,,21360,MONTCEAU-ET-ECHARNANT,,,21427,,,,,,,,,,,,,,,,,,,1984-12-25,F,,,,,67.01,NAP,N,,,0,,,,,,
517110268,00011,51711026800011,O,,NN,,,2019-11-14T14:00:23,true,1,,,,,,21360,MONTCEAU-ET-ECHARNANT,,,21427,,,,,,,,,,,,,,,,,,,,F,,,,,56.02,NAP,N,,,0,,,,,,
517111043,00033,51711104300033,O,1993-01-01,NN,,,2019-11-14T14:00:23,true,4,,,,,,21360,MONTCEAU-ET-ECHARNANT,,,21427,,,,,,,,,,,,,,,,,,,2010-08-31,F,,,,,46.17B,NAFRev2,N,,,0,,,,,,
517993879,00017,51799387900017,O,2009-11-11,,,,2019-11-14T14:00:23,true,1,,,,RUE,DU GUE,21360,MONTCEAU-ET-ECHARNANT,,,21427,,,,,,,,,,,,,,,,,,,2009-11-11,A,,,,,56.10C,NAFRev2,N,4.65468,47.060852,0.91,locality,Rue du Gué d'Amont 21360 Montceau-et-Écharnant,21427_0083,G,RUE DU GUE D AMONT,
519136717,00021,51913671700021,O,2011-07-01,,,,2019-11-14T14:00:23,true,2,HAMEAU DU GRANDMONT,,,RUE,DU CHATEAU,21360,MONTCEAU-ET-ECHARNANT,,,21427,,,,,,,,,,,,,,,,,,,2012-11-30,F,,,,,01.61Z,NAFRev2,N,4.65146,47.071388,0.93,street,Rue du Chateau 21360 Montceau-et-Écharnant,21427_0030,G,RUE DU CHATEAU,
522031293,00049,52203129300049,P,2023-03-20,,,,2023-04-14T09:08:38,true,1,[ND],[ND],[ND],[ND],[ND],[ND],MONTCEAU-ET-ECHARNANT,,[ND],21427,[ND],[ND],,,[ND],[ND],[ND],[ND],[ND],[ND],,,[ND],,[ND],[ND],,,2023-03-20,A,[ND],[ND],[ND],[ND],55.20Z,NAFRev2,N,,,0,,,,,,
523486207,00013,52348620700013,O,2010-08-01,01,2020,,2023-01-16T08:34:13,true,4,,,,,LA CORVEE,21360,MONTCEAU-ET-ECHARNANT,,,21427,,,,,,,,,,,,,,,,,,,2022-11-01,A,,,,,70.10Z,NAFRev2,N,4.657267,47.050416,0.37,locality,La Chaume Saint Vincent 21360 Montceau-et-Écharnant,21427_B065,G,LA CHAUME SAINT VINCENT,
530429430,00032,53042943000032,O,2014-04-14,,,,2019-11-14T14:00:23,false,2,,,,RUE,MOINGEON,21360,MONTCEAU-ET-ECHARNANT,,,21427,,,,,,,,,,,,,,,,,,,2015-03-02,F,,,,,85.51Z,NAFRev2,N,4.65468,47.060852,0.37,locality,Rue du Gué d'Amont 21360 Montceau-et-Écharnant,21427_0083,G,RUE DU GUE D AMONT,
530904416,00019,53090441600019,O,2011-02-08,,,,2019-11-14T14:00:23,true,1,,,,RUE,DU DESSUS DE LA VELLE,21360,MONTCEAU-ET-ECHARNANT,,,21427,,,,,,,,,,,,,,,,,,,2011-02-08,A,,,,,47.99A,NAFRev2,N,,,0,,,,,,
538897752,00019,53889775200019,O,2012-01-01,,,,2019-11-14T14:00:23,true,2,,,,,EN LONGS CHAMPS,21360,MONTCEAU-ET-ECHARNANT,,,21427,,,,,,,,,,,,,,,,,,,2016-05-30,F,,,,,70.21Z,NAFRev2,N,4.658135,47.057297,0.93,locality,En Longs Champs 21360 Montceau-et-Écharnant,21427_B182,G,EN LONGS CHAMPS,
753405281,00019,75340528100019,O,2012-09-01,,,,2019-11-14T14:00:23,true,1,,,,RUE,DU BAS DE LA VELLE,21360,MONTCEAU-ET-ECHARNANT,,,21427,,,,,,,,,,,,,,,,,,,2012-09-01,A,,,,,85.51Z,NAFRev2,N,4.664007,47.057764,0.36,locality,Au Bas du Sot 21360 Montceau-et-Écharnant,21427_B026,G,AU BAS DU SOT,
753992916,00019,75399291600019,O,2012-09-01,NN,,,2019-11-14T14:00:23,false,2,,,,,,21360,MONTCEAU-ET-ECHARNANT,,,21427,,,,,,,,,,,,,,,,,,,2013-07-30,F,,,,,81.30Z,NAFRev2,O,,,0,,,,,,
788962116,00034,78896211600034,O,2022-09-01,,,,2023-01-31T10:52:29,true,1,,,,RUE,DU SAULT,21360,MONTCEAU-ET-ECHARNANT,,,21427,,,,,,,,,,,,,,,,,,,2022-09-01,A,,,,,70.22Z,NAFRev2,N,4.65468,47.060852,0.5,locality,Rue du Gué d'Amont 21360 Montceau-et-Écharnant,21427_0083,G,RUE DU GUE D AMONT,
791333719,00031,79133371900031,P,2020-12-13,,,3101ZZ,2022-09-09T03:37:19,true,2,[ND],[ND],[ND],[ND],[ND],[ND],MONTCEAU-ET-ECHARNANT,,[ND],21427,[ND],[ND],,,[ND],[ND],[ND],[ND],[ND],[ND],,,[ND],,[ND],[ND],,,2022-08-31,F,[ND],[ND],[ND],[ND],31.09B,NAFRev2,N,,,0,,,,,,
793660473,00018,79366047300018,O,2013-07-01,,,,2019-11-14T14:00:23,true,1,GRANDMONT,,,,CHEZ M FREDERIC LEPRINCE,21360,MONTCEAU-ET-ECHARNANT,,,21427,,,,,,,,,,,,,,,,,,,2013-07-01,A,,,,,68.20B,NAFRev2,N,,,0,,,,,,
801532573,00012,80153257300012,O,2014-01-01,01,2020,,2022-08-29T09:56:41,true,1,,,,,FERME DU PIGEONNIER,21360,MONTCEAU-ET-ECHARNANT,,,21427,,,,,,,,,,,,,,,,,,,2014-01-01,A,,,,,01.42Z,NAFRev2,N,5.0622069,48.2983072,0.8,poi.3,Pigeonnier de la Ferme de Froideau (Patrimoine national) Cerisières,https://osm.org/node/4424202892,G,,
801559311,00015,80155931100015,O,2014-05-01,,,,2019-11-14T14:00:23,true,3,,3,,RUE,DU BAS DE LA VELLE,21360,MONTCEAU-ET-ECHARNANT,,,21427,,,,,,,,,,,,,,,,,,,2016-12-31,F,CHAMPS VINCENOT,,,CHAMPS VINCENOT,01.25Z,NAFRev2,N,4.664007,47.057764,0.34,locality,Au Bas du Sot 21360 Montceau-et-Écharnant,21427_B026,G,AU BAS DU SOT,
802741348,00014,80274134800014,O,2014-06-02,,,,2021-12-14T04:19:12,true,2,,,,,LES BRAAS,21360,MONTCEAU-ET-ECHARNANT,,,21427,,,,,,,,,,,,,,,,,,,2021-12-31,F,,,,,01.13Z,NAFRev2,N,1.3506249,46.3117972,0.7,poi.stone,Dolmen des Bras (Pierre) Saint-Sulpice-les-Feuilles,https://osm.org/node/1941951886,G,,
808564918,00015,80856491800015,O,2015-01-01,,,,2019-11-14T14:00:23,true,1,,,,,,21360,MONTCEAU-ET-ECHARNANT,,,21427,,,,,,,,,,,,,,,,,,,2015-01-01,A,,,,,01.11Z,NAFRev2,N,,,0,,,,,,
809128283,00011,80912828300011,O,2015-02-05,,,,2019-11-14T14:00:23,true,1,,,,RUE,DU GUE,21360,MONTCEAU-ET-ECHARNANT,,,21427,,,,,,,,,,,,,,,,,,,2015-02-05,A,,,,,18.13Z,NAFRev2,N,4.65468,47.060852,0.91,locality,Rue du Gué d'Amont 21360 Montceau-et-Écharnant,21427_0083,G,RUE DU GUE D AMONT,
810635714,00019,81063571400019,O,2015-01-15,,,,2019-11-14T14:00:23,true,1,,,,,GRANDMONT,21360,MONTCEAU-ET-ECHARNANT,,,21427,,,,,,,,,,,,,,,,,,,2015-01-15,A,,,,,47.89Z,NAFRev2,N,4.651885,47.068853,0.91,locality,Ham de Grandmont 21360 Montceau-et-Écharnant,21427_0080,G,HAM DE GRANDMONT,
812614915,00013,81261491500013,O,2015-07-20,01,2020,,2022-08-29T10:05:25,true,2,GRANDMONT,,,,RUE DU CHATEAU,21360,MONTCEAU-ET-ECHARNANT,,,21427,,,,,,,,,,,,,,,,,,,2017-01-01,A,BCE 21,,,BCE 21,46.74B,NAFRev2,O,4.65146,47.071388,0.93,street,Rue du Chateau 21360 Montceau-et-Écharnant,21427_0030,G,RUE DU CHATEAU,
818454100,00012,81845410000012,O,2016-01-23,,,,2023-03-30T19:38:58,true,1,,,,,CREUX BOUILLOT,21360,MONTCEAU-ET-ECHARNANT,,,21427,,,,,,,,,,,,,,,,,,,2016-01-23,A,,,,,68.20B,NAFRev2,N,,,0,,,,,,
819491135,00011,81949113500011,O,2016-03-26,,,,2021-03-16T03:42:48,false,2,,,,RUE,DERRIERE,21360,MONTCEAU-ET-ECHARNANT,,,21427,,,,,,,,,,,,,,,,,,,2021-03-01,F,,,,,77.31Z,NAFRev2,N,4.65468,47.060852,0.37,locality,Rue du Gué d'Amont 21360 Montceau-et-Écharnant,21427_0083,G,RUE DU GUE D AMONT,
819953506,00022,81995350600022,O,2020-02-20,,,,2021-10-27T15:23:59,false,2,,,,RUE,DU BAS,21360,MONTCEAU-ET-ECHARNANT,,,21427,,,,,,,,,,,,,,,,,,,2021-10-08,A,,,,,47.99A,NAFRev2,N,4.664007,47.057764,0.57,locality,Au Bas du Sot 21360 Montceau-et-Écharnant,21427_B026,G,AU BAS DU SOT,
832472054,00010,83247205400010,O,2017-10-03,,,,2019-12-05T08:26:35,true,1,,2,,RUE,DU BAS DE LA VELLE,21360,MONTCEAU-ET-ECHARNANT,,,21427,,,,,,,,,,,,,,,,,,,2017-10-03,A,YELLOW AND MINT,,,YELLOW AND MINT,47.91B,NAFRev2,N,4.664007,47.057764,0.34,locality,Au Bas du Sot 21360 Montceau-et-Écharnant,21427_B026,G,AU BAS DU SOT,
832722078,00017,83272207800017,O,2017-11-14,,,5610CQ,2019-11-14T14:00:23,false,3,,,,RUE,DU GUE,21360,MONTCEAU-ET-ECHARNANT,,,21427,,,,,,,,,,,,,,,,,,,2019-08-01,F,,,,LA FEE DE LA CUISINE BIO VEGETARIENNE,56.10C,NAFRev2,O,4.65468,47.060852,0.91,locality,Rue du Gué d'Amont 21360 Montceau-et-Écharnant,21427_0083,G,RUE DU GUE D AMONT,
839590601,00010,83959060100010,O,2018-01-01,,,,2019-11-14T14:00:23,true,1,,,,RUE,DU DESSUS DE LA VELLE,21360,MONTCEAU-ET-ECHARNANT,,,21427,,,,,,,,,,,,,,,,,,,2018-01-01,A,,,,,68.20B,NAFRev2,N,,,0,,,,,,