siren,nic,siret,statutDiffusionEtablissement,dateCreationEtablissement,trancheEffectifsEtablissement,anneeEffectifsEtablissement,activitePrincipaleRegistreMetiersEtablissement,dateDernierTraitementEtablissement,etablissementSiege,nombrePeriodesEtablissement,complementAdresseEtablissement,numeroVoieEtablissement,indiceRepetitionEtablissement,typeVoieEtablissement,libelleVoieEtablissement,codePostalEtablissement,libelleCommuneEtablissement,libelleCommuneEtrangerEtablissement,distributionSpecialeEtablissement,codeCommuneEtablissement,codeCedexEtablissement,libelleCedexEtablissement,codePaysEtrangerEtablissement,libellePaysEtrangerEtablissement,complementAdresse2Etablissement,numeroVoie2Etablissement,indiceRepetition2Etablissement,typeVoie2Etablissement,libelleVoie2Etablissement,codePostal2Etablissement,libelleCommune2Etablissement,libelleCommuneEtranger2Etablissement,distributionSpeciale2Etablissement,codeCommune2Etablissement,codeCedex2Etablissement,libelleCedex2Etablissement,codePaysEtranger2Etablissement,libellePaysEtranger2Etablissement,dateDebut,etatAdministratifEtablissement,enseigne1Etablissement,enseigne2Etablissement,enseigne3Etablissement,denominationUsuelleEtablissement,activitePrincipaleEtablissement,nomenclatureActivitePrincipaleEtablissement,caractereEmployeurEtablissement,longitude,latitude,geo_score,geo_type,geo_adresse,geo_id,geo_ligne,geo_l4,geo_l5
200085868,00012,20008586800012,O,2019-01-01,21,2020,,2022-08-29T09:05:33,true,1,,6,,PL,DE LA MAIRIE,35720,MESNIL-ROC'H,,,35308,,,,,,,,,,,,,,,,,,,2019-01-01,A,MAIRIE,,,,84.11Z,NAFRev2,N,-1.913133,48.446946,0.85,housenumber,6 Place de la Mairie 35720 Mesnil-Roc'h,35308_0061_00006,G,6 PLACE DE LA MAIRIE,
200085868,00020,20008586800020,O,2019-01-01,,,,2019-01-23T17:00:11,false,1,,5,,PL,DU CALVAIRE,35720,MESNIL-ROC'H,,,35308,,,,,,,,,,,,,,,,,,,2019-01-01,A,COMMUNE DELEGUEE DE LANHELIN,,,,84.11Z,NAFRev2,N,-1.829362,48.458796,0.84,housenumber,5 Place du Calvaire 35720 Mesnil-Roc'h,35308_0210_00005,G,5 PLACE DU CALVAIRE,
200085868,00038,20008586800038,O,2019-01-01,,,,2021-02-23T10:30:57,false,1,,6,,PL,DE LA MAIRIE,35720,MESNIL-ROC'H,,,35308,,,,,,,,,,,,,,,,,,,2019-01-01,A,COMMUNE DELEGUEE DE SAINT-PIERRE-DE-PLESGUES,,,,84.11Z,NAFRev2,N,-1.913133,48.446946,0.85,housenumber,6 Place de la Mairie 35720 Mesnil-Roc'h,35308_0061_00006,G,6 PLACE DE LA MAIRIE,
200085868,00046,20008586800046,O,2019-01-01,,,,2019-01-23T17:00:11,false,1,,1,,,LE BOURG,35720,MESNIL-ROC'H,,,35308,,,,,,,,,,,,,,,,,,,2019-01-01,A,COMMUNE DELEGUEE DE TRESSE,,,,84.11Z,NAFRev2,N,-1.886117,48.481518,0.96,housenumber,1 Le Bourg 35720 Mesnil-Roc'h,35308_99hr13_00001,G,1 LE BOURG,
200085868,00053,20008586800053,O,2019-01-01,02,2020,,2022-08-29T09:05:33,false,1,,7,,PL,DU CALVAIRE,35720,MESNIL-ROC'H,,,35308,,,,,,,,,,,,,,,,,,,2019-01-01,A,ECOLE PRIMAIRE PUBLIQUE MARIO RAMOS,,,,85.20Z,NAFRev2,N,-1.82922,48.45892,0.84,housenumber,7 Place du Calvaire 35720 Mesnil-Roc'h,35308_0210_00007,G,7 PLACE DU CALVAIRE,
200085868,00061,20008586800061,O,2019-01-01,11,2020,,2022-08-29T09:05:33,false,1,,9,,RUE,DU GENERAL DE GAULLE,35720,MESNIL-ROC'H,,,35308,,,,,,,,,,,,,,,,,,,2019-01-01,A,ECOLE PRIMAIRE  PUBLIQUE FANNY DUFEIL,,,,85.20Z,NAFRev2,N,-1.912209,48.445739,0.89,street,Rue du Général de Gaulle 35720 Mesnil-Roc'h,35308_0015,G,RUE DU GENERAL DE GAULLE,
200085868,00079,20008586800079,O,2019-01-01,03,2020,,2023-03-01T20:06:47,false,1,LE BOURG,,,,LE BOURG,35720,MESNIL-ROC'H,,,35308,,,,,,,,,,,,,,,,,,,2019-01-01,A,ECOLE PRIMAIRE PUBLIQUE DE TRESSE,,,,85.20Z,NAFRev2,N,-1.884986,48.481084,0.96,street,Le Bourg 35720 Mesnil-Roc'h,35308_99hr13,G,LE BOURG,
200085868,00087,20008586800087,O,2019-01-01,,,,2023-02-21T11:00:42,false,1,MAIRIE,6,,PL,DE LA MAIRIE,35720,MESNIL-ROC'H,,,35308,,,,,,,,,,,,,,,,,,,2019-01-01,A,ASSAINISSEMENT DE LANHELIN,,,,37.00Z,NAFRev2,N,-1.913133,48.446946,0.85,housenumber,6 Place de la Mairie 35720 Mesnil-Roc'h,35308_0061_00006,G,6 PLACE DE LA MAIRIE,
200085868,00095,20008586800095,O,2019-01-01,,,,2023-02-21T11:02:04,false,1,MAIRIE,6,,PL,DE LA MAIRIE,35720,MESNIL-ROC'H,,,35308,,,,,,,,,,,,,,,,,,,2019-01-01,A,ASSAINISSEMENT DE SAINT-PIERRE-DE-PLESGUEN,,,,37.00Z,NAFRev2,N,-1.913133,48.446946,0.85,housenumber,6 Place de la Mairie 35720 Mesnil-Roc'h,35308_0061_00006,G,6 PLACE DE LA MAIRIE,
200085868,00103,20008586800103,O,2019-01-01,,,,2023-02-21T11:03:27,false,1,MAIRIE,6,,PL,DE LA MAIRIE,35720,MESNIL-ROC'H,,,35308,,,,,,,,,,,,,,,,,,,2019-01-01,A,ASSAINISSEMENT DE TRESSE,,,,37.00Z,NAFRev2,N,-1.913133,48.446946,0.85,housenumber,6 Place de la Mairie 35720 Mesnil-Roc'h,35308_0061_00006,G,6 PLACE DE LA MAIRIE,
200085868,00111,20008586800111,O,2019-01-01,,,,2023-04-21T14:25:22,false,2,MAIRIE,6,,PL,DE LA MAIRIE,35720,MESNIL-ROC'H,,,35308,,,,,,,,,,,,,,,,,,,2021-11-17,F,ZA DE ST PIERRE DE PLESGUEN,,,,42.99Z,NAFRev2,N,-1.913133,48.446946,0.85,housenumber,6 Place de la Mairie 35720 Mesnil-Roc'h,35308_0061_00006,G,6 PLACE DE LA MAIRIE,
200085868,00129,20008586800129,O,2019-01-01,,,,2019-05-15T14:53:11,false,1,,21,,,LA VALLEE,35720,MESNIL-ROC'H,,,35308,,,,,,,,,,,,,,,,,,,2019-01-01,A,RESTAURANT SCOLAIRE,,,,56.29B,NAFRev2,N,-1.912964,48.448428,0.94,housenumber,21 Lotissement la Vallee 35720 Mesnil-Roc'h,35308_a061_00021,G,21 LOTISSEMENT LA VALLEE,
200085900,00013,20008590000013,O,2019-01-01,02,2020,,2022-08-29T09:05:33,true,1,MAIRIE,5,,PL,DE LA MAIRIE,35720,MESNIL-ROC'H,,,35308,,,,,,,,,,,,,,,,,,,2019-01-01,A,,,,,88.99B,NAFRev2,O,-1.913157,48.446928,0.85,housenumber,5 Place de la Mairie 35720 Mesnil-Roc'h,35308_0061_00005,G,5 PLACE DE LA MAIRIE,
200085900,00021,20008590000021,O,2019-01-01,12,2020,,2022-08-29T09:05:33,false,1,,12,,RUE,GENERAL DE GAULLE,35720,MESNIL-ROC'H,,,35308,,,,,,,,,,,,,,,,,,,2019-01-01,A,EHPAD LE VOILIER BLEU,,,,87.10A,NAFRev2,O,-1.912327,48.445099,0.95,housenumber,12 Rue du Général de Gaulle 35720 Mesnil-Roc'h,35308_0015_00012,G,12 RUE DU GENERAL DE GAULLE,
200085900,00039,20008590000039,O,2019-01-01,11,2020,,2022-08-29T09:05:33,false,1,MAIRIE,5,,PL,DE LA MAIRIE,35720,MESNIL-ROC'H,,,35308,,,,,,,,,,,,,,,,,,,2019-01-01,A,SERVICE D'AIDE A DOMICILE,,,,88.10A,NAFRev2,O,-1.913157,48.446928,0.85,housenumber,5 Place de la Mairie 35720 Mesnil-Roc'h,35308_0061_00005,G,5 PLACE DE LA MAIRIE,
200085926,00018,20008592600018,O,2019-01-01,,,,2019-01-23T17:00:11,true,1,MAIRIE,5,,PL,DU CALVAIRE,35720,MESNIL-ROC'H,,,35308,,,,,,,,,,,,,,,,,,,2019-01-01,A,CDE,,,,88.99B,NAFRev2,N,-1.829362,48.458796,0.84,housenumber,5 Place du Calvaire 35720 Mesnil-Roc'h,35308_0210_00005,G,5 PLACE DU CALVAIRE,
213501471,00014,21350147100014,O,1983-03-01,NN,,,2021-10-27T08:08:02,true,5,,5,,PL,DU CALVAIRE,35720,MESNIL-ROC'H,,,35308,,,,,,,,,,,,,,,,,,,2019-01-01,F,MAIRIE,,,,84.11Z,NAFRev2,O,-1.829362,48.458796,0.84,housenumber,5 Place du Calvaire 35720 Mesnil-Roc'h,35308_0210_00005,G,5 PLACE DU CALVAIRE,
213501471,00022,21350147100022,O,1983-12-21,NN,,,2021-10-27T08:08:02,false,4,,7,,PL,DU CALVAIRE,35720,MESNIL-ROC'H,,,35308,,,,,,,,,,,,,,,,,,,2019-01-01,F,ECOLE PRIMAIRE PUBLIQUE,,,,85.20Z,NAFRev2,N,-1.82922,48.45892,0.84,housenumber,7 Place du Calvaire 35720 Mesnil-Roc'h,35308_0210_00007,G,7 PLACE DU CALVAIRE,
213501471,00030,21350147100030,O,1997-04-10,NN,,,2019-01-23T17:00:11,false,3,MAIRIE,5,,PL,DU CALVAIRE,35720,MESNIL-ROC'H,,,35308,,,,,,,,,,,,,,,,,,,2003-12-31,F,LOTISSEMENT COMMUNAL,,,,70.1C,NAFRev1,N,-1.829362,48.458796,0.84,housenumber,5 Place du Calvaire 35720 Mesnil-Roc'h,35308_0210_00005,G,5 PLACE DU CALVAIRE,
213501471,00048,21350147100048,O,1996-12-25,NN,,,2019-01-31T20:01:47,false,4,MAIRIE,5,,PL,DU CALVAIRE,35720,MESNIL-ROC'H,,,35308,,,,,,,,,,,,,,,,,,,2019-01-01,F,SERVICE ASSAINISSEMENT,,,,37.00Z,NAFRev2,N,-1.829362,48.458796,0.84,housenumber,5 Place du Calvaire 35720 Mesnil-Roc'h,35308_0210_00005,G,5 PLACE DU CALVAIRE,
213501471,00055,21350147100055,O,1999-12-25,NN,,,2019-01-23T17:00:11,false,2,MAIRIE,5,,PL,DU CALVAIRE,35720,MESNIL-ROC'H,,,35308,,,,,,,,,,,,,,,,,,,2003-12-31,F,LOTISSEMENT LE CHAMP DE LA MANTHE,,,,70.1C,NAFRev1,N,-1.829362,48.458796,0.84,housenumber,5 Place du Calvaire 35720 Mesnil-Roc'h,35308_0210_00005,G,5 PLACE DU CALVAIRE,
213501471,00063,21350147100063,O,2003-01-01,NN,,,2019-01-23T17:00:11,false,3,MAIRIE,5,,PL,DU CALVAIRE,35720,MESNIL-ROC'H,,,35308,,,,,,,,,,,,,,,,,,,2005-12-31,F,LOTISSEMENT CHAMP DE LA MANTHE II,,,,70.1C,NAFRev1,N,-1.829362,48.458796,0.84,housenumber,5 Place du Calvaire 35720 Mesnil-Roc'h,35308_0210_00005,G,5 PLACE DU CALVAIRE,
213503089,00012,21350308900012,O,1983-03-01,NN,,,2021-10-27T08:08:04,true,5,,6,,PL,DE LA MAIRIE,35720,MESNIL-ROC'H,,,35308,,,,,,,,,,,,,,,,,,,2019-01-01,F,MAIRIE,,,,84.11Z,NAFRev2,O,-1.913133,48.446946,0.85,housenumber,6 Place de la Mairie 35720 Mesnil-Roc'h,35308_0061_00006,G,6 PLACE DE LA MAIRIE,
213503089,00038,21350308900038,O,1983-12-21,NN,,,2021-10-27T08:08:04,false,4,,2,,RUE,DE L EGALITE,35720,MESNIL-ROC'H,,,35308,,,,,,,,,,,,,,,,,,,2019-01-01,F,ECOLE PRIMAIRE PUBLIQUE,,,,85.20Z,NAFRev2,N,-1.907682,48.44491,0.87,street,Rue de l'Egalité 35720 Mesnil-Roc'h,35308_0012,G,RUE DE L EGALITE,
213503089,00053,21350308900053,O,1997-01-30,NN,,,2019-01-31T20:02:02,false,4,MAIRIE,6,,PL,DE LA MAIRIE,35720,MESNIL-ROC'H,,,35308,,,,,,,,,,,,,,,,,,,2019-01-01,F,SERVICE ASSAINISSEMENT,,,,37.00Z,NAFRev2,N,-1.913133,48.446946,0.85,housenumber,6 Place de la Mairie 35720 Mesnil-Roc'h,35308_0061_00006,G,6 PLACE DE LA MAIRIE,
213503089,00061,21350308900061,O,1997-01-30,NN,,,2019-01-23T17:00:11,false,3,MAIRIE,6,,PL,DE LA MAIRIE,35720,MESNIL-ROC'H,,,35308,,,,,,,,,,,,,,,,,,,2004-12-31,F,ZA DE ST PIERRE DE PLESGUEN,,,,70.1C,NAFRev1,N,-1.913133,48.446946,0.85,housenumber,6 Place de la Mairie 35720 Mesnil-Roc'h,35308_0061_00006,G,6 PLACE DE LA MAIRIE,
213503089,00079,21350308900079,O,1997-01-31,NN,,,2019-01-23T17:00:11,false,4,MAIRIE,6,,PL,DE LA MAIRIE,35720,MESNIL-ROC'H,,,35308,,,,,,,,,,,,,,,,,,,2013-12-12,F,LOTISSEMENT COMMUNAL,,,,42.99Z,NAFRev2,N,-1.913133,48.446946,0.85,housenumber,6 Place de la Mairie 35720 Mesnil-Roc'h,35308_0061_00006,G,6 PLACE DE LA MAIRIE,
213503089,00087,21350308900087,O,2001-12-25,NN,,,2019-01-23T17:00:11,false,3,MAIRIE,6,,PL,DE LA MAIRIE,35720,MESNIL-ROC'H,,,35308,,,,,,,,,,,,,,,,,,,2008-10-06,F,LOTISSEMENT LA RICOLAIS,,,,42.99Z,NAFRev2,N,-1.913133,48.446946,0.85,housenumber,6 Place de la Mairie 35720 Mesnil-Roc'h,35308_0061_00006,G,6 PLACE DE LA MAIRIE,
213503444,00019,21350344400019,O,1983-03-01,NN,,,2020-08-25T10:16:57,true,4,,,,,BOURG,35720,MESNIL-ROC'H,,,35308,,,,,,,,,,,,,,,,,,,2019-01-01,F,MAIRIE,,,,84.11Z,NAFRev2,O,-1.884986,48.481084,0.94,street,Le Bourg 35720 Mesnil-Roc'h,35308_99hr13,G,LE BOURG,
213503444,00027,21350344400027,O,1983-12-21,NN,,,2021-10-27T08:08:04,false,5,,,,,BOURG,35720,MESNIL-ROC'H,,,35308,,,,,,,,,,,,,,,,,,,2019-01-01,F,ECOLE ELEMENTAIRE PUBLIQUE,,,,85.20Z,NAFRev2,N,-1.884986,48.481084,0.94,street,Le Bourg 35720 Mesnil-Roc'h,35308_99hr13,G,LE BOURG,
213503444,00035,21350344400035,O,1996-12-25,NN,,,2019-01-23T17:00:11,false,3,MAIRIE,,,,BOURG,35720,MESNIL-ROC'H,,,35308,,,,,,,,,,,,,,,,,,,2011-12-25,F,LOTISSEMENTS COMMUNAUX,,,,42.99Z,NAFRev2,N,-1.884986,48.481084,0.94,street,Le Bourg 35720 Mesnil-Roc'h,35308_99hr13,G,LE BOURG,
243500733,00023,24350073300023,O,1999-06-01,NN,,,2019-09-17T13:42:53,false,4,,,,,LE BOURG,35720,MESNIL-ROC'H,,,35308,,,,,,,,,,,,,,,,,,,2017-12-31,F,ZONES INDUSTRIELLES,,,,42.99Z,NAFRev2,N,-1.884986,48.481084,0.96,street,Le Bourg 35720 Mesnil-Roc'h,35308_99hr13,G,LE BOURG,
263501587,00012,26350158700012,O,1983-03-01,NN,,,2019-01-31T20:02:39,true,4,MAIRIE,,,,BOURG,35720,MESNIL-ROC'H,,,35308,,,,,,,,,,,,,,,,,,,2019-01-01,F,CCAS,,,,88.99B,NAFRev2,N,-1.884986,48.481084,0.94,street,Le Bourg 35720 Mesnil-Roc'h,35308_99hr13,G,LE BOURG,
263503146,00015,26350314600015,O,1983-03-01,NN,,,2019-01-31T20:02:40,true,6,MAIRIE,,,,BOURG,35720,MESNIL-ROC'H,,,35308,,,,,,,,,,,,,,,,,,,2019-01-01,F,,,,,88.99B,NAFRev2,O,-1.884986,48.481084,0.94,street,Le Bourg 35720 Mesnil-Roc'h,35308_99hr13,G,LE BOURG,
263503146,00023,26350314600023,O,1996-07-08,,,,2019-01-31T20:02:40,false,4,MAIRIE,,,,BOURG,35720,MESNIL-ROC'H,,,35308,,,,,,,,,,,,,,,,,,,2019-01-01,F,SERVICE AIDE MENAGERE A DOMICILE,,,,88.10A,NAFRev2,N,-1.884986,48.481084,0.94,street,Le Bourg 35720 Mesnil-Roc'h,35308_99hr13,G,LE BOURG,
263504177,00019,26350417700019,O,1984-11-20,NN,,,2020-08-25T10:20:58,true,6,MAIRIE,6,,PL,DE LA MAIRIE,35720,MESNIL-ROC'H,,,35308,,,,,,,,,,,,,,,,,,,2019-01-01,F,,,,,88.99B,NAFRev2,O,-1.913133,48.446946,0.85,housenumber,6 Place de la Mairie 35720 Mesnil-Roc'h,35308_0061_00006,G,6 PLACE DE LA MAIRIE,
263504177,00027,26350417700027,O,1998-11-01,NN,,,2021-10-27T08:12:50,false,5,,12,,RUE,GENERAL DE GAULLE,35720,MESNIL-ROC'H,,,35308,,,,,,,,,,,,,,,,,,,2019-01-01,F,EHPAD LE VOILIER BLEU,,,,87.10A,NAFRev2,N,-1.912327,48.445099,0.95,housenumber,12 Rue du Général de Gaulle 35720 Mesnil-Roc'h,35308_0015_00012,G,12 RUE DU GENERAL DE GAULLE,
263504177,00035,26350417700035,O,1997-02-13,NN,,,2021-10-27T08:12:50,false,6,MAIRIE,6,,PL,DE LA MAIRIE,35720,MESNIL-ROC'H,,,35308,,,,,,,,,,,,,,,,,,,2019-01-01,F,SERVICE D'AIDE A DOMICILE,,,,88.10A,NAFRev2,O,-1.913133,48.446946,0.85,housenumber,6 Place de la Mairie 35720 Mesnil-Roc'h,35308_0061_00006,G,6 PLACE DE LA MAIRIE,
263505240,00014,26350524000014,O,1985-03-19,NN,,,2019-01-31T20:03:01,true,4,MAIRIE,,,,BOURG,35720,MESNIL-ROC'H,,,35308,,,,,,,,,,,,,,,,,,,2019-01-01,F,CDE,,,,88.99B,NAFRev2,N,-1.884986,48.481084,0.94,street,Le Bourg 35720 Mesnil-Roc'h,35308_99hr13,G,LE BOURG,
263505406,00011,26350540600011,O,1985-03-19,NN,,,2019-01-31T20:03:01,true,5,MAIRIE,6,,PL,DE LA MAIRIE,35720,MESNIL-ROC'H,,BP 3,35308,,,,,,,,,,,,,,,,,,,2019-01-01,F,,,,,88.99B,NAFRev2,N,-1.913133,48.446946,0.85,housenumber,6 Place de la Mairie 35720 Mesnil-Roc'h,35308_0061_00006,G,6 PLACE DE LA MAIRIE,
273503664,00016,27350366400016,O,,,,,2019-01-23T17:00:11,true,1,,5,,PL,DE LA MAIRIE,35720,MESNIL-ROC'H,,,35308,,,,,,,,,,,,,,,,,,,1995-12-25,F,,,,,70.1C,NAF1993,N,-1.913157,48.446928,0.85,housenumber,5 Place de la Mairie 35720 Mesnil-Roc'h,35308_0061_00005,G,5 PLACE DE LA MAIRIE,
273503672,00019,27350367200019,O,,,,,2019-01-23T17:00:11,true,1,,5,,PL,DE LA MAIRIE,35720,MESNIL-ROC'H,,,35308,,,,,,,,,,,,,,,,,,,1995-12-25,F,,,,,75.1A,NAF1993,N,-1.913157,48.446928,0.85,housenumber,5 Place de la Mairie 35720 Mesnil-Roc'h,35308_0061_00005,G,5 PLACE DE LA MAIRIE,
293501375,00019,29350137500019,O,,NN,,,2019-01-23T17:00:11,true,1,,5,,PL,MAIRIE,35720,MESNIL-ROC'H,,,35308,,,,,,,,,,,,,,,,,,,1994-07-29,F,,,,,70.1C,NAF1993,N,-1.913157,48.446928,0.79,housenumber,5 Place de la Mairie 35720 Mesnil-Roc'h,35308_0061_00005,G,5 PLACE DE LA MAIRIE,
300212354,00017,30021235400017,O,,NN,,,2019-01-23T17:00:11,true,1,,,,,LE ROCHER ABRAHAM,35720,MESNIL-ROC'H,,,35308,,,,,,,,,,,,,,,,,,,1991-11-26,F,,,,,15.03,NAP,N,-1.855888,48.447283,0.8,street,Rue du Rocher Abraham 35720 Mesnil-Roc'h,35308_0096,G,RUE DU ROCHER ABRAHAM,
301039046,00026,30103904600026,O,1997-10-13,NN,,,2019-01-23T17:00:11,true,3,,4,,RUE,JEANNE JUGAN,35720,MESNIL-ROC'H,,,35308,,,,,,,,,,,,,,,,,,,2004-06-30,F,,,,,45.4J,NAFRev1,N,-1.829165,48.458023,0.95,housenumber,4 Rue Jeanne Jugan 35720 Mesnil-Roc'h,35308_0216_00004,G,4 RUE JEANNE JUGAN,
301593539,00044,30159353900044,O,2006-07-05,NN,,,2020-02-26T04:05:18,false,4,,4,,RUE,DE LA LIBERATION,35720,MESNIL-ROC'H,,,35308,,,,,,,,,,,,,,,,,,,2019-07-18,F,,,,,96.03Z,NAFRev2,N,-1.913744,48.446659,0.96,interpolation,4 Rue de la Libération 35720 Mesnil-Roc'h,,G,2 RUE DE LA LIBERATION,
301973236,00013,30197323600013,O,,,,,2019-01-23T17:00:11,true,1,,,,RUE,DE LA LIBERATION,35720,MESNIL-ROC'H,,,35308,,,,,,,,,,,,,,,,,,,1989-09-30,F,,,,,55.73,NAP,N,-1.914192,48.443171,0.96,street,Rue de la Libération 35720 Mesnil-Roc'h,35308_0050,G,RUE DE LA LIBERATION,
302596648,00014,30259664800014,O,,NN,,,2019-01-23T17:00:11,true,1,,,,LD,LA METAIRIE DU ROUVRE,35720,MESNIL-ROC'H,,,35308,,,,,,,,,,,,,,,,,,,1991-03-29,F,,,,,81.21,NAP,N,-1.863536,48.447574,0.95,street,La Métairie Du Rouvre 35720 Mesnil-Roc'h,35308_B889,G,LA METAIRIE DU ROUVRE,
302596861,00013,30259686100013,O,,NN,,,2019-01-23T17:00:11,true,1,,,,LD,LA METAIRIE DU ROUVRE,35720,MESNIL-ROC'H,,,35308,,,,,,,,,,,,,,,,,,,1991-03-29,F,,,,,81.21,NAP,N,-1.863536,48.447574,0.95,street,La Métairie Du Rouvre 35720 Mesnil-Roc'h,35308_B889,G,LA METAIRIE DU ROUVRE,
302597208,00016,30259720800016,O,,NN,,,2019-01-23T17:00:11,true,1,,,,LD,LA METAIRIE DU ROUVRE,35720,MESNIL-ROC'H,,,35308,,,,,,,,,,,,,,,,,,,1991-03-29,F,,,,,81.21,NAP,N,-1.863536,48.447574,0.95,street,La Métairie Du Rouvre 35720 Mesnil-Roc'h,35308_B889,G,LA METAIRIE DU ROUVRE,
302820477,00016,30282047700016,O,,,,,2019-01-23T17:00:11,true,1,,,,,,35720,MESNIL-ROC'H,,,35308,,,,,,,,,,,,,,,,,,,,F,,,,,81.21,NAP,N,,,0,,,,,,
303591937,00030,30359193700030,O,1900-01-01,NN,,,2019-01-23T17:00:11,true,4,,,,,LA VILLE PION,35720,MESNIL-ROC'H,,,35308,,,,,,,,,,,,,,,,,,,2008-12-31,F,,,,,43.31Z,NAFRev2,N,-1.840557,48.453223,0.95,street,La Ville Pion 35720 Mesnil-Roc'h,35308_C808,G,LA VILLE PION,
303983712,00017,30398371200017,O,1974-01-01,NN,,,2019-01-23T17:00:11,true,1,,,,RTE,,35720,MESNIL-ROC'H,,,35308,,,,,,,,,,,,,,,,,,,2002-06-30,F,,,,,74.1J,NAF1993,N,-1.930879,48.441433,0.66,street,Route de Pilleverte 35720 Mesnil-Roc'h,35308_0090,G,ROUTE DE PILLEVERTE,
304057805,00018,30405780500018,O,1964-01-01,NN,,,2019-01-23T17:00:11,true,3,,,,LD,LA HAIZE,35720,MESNIL-ROC'H,,,35308,,,,,,,,,,,,,,,,,,,2003-12-25,F,,,,,45.4C,NAFRev1,N,-1.892426,48.448331,0.43,street,La Houssais 35720 Mesnil-Roc'h,35308_v7aach,G,LA HOUSSAIS,
304207681,00012,30420768100012,O,,NN,,,2019-01-23T17:00:11,true,1,,,,PL,DE LA MAIRIE,35720,MESNIL-ROC'H,,,35308,,,,,,,,,,,,,,,,,,,1986-12-31,F,,,,,64.11,NAP,N,-1.913292,48.446978,0.84,street,Place de la Mairie 35720 Mesnil-Roc'h,35308_0061,G,PLACE DE LA MAIRIE,
304698921,00018,30469892100018,O,1964-01-01,NN,,,2019-01-23T17:00:11,true,4,,,,RUE,LAMENNAIS,35720,MESNIL-ROC'H,,,35308,,,,,,,,,,,,,,,,,,,2004-12-31,F,,,,,15.8C,NAFRev1,O,-1.918556,48.446628,0.96,street,Rue Lamennais 35720 Mesnil-Roc'h,35308_0038,G,RUE LAMENNAIS,
304755960,00024,30475596000024,O,,,,,2019-01-23T17:00:11,true,1,,2,,RUE,DE LA LIBERATION,35720,MESNIL-ROC'H,,,35308,,,,,,,,,,,,,,,,,,,1989-08-31,F,,,,,67.04,NAP,N,-1.913773,48.446767,0.96,housenumber,2 Rue de la Libération 35720 Mesnil-Roc'h,35308_0050_00002,G,2 RUE DE LA LIBERATION,
305535320,00017,30553532000017,O,1964-01-01,NN,,,2019-01-23T17:00:11,true,4,,,,RUE,DE LA LIBERATION,35720,MESNIL-ROC'H,,,35308,,,,,,,,,,,,,,,,,,,2004-09-30,F,,,,,52.2C,NAFRev1,O,-1.914192,48.443171,0.96,street,Rue de la Libération 35720 Mesnil-Roc'h,35308_0050,G,RUE DE LA LIBERATION,
305834962,00014,30583496200014,O,1900-01-01,NN,,,2019-01-23T17:00:11,true,3,MAIRIE,5,,PL,DE LA MAIRIE,35720,MESNIL-ROC'H,,,35308,,,,,,,,,,,,,,,,,,,2008-01-01,A,,,,,88.99B,NAFRev2,N,-1.913157,48.446928,0.85,housenumber,5 Place de la Mairie 35720 Mesnil-Roc'h,35308_0061_00005,G,5 PLACE DE LA MAIRIE,
306144767,00010,30614476700010,O,,NN,,,2019-01-23T17:00:11,true,1,,,,,LE BOURG,35720,MESNIL-ROC'H,,,35308,,,,,,,,,,,,,,,,,,,1991-10-10,F,,,,,67.07,NAP,N,-1.884986,48.481084,0.96,street,Le Bourg 35720 Mesnil-Roc'h,35308_99hr13,G,LE BOURG,
306953662,00013,30695366200013,O,1900-01-01,NN,,,2019-01-23T17:00:11,true,4,,,,,LE PETIT MOULIN DU ROUV,35720,MESNIL-ROC'H,,,35308,,,,,,,,,,,,,,,,,,,2009-12-25,F,,,,,02.20Z,NAFRev2,N,-1.870605,48.441356,0.64,street,Le Grand Moulin du Rouvre 35720 Mesnil-Roc'h,35308_B591,G,LE GRAND MOULIN DU ROUVRE,
306959503,00013,30695950300013,O,,,,,2019-01-23T17:00:11,true,1,,,,LD,LE ROCHER ABRAHAM,35720,MESNIL-ROC'H,,,35308,,,,,,,,,,,,,,,,,,,1984-12-25,F,,,,,15.03,NAP,N,-1.855888,48.447283,0.8,street,Rue du Rocher Abraham 35720 Mesnil-Roc'h,35308_0096,G,RUE DU ROCHER ABRAHAM,
306976291,00014,30697629100014,O,1974-01-01,NN,,,2019-01-23T17:00:11,true,3,,,,,LE BOURG,35720,MESNIL-ROC'H,,,35308,,,,,,,,,,,,,,,,,,,2008-01-01,A,,,,,43.32A,NAFRev2,N,-1.884986,48.481084,0.96,street,Le Bourg 35720 Mesnil-Roc'h,35308_99hr13,G,LE BOURG,
306976333,00014,30697633300014,O,1974-01-01,NN,,,2023-05-05T20:12:25,true,4,,,,,LE BOURG,35720,MESNIL-ROC'H,,,35308,,,,,,,,,,,,,,,,,,,2014-12-25,F,,,,,43.32B,NAFRev2,N,-1.884986,48.481084,0.96,street,Le Bourg 35720 Mesnil-Roc'h,35308_99hr13,G,LE BOURG,
308202944,00028,30820294400028,O,1990-08-01,NN,,,2019-01-23T17:00:11,true,7,,53,,RUE,DE LA LIBERATION,35720,MESNIL-ROC'H,,,35308,,,,,,,,,,,,,,,,,,,2014-03-31,F,,,,,86.21Z,NAFRev2,O,-1.913713,48.444809,0.96,housenumber,53 Rue de la Libération 35720 Mesnil-Roc'h,35308_0050_00053,G,53 RUE DE LA LIBERATION,
309083780,00010,30908378000010,O,1967-01-01,NN,,,2019-01-23T17:00:11,true,3,,,,,LA HEZE,35720,MESNIL-ROC'H,,,35308,,,,,,,,,,,,,,,,,,,1998-12-25,F,,,,,70.2C,NAF1993,N,-1.892426,48.448331,0.47,street,La Houssais 35720 Mesnil-Roc'h,35308_v7aach,G,LA HOUSSAIS,
309710796,00033,30971079600033,O,2003-07-01,NN,,,2019-01-23T17:00:11,true,4,,,,,LA TIOLAIS,35720,MESNIL-ROC'H,,,35308,,,,,,,,,,,,,,,,,,,2013-07-31,F,,,,,43.32A,NAFRev2,N,-1.919805,48.463613,0.95,street,La Tiolais 35720 Mesnil-Roc'h,35308_enkzxu,G,LA TIOLAIS,
310395926,00036,31039592600036,O,2015-03-01,,,,2022-09-02T03:57:17,true,2,LA CHAMBRE,,,,VILLAGE LA CHAMBRE,35720,MESNIL-ROC'H,,,35308,,,,,,,,,,,,,,,,,,,2022-07-26,F,,,,,43.99C,NAFRev2,N,-1.890596,48.436144,0.61,street,La Chambre 35720 Mesnil-Roc'h,35308_fyul1i,G,LA CHAMBRE,
310471164,00015,31047116400015,O,1900-01-01,NN,,,2019-01-23T17:00:11,true,3,,,,,LES CHAMPS GELES,35720,MESNIL-ROC'H,,,35308,,,,,,,,,,,,,,,,,,,2008-01-01,A,,,,,68.20B,NAFRev2,N,-1.821697,48.451308,0.95,street,Les Champs Gelés 35720 Mesnil-Roc'h,35308_C455,G,LES CHAMPS GELES,
310709779,00022,31070977900022,O,1989-04-30,12,2020,,2022-08-29T09:13:29,false,4,,,,,BECANE,35720,MESNIL-ROC'H,,,35308,,,,,,,,,,,,,,,,,,,2008-01-01,A,,,,,08.11Z,NAFRev2,O,0.4126343,48.0205497,0.88,poi.track,Chemin de la Bécane Saint-Mars-la-Brière,https://osm.org/way/167238815,G,,
310709779,00063,31070977900063,O,2018-03-01,,,,2019-01-23T17:00:11,false,1,,,,,LA CHAUFFETIERE,35720,MESNIL-ROC'H,,,35308,,,,,,,,,,,,,,,,,,,2018-03-01,A,,,,,08.11Z,NAFRev2,O,-1.847144,48.452447,0.95,street,La Chauffetière 35720 Mesnil-Roc'h,35308_q6b4ae,G,LA CHAUFFETIERE,
312299100,00015,31229910000015,O,1964-01-01,NN,,,2019-01-23T17:00:11,true,4,,,,RTE,DE RENNES,35720,MESNIL-ROC'H,,,35308,,,,,,,,,,,,,,,,,,,2006-09-20,F,,,,,26.7Z,NAFRev1,O,-1.827383,48.461597,0.44,street,Rue René Laennec 35720 Mesnil-Roc'h,35308_0220,G,RUE RENE LAENNEC,
313020141,00039,31302014100039,O,1987-06-04,,,,2019-01-23T17:00:11,true,4,,,,,LA HOUSSAIS,35720,MESNIL-ROC'H,,,35308,,,,,,,,,,,,,,,,,,,1993-12-25,F,,,,,45.4F,NAF1993,N,-1.892426,48.448331,0.96,street,La Houssais 35720 Mesnil-Roc'h,35308_v7aach,G,LA HOUSSAIS,
313919474,00012,31391947400012,O,,,,,2019-01-23T17:00:11,true,1,,,,,LE ROUVRE,35720,MESNIL-ROC'H,,,35308,,,,,,,,,,,,,,,,,,,1984-12-25,F,,,,,00.10,NAP,N,-1.866893,48.445009,0.96,street,Le Rouvre 35720 Mesnil-Roc'h,35308_ddrjv3,G,LE ROUVRE,
313958076,00017,31395807600017,O,,NN,,,2019-01-23T17:00:11,true,1,,,,RUE,DU GENERAL LECLERC,35720,MESNIL-ROC'H,,,35308,,,,,,,,,,,,,,,,,,,1987-01-02,F,,,,,81.21,NAP,N,-1.914573,48.451066,0.82,street,Rue General Leclerc 35720 Mesnil-Roc'h,35308_0020,G,RUE GENERAL LECLERC,
314350018,00037,31435001800037,O,2013-11-20,,,,2019-01-23T17:00:11,false,2,,35,,RUE,DE LA LIBERATION,35720,MESNIL-ROC'H,,,35308,,,,,,,,,,,,,,,,,,,2015-06-10,F,,,,,86.90E,NAFRev2,N,-1.913562,48.445686,0.96,housenumber,35 Rue de la Libération 35720 Mesnil-Roc'h,35308_0050_00035,G,35 RUE DE LA LIBERATION,
314350018,00045,31435001800045,O,2015-06-10,,,,2021-02-23T10:40:35,true,1,,4,,PL,ANGE DENIS,35720,MESNIL-ROC'H,,,35308,,,,,,,,,,,,,,,,,,,2015-06-10,A,CABINET D'ORTHOPHONIE,,,,86.90E,NAFRev2,N,-1.912997,48.446509,0.71,street,Place Ange Denis 35720 Mesnil-Roc'h,35308_0003,G,PLACE ANGE DENIS,