siren,nic,siret,statutDiffusionEtablissement,dateCreationEtablissement,trancheEffectifsEtablissement,anneeEffectifsEtablissement,activitePrincipaleRegistreMetiersEtablissement,dateDernierTraitementEtablissement,etablissementSiege,nombrePeriodesEtablissement,complementAdresseEtablissement,numeroVoieEtablissement,indiceRepetitionEtablissement,typeVoieEtablissement,libelleVoieEtablissement,codePostalEtablissement,libelleCommuneEtablissement,libelleCommuneEtrangerEtablissement,distributionSpecialeEtablissement,codeCommuneEtablissement,codeCedexEtablissement,libelleCedexEtablissement,codePaysEtrangerEtablissement,libellePaysEtrangerEtablissement,complementAdresse2Etablissement,numeroVoie2Etablissement,indiceRepetition2Etablissement,typeVoie2Etablissement,libelleVoie2Etablissement,codePostal2Etablissement,libelleCommune2Etablissement,libelleCommuneEtranger2Etablissement,distributionSpeciale2Etablissement,codeCommune2Etablissement,codeCedex2Etablissement,libelleCedex2Etablissement,codePaysEtranger2Etablissement,libellePaysEtranger2Etablissement,dateDebut,etatAdministratifEtablissement,enseigne1Etablissement,enseigne2Etablissement,enseigne3Etablissement,denominationUsuelleEtablissement,activitePrincipaleEtablissement,nomenclatureActivitePrincipaleEtablissement,caractereEmployeurEtablissement,longitude,latitude,geo_score,geo_type,geo_adresse,geo_id,geo_ligne,geo_l4,geo_l5
214601536,00011,21460153600011,O,1983-03-01,02,2020,,2022-08-29T09:07:22,true,4,,,,,,46200,LANZAC,,,46153,,,,,,,,,,,,,,,,,,,2008-01-01,A,MAIRIE,,,,84.11Z,NAFRev2,O,,,0,,,,,,
214601536,00029,21460153600029,O,1983-12-21,NN,,,2017-05-04T01:26:17,false,3,,,,,,46200,LANZAC,,,46153,,,,,,,,,,,,,,,,,,,2008-01-01,A,ECOLE PRIMAIRE PUBLIQUE,,,,85.20Z,NAFRev2,N,,,0,,,,,,
214601536,00037,21460153600037,O,1995-12-25,NN,,,2008-01-04T18:34:28,false,2,MAIRIE,,,,,46200,LANZAC,,,46153,,,,,,,,,,,,,,,,,,,2008-01-01,A,SERVICE ASSAINISSEMENT,,,,37.00Z,NAFRev2,N,1.485617,44.870138,0.39,street,Route de Laborie 46200 Lanzac,46153_0033,D,ROUTE DE LABORIE,
214601536,00045,21460153600045,O,1995-12-25,NN,,,2008-01-04T18:34:28,false,2,MAIRIE,,,,,46200,LANZAC,,,46153,,,,,,,,,,,,,,,,,,,2008-01-01,A,SERVICE EAU,,,,36.00Z,NAFRev2,N,1.485617,44.870138,0.39,street,Route de Laborie 46200 Lanzac,46153_0033,D,ROUTE DE LABORIE,
214601536,00052,21460153600052,O,1997-12-25,00,2020,,2022-08-29T09:07:22,false,3,,,,,LE PORT,46200,LANZAC,,,46153,,,,,,,,,,,,,,,,,,,2022-06-01,A,CAMPING MUNICIPAL,,,,55.30Z,NAFRev2,O,1.458789,44.892207,0.56,locality,Port de Laroumet 46200 Lanzac,46153_B085,G,PORT DE LAROUMET,
214601536,00060,21460153600060,O,2003-04-15,NN,,,2014-04-24T15:49:08,false,4,,,,,MAIRIE,46200,LANZAC,,,46153,,,,,,,,,,,,,,,,,,,2013-12-12,F,BA LOT COMMUNAL,,,,42.99Z,NAFRev2,N,1.485617,44.870138,0.39,street,Route de Laborie 46200 Lanzac,46153_0033,G,ROUTE DE LABORIE,
264602624,00019,26460262400019,O,1984-11-20,NN,,,2010-06-26T03:10:19,true,3,,,,,MAIRIE,46200,LANZAC,,,46153,,,,,,,,,,,,,,,,,,,2008-01-01,A,CCAS,,,,88.99B,NAFRev2,N,1.485617,44.870138,0.39,street,Route de Laborie 46200 Lanzac,46153_0033,G,ROUTE DE LABORIE,
294607064,00010,29460706400010,O,1983-09-14,NN,,,2006-11-25T09:10:44,true,3,,,,,MAIRIE,46200,LANZAC,,,46153,,,,,,,,,,,,,,,,,,,1991-12-25,F,,,,,90.12,NAP,N,1.485617,44.870138,0.39,street,Route de Laborie 46200 Lanzac,46153_0033,G,ROUTE DE LABORIE,
309958478,00013,30995847800013,O,1977-01-01,NN,,,2014-07-08T00:14:47,true,5,,,,LD,LA DURANTIE,46200,LANZAC,,,46153,,,,,,,,,,,,,,,,,,,2012-06-30,F,,,,,43.21A,NAFRev2,O,1.476554,44.876997,0.94,street,la Durantie 46200 Lanzac,46153_te6sfu,G,LA DURANTIE,
310020839,00018,31002083900018,O,1977-01-01,NN,,,,true,1,,,,LD,LA DURANTIE,46200,LANZAC,,,46153,,,,,,,,,,,,,,,,,,,2001-12-31,F,,,,,29.3C,NAF1993,N,1.476554,44.876997,0.94,street,la Durantie 46200 Lanzac,46153_te6sfu,G,LA DURANTIE,
310364716,00012,31036471600012,O,,,,,,true,1,,,,LD,CIEURAC,46200,LANZAC,,,46153,,,,,,,,,,,,,,,,,,,1985-12-25,F,,,,,55.72,NAP,N,1.456269,44.890377,0.95,street,Cieurac 46200 Lanzac,46153_v80fzk,G,CIEURAC,
310971171,00031,31097117100031,O,2012-03-17,,,,2020-02-17T03:35:49,true,2,,,,,LA BORIE,46200,LANZAC,,,46153,,,,,,,,,,,,,,,,,,,2016-12-31,F,,,,,74.90B,NAFRev2,N,1.485617,44.870138,0.62,street,Route de Laborie 46200 Lanzac,46153_0033,G,ROUTE DE LABORIE,
316258912,00047,31625891200047,O,,NN,,,,true,1,,,,RTE,DE LABORIE,46200,LANZAC,,,46153,,,,,,,,,,,,,,,,,,,1990-08-09,F,,,,,55.72,NAP,N,1.485617,44.870138,0.83,street,Route de Laborie 46200 Lanzac,46153_0033,G,ROUTE DE LABORIE,
316339613,00010,31633961300010,O,,,,,,true,1,,,,,CAMPING,46200,LANZAC,,,46153,,,,,,,,,,,,,,,,,,,1984-12-25,F,,,,,67.01,NAP,N,1.454757,44.891082,0.33,street,Passage le Caminol 46200 Lanzac,46153_0062,G,PASSAGE LE CAMINOL,
317177962,00014,31717796200014,O,,NN,,,,true,1,,,,,,46200,LANZAC,,,46153,,,,,,,,,,,,,,,,,,,,F,,,,,86.07,NAP,N,,,0,,,,,,
318406956,00033,31840695600033,O,,NN,,,,true,1,,,,,LD LES CASTAGNADES,46200,LANZAC,,,46153,,,,,,,,,,,,,,,,,,,1988-09-09,F,,,,,87.07,NAP,N,1.480023,44.871051,0.81,street,impasse des castagnades 46200 Lanzac,46153_0047,G,IMPASSE DES CASTAGNADES,
322124744,00010,32212474400010,O,1981-07-01,NN,,,,true,1,,,,,LES TERRUCHES,46200,LANZAC,,,46153,,,,,,,,,,,,,,,,,,,1998-02-15,F,,,,,45.4C,NAF1993,O,1.485455,44.874893,0.95,street,les Terruches 46200 Lanzac,46153_itgtmf,G,LES TERRUCHES,
322140161,00033,32214016100033,O,1981-07-01,NN,,,2008-01-04T18:33:01,false,3,,,,,,46200,LANZAC,,,46153,,,,,,,,,,,,,,,,,,,2008-01-01,A,,,,,68.20B,NAFRev2,N,,,0,,,,,,
324290782,00071,32429078200071,O,1999-07-28,,,,2016-09-26T13:39:14,false,4,,,,,,46200,LANZAC,,,46153,,,,,,,,,,,,,,,,,,,2001-12-31,F,,,,,55.3B,NAF1993,N,,,0,,,,,,
324503762,00027,32450376200027,O,2012-03-01,,,4312AZ,2015-03-18T01:00:52,true,3,,,,CHE,DES TERRUCHES,46200,LANZAC,,,46153,,,,,,,,,,,,,,,,,,,2014-06-01,F,,,,SAVIGNAC PAYSAGE,43.12A,NAFRev2,N,1.485488,44.875197,0.82,street,Route des Terruches 46200 Lanzac,46153_0034,G,ROUTE DES TERRUCHES,
325512804,00031,32551280400031,O,1998-10-09,NN,,,2022-07-12T03:49:37,false,3,,,,,LE MERIGOU,46200,LANZAC,,,46153,,,,,,,,,,,,,,,,,,,2005-02-28,F,,,,,74.1J,NAFRev1,N,1.476406,44.856731,0.75,street,route de merigou 46200 Lanzac,46153_0021,G,ROUTE DE MERIGOU,
328217641,00013,32821764100013,O,,NN,,,,true,1,,,,,LE COUQUET,46200,LANZAC,,,46153,,,,,,,,,,,,,,,,,,,1987-12-31,F,,,,,77.05,NAP,N,1.477026,44.877038,0.76,street,Champ de Couquet 46200 Lanzac,46153_B032,G,CHAMP DE COUQUET,
328433107,00047,32843310700047,O,2005-07-01,NN,,,2010-06-15T13:46:17,false,2,,,,,,46200,LANZAC,,,46153,,,,,,,,,,,,,,,,,,,2005-09-03,F,,,,,55.3B,NAFRev1,N,,,0,,,,,,
329181044,00028,32918104400028,O,,NN,,,,true,1,,,,,GREZELADE,46200,LANZAC,,,46153,,,,,,,,,,,,,,,,,,,1988-11-13,F,,,,,80.06,NAP,N,1.472049,44.859446,0.92,locality,Grézelade Nord 46200 Lanzac,46153_B065,G,GREZELADE NORD,
329575385,00011,32957538500011,O,,NN,,,,true,1,,,,,,46200,LANZAC,,,46153,,,,,,,,,,,,,,,,,,,1990-02-01,F,,,,,21.01,NAP,N,,,0,,,,,,
330088477,00014,33008847700014,O,,,,,,true,1,,,,,CAMPING,46200,LANZAC,,,46153,,,,,,,,,,,,,,,,,,,1985-12-25,F,,,,,62.46,NAP,N,1.454757,44.891082,0.33,street,Passage le Caminol 46200 Lanzac,46153_0062,G,PASSAGE LE CAMINOL,
330316142,00083,33031614200083,O,2019-06-15,00,2020,5610CQ,2022-08-29T09:21:25,true,3,LE BOURG,1068,,RTE,DE L 'OCCITANIE,46200,LANZAC,,,46153,,,,,,,,,,,,,,,,,,,2020-02-16,F,L'ALOUETTE,,,,56.10A,NAFRev2,O,1.483175,44.874632,0.88,housenumber,1068 Route de l’Occitanie 46200 Lanzac,46153_0069_01068,G,1068 ROUTE DE L OCCITANIE,
332271279,00017,33227127900017,O,,NN,,,,true,1,,,,,,46200,LANZAC,,,46153,,,,,,,,,,,,,,,,,,,,F,,,,,67.01,NAP,N,,,0,,,,,,
332819713,00022,33281971300022,O,1989-01-01,NN,,,2014-07-07T14:54:40,false,3,,,,,,46200,LANZAC,,,46153,,,,,,,,,,,,,,,,,,,2008-01-01,A,,,,,68.20B,NAFRev2,N,,,0,,,,,,
332819713,00048,33281971300048,O,2009-04-01,NN,,,2016-04-26T03:14:02,false,2,,,,RTE,DE LABORIE,46200,LANZAC,,,46153,,,,,,,,,,,,,,,,,,,2014-05-30,F,,,,,95.21Z,NAFRev2,O,1.485617,44.870138,0.83,street,Route de Laborie 46200 Lanzac,46153_0033,G,ROUTE DE LABORIE,
332819713,00055,33281971300055,O,2015-11-01,NN,,,2021-02-23T10:52:28,true,2,,,,,LE BOURG,46200,LANZAC,,,46153,,,,,,,,,,,,,,,,,,,2018-02-25,A,,,,FISH AND GITES,55.20Z,NAFRev2,O,1.475075,44.860919,0.32,street,Route des Bouygues Vieilles 46200 Lanzac,46153_0046,G,ROUTE DES BOUYGUES VIEILLES,
332915461,00013,33291546100013,O,1982-01-01,NN,,,,true,4,,,,,CIEURAC,46200,LANZAC,,,46153,,,,,,,,,,,,,,,,,,,1996-12-31,F,,,,,85.3D,NAF1993,O,1.456269,44.890377,0.95,street,Cieurac 46200 Lanzac,46153_v80fzk,G,CIEURAC,
333492866,00020,33349286600020,O,2007-07-01,,,,2008-09-07T04:23:23,true,4,CAMPING MUNICIPAL,,,,LA RIVIERE,46200,LANZAC,,,46153,,,,,,,,,,,,,,,,,,,2008-08-31,F,,,,,56.10A,NAFRev2,N,1.486277,44.876251,0.74,street,chemin rivière haute 46200 Lanzac,46153_0036,G,CHEMIN RIVIERE HAUTE,
335047544,00028,33504754400028,O,1991-09-19,NN,,,2017-01-16T10:21:06,false,3,,,,,LANZAC,46200,LANZAC,,,46153,,,,,,,,,,,,,,,,,,,2005-06-30,F,,,,,45.2J,NAFRev1,N,1.464947,44.872593,0.93,municipality,Lanzac,46153,G,LANZAC,
338145378,00018,33814537800018,O,,,,,,true,1,,,,,MAIRIE,46200,LANZAC,,,46153,,,,,,,,,,,,,,,,,,,1993-03-31,F,,,,,55.3A,NAF1993,N,1.485617,44.870138,0.39,street,Route de Laborie 46200 Lanzac,46153_0033,G,ROUTE DE LABORIE,
340445899,00040,34044589900040,O,2004-12-31,,,,2011-04-27T07:54:29,false,3,,,,,LIEU DIT LES CASTAGNADES,46200,LANZAC,,,46153,,,,,,,,,,,,,,,,,,,2006-03-15,F,,,,,45.4C,NAFRev1,N,1.480023,44.871051,0.81,street,impasse des castagnades 46200 Lanzac,46153_0047,G,IMPASSE DES CASTAGNADES,
341503662,00015,34150366200015,O,,NN,,,,true,1,,,R,RTE,DES FERRUCHES,46200,LANZAC,,,46153,,,,,,,,,,,,,,,,,,,1990-08-20,F,,,,,55.71,NAP,N,1.485488,44.875197,0.61,street,Route des Terruches 46200 Lanzac,46153_0034,G,ROUTE DES TERRUCHES,
342099199,00032,34209919900032,O,2004-07-21,NN,,,2009-03-04T05:49:13,true,4,,,,,LA DURANTIE,46200,LANZAC,,,46153,,,,,,,,,,,,,,,,,,,2008-12-31,F,,,,,01.24Z,NAFRev2,N,1.476554,44.876997,0.94,street,la Durantie 46200 Lanzac,46153_te6sfu,G,LA DURANTIE,
342252343,00039,34225234300039,O,2011-09-08,,,,2013-11-27T09:32:01,false,2,,,,LD,LA RIVIERE,46200,LANZAC,,,46153,,,,,,,,,,,,,,,,,,,2012-11-22,F,,,,,47.99A,NAFRev2,N,1.486277,44.876251,0.74,street,chemin rivière haute 46200 Lanzac,46153_0036,G,CHEMIN RIVIERE HAUTE,
342729522,00017,34272952200017,O,1987-10-28,NN,,,2011-12-02T09:53:27,true,4,,,,LD,LES TERRUCHES,46200,LANZAC,,,46153,,,,,,,,,,,,,,,,,,,2008-01-01,A,,,,,68.20B,NAFRev2,N,1.485455,44.874893,0.95,street,les Terruches 46200 Lanzac,46153_itgtmf,G,LES TERRUCHES,
342729522,00025,34272952200025,O,1994-11-23,NN,,,2006-11-25T10:45:35,false,3,,,,RUE,DE LA BORIE,46200,LANZAC,,,46153,,,,,,,,,,,,,,,,,,,2003-12-31,F,,,,,74.7Z,NAFRev1,O,1.485617,44.870138,0.61,street,Route de Laborie 46200 Lanzac,46153_0033,G,ROUTE DE LABORIE,
343636783,00015,34363678300015,O,1988-01-01,NN,,,2021-12-14T11:01:44,true,4,,,,,,46200,LANZAC,,,46153,,,,,,,,,,,,,,,,,,,2010-01-01,A,,,,,01.25Z,NAFRev2,N,,,0,,,,,,
344298369,00028,34429836900028,O,1988-02-01,NN,,,2019-12-24T03:34:16,true,6,,,,,LE BOURG,46200,LANZAC,,,46153,,,,,,,,,,,,,,,,,,,2019-04-15,F,,,,,70.10Z,NAFRev2,N,1.475075,44.860919,0.32,street,Route des Bouygues Vieilles 46200 Lanzac,46153_0046,G,ROUTE DES BOUYGUES VIEILLES,
345271860,00016,34527186000016,O,,NN,,,,true,1,,,,,GREZELADE,46200,LANZAC,,,46153,,,,,,,,,,,,,,,,,,,1988-11-13,F,,,,,80.06,NAP,N,1.472049,44.859446,0.92,locality,Grézelade Nord 46200 Lanzac,46153_B065,G,GREZELADE NORD,
345272140,00012,34527214000012,O,,NN,,,,true,1,,,,,GREZELADE,46200,LANZAC,,,46153,,,,,,,,,,,,,,,,,,,1988-11-13,F,,,,,80.06,NAP,N,1.472049,44.859446,0.92,locality,Grézelade Nord 46200 Lanzac,46153_B065,G,GREZELADE NORD,
347837676,00019,34783767600019,O,1988-07-10,NN,,,2008-01-04T22:45:06,true,3,,,,,,46200,LANZAC,,,46153,,,,,,,,,,,,,,,,,,,2008-01-01,A,,,,,41.10D,NAFRev2,N,,,0,,,,,,
347884033,00023,34788403300023,O,2002-07-01,NN,,,2010-11-16T00:13:07,false,4,,,,,GREZELADE,46200,LANZAC,,,46153,,,,,,,,,,,,,,,,,,,2003-04-07,F,,,,,01.1A,NAFRev1,N,1.472049,44.859446,0.92,locality,Grézelade Nord 46200 Lanzac,46153_B065,G,GREZELADE NORD,
348894866,00014,34889486600014,O,1989-01-01,NN,,,2008-01-04T22:57:11,true,3,,,,,,46200,LANZAC,,,46153,,,,,,,,,,,,,,,,,,,2008-01-01,A,,,,,01.11Z,NAFRev2,N,,,0,,,,,,
349682039,00012,34968203900012,O,1988-12-16,01,2020,,2022-08-29T09:31:29,true,3,,,,,,46200,LANZAC,,,46153,,,,,,,,,,,,,,,,,,,2008-01-01,A,,,,,01.46Z,NAFRev2,N,,,0,,,,,,
349941930,00019,34994193000019,O,1989-03-08,,,,,true,1,,,,,GREZELADE,46200,LANZAC,,,46153,,,,,,,,,,,,,,,,,,,1997-01-01,F,,,,,55.3A,NAF1993,N,1.472049,44.859446,0.92,locality,Grézelade Nord 46200 Lanzac,46153_B065,G,GREZELADE NORD,
350448767,00029,35044876700029,O,2007-08-20,NN,,,2016-06-28T09:06:30,false,6,,,,,LE BOURG,46200,LANZAC,,,46153,,,,,,,,,,,,,,,,,,,2014-06-30,F,L'ALOUETTE,,,,56.10A,NAFRev2,O,1.475075,44.860919,0.32,street,Route des Bouygues Vieilles 46200 Lanzac,46153_0046,G,ROUTE DES BOUYGUES VIEILLES,
350448767,00037,35044876700037,O,2016-06-26,NN,,,2018-09-29T12:00:51,true,1,,,,,CAMPING DU PONT,46200,LANZAC,,,46153,,,,,,,,,,,,,,,,,,,2016-06-26,A,,,,,56.10C,NAFRev2,N,4.3526702,44.4737129,0.91,poi.camp_site,Camping du Pont Pradons,https://osm.org/way/147193400,G,,
350546743,00013,35054674300013,O,1989-04-01,NN,,,,true,1,,,,,CIEURAC,46200,LANZAC,,,46153,,,,,,,,,,,,,,,,,,,2000-03-31,F,,,,,45.2V,NAF1993,O,1.456269,44.890377,0.95,street,Cieurac 46200 Lanzac,46153_v80fzk,G,CIEURAC,
351450846,00024,35145084600024,O,2001-07-02,NN,,,,true,1,,,,LD,CAMPING DU PONT,46200,LANZAC,,,46153,,,,,,,,,,,,,,,,,,,2002-09-15,F,,,,,55.3B,NAF1993,N,4.3526702,44.4737129,0.91,poi.camp_site,Camping du Pont Pradons,https://osm.org/way/147193400,G,,
351954664,00022,35195466400022,O,2009-06-25,,,,2012-11-09T00:42:26,true,1,,,,,CAMPING MUNICIPAL DU PORT,46200,LANZAC,,,46153,,,,,,,,,,,,,,,,,,,2009-06-25,A,,,,,47.11B,NAFRev2,N,-0.6851808,47.3712935,0.91,poi.camp_site,Camping Municipal du Port La Possonnière,https://osm.org/way/207901408,G,,
352054050,00021,35205405000021,O,2013-10-15,,,,2015-10-15T04:00:43,true,2,,,,,LA DURANTIE,46200,LANZAC,,,46153,,,,,,,,,,,,,,,,,,,2015-09-30,F,,,,,47.59A,NAFRev2,N,1.476554,44.876997,0.94,street,la Durantie 46200 Lanzac,46153_te6sfu,G,LA DURANTIE,
352865703,00016,35286570300016,O,1989-12-04,NN,,,2011-02-22T05:36:51,true,4,,,,,MERIGOU,46200,LANZAC,,,46153,,,,,,,,,,,,,,,,,,,1995-12-25,F,,,,,70.2A,NAF1993,N,1.476356,44.856833,0.94,street,Merigou 46200 Lanzac,46153_yfnurc,G,MERIGOU,
377665849,00016,37766584900016,O,1990-03-15,,,,2008-11-08T00:32:43,true,4,,,,LD,MERIGOU,46200,LANZAC,,,46153,,,,,,,,,,,,,,,,,,,1994-03-09,F,,,,,45.2V,NAF1993,N,1.476356,44.856833,0.94,street,Merigou 46200 Lanzac,46153_yfnurc,G,MERIGOU,
380579417,00011,38057941700011,O,,NN,,,,true,1,,,,,MERIGOU,46200,LANZAC,,,46153,,,,,,,,,,,,,,,,,,,1993-06-30,F,,,,,45.1A,NAF1993,N,1.476356,44.856833,0.94,street,Merigou 46200 Lanzac,46153_yfnurc,G,MERIGOU,
381125012,00025,38112501200025,O,2005-07-01,,,,2006-10-28T00:40:19,true,2,,,,LD,LA DURANTIE,46200,LANZAC,,,46153,,,,,,,,,,,,,,,,,,,2005-08-02,F,,,,,70.2A,NAFRev1,N,1.476554,44.876997,0.94,street,la Durantie 46200 Lanzac,46153_te6sfu,G,LA DURANTIE,
381735026,00019,38173502600019,O,1991-03-31,NN,,9521ZZ,2015-03-17T00:34:30,true,5,,,,,,46200,LANZAC,,,46153,,,,,,,,,,,,,,,,,,,2009-04-01,F,,,,,95.21Z,NAFRev2,O,,,0,,,,,,
382078137,00017,38207813700017,O,1991-01-01,NN,,,2021-02-23T11:10:28,true,4,,,,,,46200,LANZAC,,,46153,,,,,,,,,,,,,,,,,,,2015-07-31,A,,,,,68.20B,NAFRev2,N,,,0,,,,,,
384197760,00026,38419776000026,O,1998-01-01,NN,,,2008-01-04T22:35:09,false,3,,,,,CIEURAC,46200,LANZAC,,,46153,,,,,,,,,,,,,,,,,,,2008-01-01,A,,,,,01.11Z,NAFRev2,N,1.456269,44.890377,0.95,street,Cieurac 46200 Lanzac,46153_v80fzk,G,CIEURAC,
385048327,00022,38504832700022,O,1993-10-18,NN,,,,false,3,,,,LD,LE COUQUET,46200,LANZAC,,,46153,,,,,,,,,,,,,,,,,,,1995-05-09,F,,,,,74.2A,NAF1993,N,1.477026,44.877038,0.76,street,Champ de Couquet 46200 Lanzac,46153_B032,G,CHAMP DE COUQUET,
385243217,00010,38524321700010,O,1992-04-01,NN,,,,true,3,,,,PL,DE L'EGLISE,46200,LANZAC,,,46153,,,,,,,,,,,,,,,,,,,2003-12-31,F,,,,,70.2A,NAFRev1,N,1.482525,44.873917,0.82,street,Place de l’Eglise 46200 Lanzac,46153_0005,G,PLACE DE L EGLISE,
388051989,00068,38805198900068,O,2004-06-25,,,,2006-12-15T00:47:08,false,3,N 20,,,,CAMPING MUNICIPAL DU PONT,46200,LANZAC,,,46153,,,,,,,,,,,,,,,,,,,2004-12-25,F,,,,,55.3A,NAFRev1,N,1.0775113,43.6165656,0.9,poi.camp_site,Camping Municipal du Pont Tourné L'Isle-Jourdain,https://osm.org/way/125249340,G,,
388398570,00019,38839857000019,O,1992-08-15,NN,,,2011-02-22T05:36:50,true,4,,,,LD,MERIGOU,46200,LANZAC,,,46153,,,,,,,,,,,,,,,,,,,1995-12-25,F,,,,,92.6A,NAF1993,O,1.476356,44.856833,0.94,street,Merigou 46200 Lanzac,46153_yfnurc,G,MERIGOU,
389493438,00029,38949343800029,O,1998-12-22,NN,,,,false,4,,,,,CIEURAC,46200,LANZAC,,,46153,,,,,,,,,,,,,,,,,,,2001-12-31,F,,,,,52.6E,NAF1993,N,1.456269,44.890377,0.95,street,Cieurac 46200 Lanzac,46153_v80fzk,G,CIEURAC,
389493438,00045,38949343800045,O,2003-09-05,NN,,,2014-07-08T01:16:11,false,5,,,,,CIEURAC,46200,LANZAC,,,46153,,,,,,,,,,,,,,,,,,,2009-03-16,F,PATRICK SOULIER DECORATION,,,,43.34Z,NAFRev2,N,1.456269,44.890377,0.95,street,Cieurac 46200 Lanzac,46153_v80fzk,G,CIEURAC,
389493438,00052,38949343800052,O,2011-10-05,,,3240ZZ,2021-07-12T03:46:41,true,4,CIEURAC,,,PL,DU CHATEAU,46200,LANZAC,,,46153,,,,,,,,,,,,,,,,,,,2020-12-31,F,,,,MAGIC DESIR,16.29Z,NAFRev2,N,1.459013,44.88928,0.73,street,impasse du château d'eau 46200 Lanzac,46153_0054,G,IMPASSE DU CHATEAU D EAU,
390210573,00015,39021057300015,O,1993-01-01,NN,,,2012-07-28T14:07:17,true,4,,,,,CREUSAC,46200,LANZAC,,,46153,,,,,,,,,,,,,,,,,,,2008-12-25,F,,,,,01.11Z,NAFRev2,N,,,0,,,,,,
390540623,00019,39054062300019,O,1993-03-18,NN,,,,true,3,,,,,LE MAS DE MUSCAT,46200,LANZAC,,,46153,,,,,,,,,,,,,,,,,,,1993-12-31,F,,,,,70.3A,NAF1993,N,,,0,,,,,,
390590222,00019,39059022200019,O,1992-09-18,NN,,,2013-03-15T05:42:52,true,5,,,,,,46200,LANZAC,,,46153,,,,,,,,,,,,,,,,,,,2012-12-31,F,,,,,01.47Z,NAFRev2,O,,,0,,,,,,
390591287,00029,39059128700029,O,2005-10-01,,,,2021-03-23T04:59:26,true,2,,,,,LA DURANTIE,46200,LANZAC,,,46153,,,,,,,,,,,,,,,,,,,2020-12-31,F,,,,,68.20A,NAFRev2,N,1.476554,44.876997,0.94,street,la Durantie 46200 Lanzac,46153_te6sfu,G,LA DURANTIE,
391594587,00019,39159458700019,O,1993-05-01,NN,,,,true,1,,,,LD,LANZAC,46200,LANZAC,,,46153,,,,,,,,,,,,,,,,,,,1999-09-30,F,,,,,55.3A,NAF1993,O,1.464947,44.872593,0.93,municipality,Lanzac,46153,G,LANZAC,
393051479,00011,39305147900011,O,1972-03-01,NN,,,2007-01-18T09:34:46,true,3,,,,,,46200,LANZAC,,,46153,,,,,,,,,,,,,,,,,,,2001-12-31,F,,,,,01.1A,NAF1993,N,,,0,,,,,,
393051925,00013,39305192500013,O,1985-10-14,NN,,,,true,3,,,,,,46200,LANZAC,,,46153,,,,,,,,,,,,,,,,,,,2003-01-20,F,,,,,02.0A,NAFRev1,N,,,0,,,,,,
393051990,00017,39305199000017,O,1985-01-01,NN,,,2017-01-12T04:48:36,true,4,,,,,,46200,LANZAC,,,46153,,,,,,,,,,,,,,,,,,,2011-01-01,A,,,,,01.24Z,NAFRev2,N,,,0,,,,,,
393053814,00017,39305381400017,O,1987-05-14,NN,,,2021-10-15T09:38:00,true,3,,,,,,46200,LANZAC,,,46153,,,,,,,,,,,,,,,,,,,2008-01-01,A,,,,,01.19Z,NAFRev2,N,,,0,,,,,,
394634562,00042,39463456200042,O,2022-02-01,,,,2022-04-01T16:13:03,true,1,,27,,RUE,DE L ECOLE,46200,LANZAC,,,46153,,,,,,,,,,,,,,,,,,,2022-02-01,A,,,,,55.20Z,NAFRev2,N,1.481848,44.872919,0.94,housenumber,27 rue de l'école 46200 Lanzac,46153_0011_00027,G,27 RUE DE L ECOLE,
394897235,00039,39489723500039,O,2015-09-01,,,,2021-02-23T11:20:40,true,1,,,,,LE BOURG,46200,LANZAC,,,46153,,,,,,,,,,,,,,,,,,,2015-09-01,A,,,,,90.03A,NAFRev2,N,1.475075,44.860919,0.32,street,Route des Bouygues Vieilles 46200 Lanzac,46153_0046,G,ROUTE DES BOUYGUES VIEILLES,
400222071,00013,40022207100013,O,1991-02-21,NN,,,2019-04-02T04:31:05,true,5,,,,,CIEURAC,46200,LANZAC,,,46153,,,,,,,,,,,,,,,,,,,2018-12-31,F,,,,,01.25Z,NAFRev2,N,1.456269,44.890377,0.95,street,Cieurac 46200 Lanzac,46153_v80fzk,G,CIEURAC,
400302170,00016,40030217000016,O,1994-01-01,NN,,,2008-03-07T08:29:16,true,5,,,,,CIEURAC,46200,LANZAC,,,46153,,,,,,,,,,,,,,,,,,,2008-01-01,A,,,,,01.11Z,NAFRev2,N,1.456269,44.890377,0.95,street,Cieurac 46200 Lanzac,46153_v80fzk,G,CIEURAC,
402148696,00022,40214869600022,O,2002-04-29,,,,2008-11-08T01:12:55,false,4,,,,CHE,DES TENUCHES,46200,LANZAC,,,46153,,,,,,,,,,,,,,,,,,,2006-09-26,F,,,,,45.2J,NAFRev1,O,1.456829,44.89027,0.39,street,chemin des écureuils 46200 Lanzac,46153_0057,G,CHEMIN DES ECUREUILS,
404552432,00019,40455243200019,O,1971-04-01,NN,,,,true,4,,,,,,46200,LANZAC,,,46153,,,,,,,,,,,,,,,,,,,2003-06-19,F,,,,,01.3Z,NAFRev1,N,,,0,,,,,,
404552440,00012,40455244000012,O,1973-08-24,NN,,,,true,1,,,,,LA DURANTIE,46200,LANZAC,,,46153,,,,,,,,,,,,,,,,,,,2000-12-31,F,,,,,01.1F,NAF1993,N,1.476554,44.876997,0.94,street,la Durantie 46200 Lanzac,46153_te6sfu,G,LA DURANTIE,
404552457,00016,40455245700016,O,1980-01-01,NN,,,2016-12-11T04:27:41,true,4,,,,,LABORIE,46200,LANZAC,,,46153,,,,,,,,,,,,,,,,,,,2016-12-31,F,,,,,01.50Z,NAFRev2,N,1.485617,44.870138,0.93,street,Route de Laborie 46200 Lanzac,46153_0033,G,ROUTE DE LABORIE,
404552465,00019,40455246500019,O,,NN,,,,true,1,,,,,CIEURAC,46200,LANZAC,,,46153,,,,,,,,,,,,,,,,,,,1996-10-08,F,,,,,01.3Z,NAF1993,N,1.456269,44.890377,0.95,street,Cieurac 46200 Lanzac,46153_v80fzk,G,CIEURAC,
404552473,00013,40455247300013,O,1994-12-13,NN,,,2008-01-04T20:42:23,true,3,GREZELADE,,,,,46200,LANZAC,,,46153,,,,,,,,,,,,,,,,,,,2008-01-01,A,,,,,01.42Z,NAFRev2,N,1.472049,44.859446,0.92,locality,Grézelade Nord 46200 Lanzac,46153_B065,D,GREZELADE NORD,
405407701,00029,40540770100029,O,2006-05-01,,,4312AZ,2015-03-18T01:09:28,true,4,,,,,LES TERRUCHES,46200,LANZAC,,,46153,,,,,,,,,,,,,,,,,,,2014-09-30,F,B.C . T.P,,,,43.12A,NAFRev2,N,1.485455,44.874893,0.95,street,les Terruches 46200 Lanzac,46153_itgtmf,G,LES TERRUCHES,
407912617,00013,40791261700013,O,,NN,,,,true,1,,,,,CAMPING MUNICIPAL,46200,LANZAC,,,46153,,,,,,,,,,,,,,,,,,,1996-09-15,F,,,,,55.2C,NAF1993,N,2.196998,44.9625649,0.92,poi.camp_site,Camping municipal Laroquebrou,https://osm.org/way/244693173,G,,
408111623,00018,40811162300018,O,1968-01-01,NN,,,2011-05-03T00:26:40,false,4,,,,,CIEURAC,46200,LANZAC,,,46153,,,,,,,,,,,,,,,,,,,2001-12-31,F,,,,,01.3Z,NAF1993,N,1.456269,44.890377,0.95,street,Cieurac 46200 Lanzac,46153_v80fzk,G,CIEURAC,
408111631,00011,40811163100011,O,1990-08-18,NN,,,2009-07-10T08:39:57,true,7,,,,,,46200,LANZAC,,,46153,,,,,,,,,,,,,,,,,,,2009-07-01,F,,,,,01.24Z,NAFRev2,N,,,0,,,,,,
410120760,00013,41012076000013,O,1997-01-01,,,,,true,1,,,,LD,LE PRESTIDOU,46200,LANZAC,,,46153,,,,,,,,,,,,,,,,,,,1998-06-30,F,,,,,45.3A,NAF1993,N,,,0,,,,,,
412577058,00016,41257705800016,O,1997-06-01,NN,,,2006-10-28T04:04:36,true,3,,,,LD,MERIGOU,46200,LANZAC,,,46153,,,,,,,,,,,,,,,,,,,2004-03-31,F,,,,,70.2A,NAFRev1,N,1.476356,44.856833,0.94,street,Merigou 46200 Lanzac,46153_yfnurc,G,MERIGOU,
412991275,00014,41299127500014,O,1997-05-20,NN,,,2015-04-14T13:59:01,true,3,LANZAC,,,,LA DURANTIE,46200,LANZAC,,,46153,,,,,,,,,,,,,,,,,,,2008-01-01,A,,,,,68.20A,NAFRev2,N,1.476554,44.876997,0.94,street,la Durantie 46200 Lanzac,46153_te6sfu,G,LA DURANTIE,
414819383,00020,41481938300020,O,1998-07-01,NN,,,2006-11-25T15:48:50,false,3,,,,,LE MERIGOU,46200,LANZAC,,,46153,,,,,,,,,,,,,,,,,,,2003-11-03,F,,,,,55.2E,NAFRev1,N,1.476406,44.856731,0.75,street,route de merigou 46200 Lanzac,46153_0021,G,ROUTE DE MERIGOU,
414819466,00023,41481946600023,O,1998-07-01,NN,,,,true,1,,,,,LE MERIGOU,46200,LANZAC,,,46153,,,,,,,,,,,,,,,,,,,2001-04-24,F,,,,,55.3A,NAF1993,O,1.476406,44.856731,0.75,street,route de merigou 46200 Lanzac,46153_0021,G,ROUTE DE MERIGOU,
414838235,00011,41483823500011,O,1997-05-16,NN,,,,true,3,,,,,LA DURANTIE,46200,LANZAC,,,46153,,,,,,,,,,,,,,,,,,,2003-12-17,F,,,,,01.3Z,NAFRev1,N,1.476554,44.876997,0.94,street,la Durantie 46200 Lanzac,46153_te6sfu,G,LA DURANTIE,