siren,nic,siret,statutDiffusionEtablissement,dateCreationEtablissement,trancheEffectifsEtablissement,anneeEffectifsEtablissement,activitePrincipaleRegistreMetiersEtablissement,dateDernierTraitementEtablissement,etablissementSiege,nombrePeriodesEtablissement,complementAdresseEtablissement,numeroVoieEtablissement,indiceRepetitionEtablissement,typeVoieEtablissement,libelleVoieEtablissement,codePostalEtablissement,libelleCommuneEtablissement,libelleCommuneEtrangerEtablissement,distributionSpecialeEtablissement,codeCommuneEtablissement,codeCedexEtablissement,libelleCedexEtablissement,codePaysEtrangerEtablissement,libellePaysEtrangerEtablissement,complementAdresse2Etablissement,numeroVoie2Etablissement,indiceRepetition2Etablissement,typeVoie2Etablissement,libelleVoie2Etablissement,codePostal2Etablissement,libelleCommune2Etablissement,libelleCommuneEtranger2Etablissement,distributionSpeciale2Etablissement,codeCommune2Etablissement,codeCedex2Etablissement,libelleCedex2Etablissement,codePaysEtranger2Etablissement,libellePaysEtranger2Etablissement,dateDebut,etatAdministratifEtablissement,enseigne1Etablissement,enseigne2Etablissement,enseigne3Etablissement,denominationUsuelleEtablissement,activitePrincipaleEtablissement,nomenclatureActivitePrincipaleEtablissement,caractereEmployeurEtablissement,longitude,latitude,geo_score,geo_type,geo_adresse,geo_id,geo_ligne,geo_l4,geo_l5
215404815,00015,21540481500015,O,1983-03-01,01,2020,,2022-08-29T09:07:43,true,4,,1,,PL,DE LA MAIRIE,54540,SAINT-MAURICE-AUX-FORGES,,,54481,,,,,,,,,,,,,,,,,,,2008-01-01,A,MAIRIE,,,,84.11Z,NAFRev2,O,6.846075,48.510359,0.71,locality,Place de la Mairie 54540 Saint-Maurice-aux-Forges,54481_0005,G,PLACE DE LA MAIRIE,
215404815,00023,21540481500023,O,1997-03-01,NN,,,2019-11-14T14:00:44,false,4,MAIRIE,1,,PL,DE LA MAIRIE,54540,SAINT-MAURICE-AUX-FORGES,,,54481,,,,,,,,,,,,,,,,,,,2012-12-25,F,SCE ASSAINISSEMENT,,,,37.00Z,NAFRev2,N,6.846075,48.510359,0.71,locality,Place de la Mairie 54540 Saint-Maurice-aux-Forges,54481_0005,G,PLACE DE LA MAIRIE,
255403081,00011,25540308100011,O,1993-01-21,NN,,,2019-11-14T14:00:44,false,4,MAIRIE,16,,RUE,GENERAL CASTELNAU,54540,SAINT-MAURICE-AUX-FORGES,,,54481,,,,,,,,,,,,,,,,,,,1996-12-25,F,,,,,75.1C,NAF1993,N,-0.7945272,45.0271647,0.85,poi,Rue du Général de Gaulle (Pont) Castelnau-de-Médoc,https://osm.org/way/229738235,G,,
265404913,00013,26540491300013,O,1992-01-01,NN,,,2019-11-14T14:00:44,true,5,MAIRIE,1,,PL,DE LA MAIRIE,54540,SAINT-MAURICE-AUX-FORGES,,,54481,,,,,,,,,,,,,,,,,,,2016-01-01,F,,,,,88.99B,NAFRev2,N,6.846075,48.510359,0.71,locality,Place de la Mairie 54540 Saint-Maurice-aux-Forges,54481_0005,G,PLACE DE LA MAIRIE,
295402903,00013,29540290300013,O,1983-09-27,NN,,,2019-11-14T14:00:44,true,4,MAIRIE,1,,PL,DE LA MAIRIE,54540,SAINT-MAURICE-AUX-FORGES,,,54481,,,,,,,,,,,,,,,,,,,2008-12-15,F,,,,,42.99Z,NAFRev2,N,6.846075,48.510359,0.71,locality,Place de la Mairie 54540 Saint-Maurice-aux-Forges,54481_0005,G,PLACE DE LA MAIRIE,
306055005,00012,30605500500012,O,,,,,2019-11-14T14:00:44,true,1,,,,,,54540,SAINT-MAURICE-AUX-FORGES,,,54481,,,,,,,,,,,,,,,,,,,1987-03-31,F,,,,,48.01,NAP,N,,,0,,,,,,
311456370,00031,31145637000031,O,1995-08-01,NN,,,2019-11-14T14:00:44,true,4,,22,,RUE,DU CLAIRBOIS,54540,SAINT-MAURICE-AUX-FORGES,,,54481,,,,,,,,,,,,,,,,,,,2006-09-26,F,,,,,45.2V,NAFRev1,N,6.849925,48.510213,0.94,housenumber,22 Rue du Clairbois 54540 Saint-Maurice-aux-Forges,54481_0003_00022,G,22 RUE DU CLAIRBOIS,
319956389,00039,31995638900039,O,2013-03-18,,,,2019-11-14T14:00:44,true,4,,16,,RUE,DU CLAIRBOIS,54540,SAINT-MAURICE-AUX-FORGES,,,54481,,,,,,,,,,,,,,,,,,,2016-12-01,F,,,,,43.32A,NAFRev2,N,6.849378,48.510054,0.94,housenumber,16 Rue du Clairbois 54540 Saint-Maurice-aux-Forges,54481_0003_00016,G,16 RUE DU CLAIRBOIS,
329777635,00015,32977763500015,O,1984-05-07,NN,,,2019-11-14T14:00:44,false,4,,,,,,54540,SAINT-MAURICE-AUX-FORGES,,,54481,,,,,,,,,,,,,,,,,,,2003-01-24,F,,,,,70.2C,NAFRev1,N,,,0,,,,,,
379478316,00043,37947831600043,O,2018-10-31,,,,2019-11-14T14:00:44,false,2,,9,,RUE,DE LA FORGE,54540,SAINT-MAURICE-AUX-FORGES,,,54481,,,,,,,,,,,,,,,,,,,2019-07-20,F,PRO DENTAIRE BACCARAT,,,,32.50A,NAFRev2,N,6.843837,48.510005,0.94,housenumber,9 Rue de la Forge 54540 Saint-Maurice-aux-Forges,54481_0001_00009,G,9 RUE DE LA FORGE,
384697165,00015,38469716500015,O,1992-01-01,NN,,,2019-11-14T14:00:44,true,4,,5,,RUE,DE LA PRELE,54540,SAINT-MAURICE-AUX-FORGES,,,54481,,,,,,,,,,,,,,,,,,,2008-01-01,A,,,,,68.20B,NAFRev2,N,6.847457,48.510587,0.93,housenumber,5 Rue de la Prèle 54540 Saint-Maurice-aux-Forges,54481_0002_00005,G,5 RUE DE LA PRELE,
385160536,00012,38516053600012,O,,NN,,,2019-11-14T14:00:44,true,1,,4,,RUE,DE LA FORGE,54540,SAINT-MAURICE-AUX-FORGES,,,54481,,,,,,,,,,,,,,,,,,,1995-11-30,F,,,,,74.1J,NAF1993,N,6.844949,48.510012,0.94,housenumber,4 Rue de la Forge 54540 Saint-Maurice-aux-Forges,54481_0001_00004,G,4 RUE DE LA FORGE,
388404972,00019,38840497200019,O,1992-08-01,,,,2019-11-14T14:00:44,false,3,,6,,RUE,DE LA FORGE,54540,SAINT-MAURICE-AUX-FORGES,,,54481,,,,,,,,,,,,,,,,,,,1993-10-01,F,,,,,20.1A,NAF1993,N,6.844124,48.510056,0.94,housenumber,6 Rue de la Forge 54540 Saint-Maurice-aux-Forges,54481_0001_00006,G,6 RUE DE LA FORGE,
388404972,00027,38840497200027,O,1993-10-01,NN,,,2019-11-14T14:00:44,true,4,,,,RUE,DU CLAIRBOIS,54540,SAINT-MAURICE-AUX-FORGES,,,54481,,,,,,,,,,,,,,,,,,,1996-12-25,F,,,,,20.1A,NAF1993,O,6.848264,48.510068,0.94,street,Rue du Clairbois 54540 Saint-Maurice-aux-Forges,54481_0003,G,RUE DU CLAIRBOIS,
389562265,00014,38956226500014,O,1992-08-01,NN,,,2019-11-14T14:00:44,true,4,,,,,LA FORGE,54540,SAINT-MAURICE-AUX-FORGES,,,54481,,,,,,,,,,,,,,,,,,,2015-04-26,F,,,,,55.20Z,NAFRev2,N,6.842636,48.510248,0.92,street,Rue de la Forge 54540 Saint-Maurice-aux-Forges,54481_0001,G,RUE DE LA FORGE,
393199328,00021,39319932800021,O,1998-07-01,01,2020,,2022-08-29T09:17:08,true,3,,3,,RUE,DE LA FORGE,54540,SAINT-MAURICE-AUX-FORGES,,,54481,,,,,,,,,,,,,,,,,,,2008-01-01,A,,,,,02.20Z,NAFRev2,N,6.845531,48.509808,0.94,housenumber,3 Rue de la Forge 54540 Saint-Maurice-aux-Forges,54481_0001_00003,G,3 RUE DE LA FORGE,
393647136,00018,39364713600018,O,1973-01-01,NN,,,2019-11-14T14:00:44,true,4,,,,PL,DE LA MAIRIE,54540,SAINT-MAURICE-AUX-FORGES,,,54481,,,,,,,,,,,,,,,,,,,2012-11-30,F,,,,,01.41Z,NAFRev2,N,6.846075,48.510359,0.81,locality,Place de la Mairie 54540 Saint-Maurice-aux-Forges,54481_0005,G,PLACE DE LA MAIRIE,
394477681,00016,39447768100016,O,1994-02-01,NN,,,2019-11-14T14:00:44,true,3,,5,,RUE,DE LA PRELE,54540,SAINT-MAURICE-AUX-FORGES,,,54481,,,,,,,,,,,,,,,,,,,2005-08-08,F,,,,,71.3A,NAFRev1,N,6.847457,48.510587,0.93,housenumber,5 Rue de la Prèle 54540 Saint-Maurice-aux-Forges,54481_0002_00005,G,5 RUE DE LA PRELE,
397607326,00014,39760732600014,O,1993-01-01,NN,,,2019-11-14T14:00:44,true,4,,7,,RUE,DE LA FORGE,54540,SAINT-MAURICE-AUX-FORGES,,,54481,,,,,,,,,,,,,,,,,,,2008-12-25,F,,,,,63.91Z,NAFRev2,N,6.843998,48.509994,0.94,housenumber,7 Rue de la Forge 54540 Saint-Maurice-aux-Forges,54481_0001_00007,G,7 RUE DE LA FORGE,
404140725,00015,40414072500015,O,1995-12-01,NN,,,2019-11-14T14:00:44,true,4,,,,RUE,DU CLAIRBOIS,54540,SAINT-MAURICE-AUX-FORGES,,,54481,,,,,,,,,,,,,,,,,,,2013-12-31,F,,,,,68.20B,NAFRev2,N,6.848264,48.510068,0.94,street,Rue du Clairbois 54540 Saint-Maurice-aux-Forges,54481_0003,G,RUE DU CLAIRBOIS,
404140725,00023,40414072500023,O,2013-03-18,,,,2019-11-14T14:00:44,false,2,,6,,RUE,DE LA FORGE,54540,SAINT-MAURICE-AUX-FORGES,,,54481,,,,,,,,,,,,,,,,,,,2013-12-31,F,,,,,43.32A,NAFRev2,N,6.844124,48.510056,0.94,housenumber,6 Rue de la Forge 54540 Saint-Maurice-aux-Forges,54481_0001_00006,G,6 RUE DE LA FORGE,
407886399,00010,40788639900010,O,,NN,,,2019-11-14T14:00:44,true,1,,,,,,54540,SAINT-MAURICE-AUX-FORGES,,,54481,,,,,,,,,,,,,,,,,,,1997-12-31,F,,,,,01.1A,NAF1993,N,,,0,,,,,,
415199769,00019,41519976900019,O,1998-01-01,NN,,,2019-11-14T14:00:44,true,3,,,,RUE,DE LA GARE,54540,SAINT-MAURICE-AUX-FORGES,,,54481,,,,,,,,,,,,,,,,,,,2007-12-31,F,,,,,01.1A,NAFRev1,N,6.842636,48.510248,0.63,street,Rue de la Forge 54540 Saint-Maurice-aux-Forges,54481_0001,G,RUE DE LA FORGE,
417595790,00037,41759579000037,O,1999-01-04,NN,,,2019-11-14T14:00:44,true,1,,3,,RUE,DU CLAIBOIS,54540,SAINT-MAURICE-AUX-FORGES,,,54481,,,,,,,,,,,,,,,,,,,2001-06-28,F,,,,,52.6D,NAF1993,N,6.847486,48.510133,0.84,housenumber,3 Rue du Clairbois 54540 Saint-Maurice-aux-Forges,54481_0003_00003,G,3 RUE DU CLAIRBOIS,
428028187,00014,42802818700014,O,1967-02-17,NN,,,2020-07-24T09:20:26,true,3,,,,,,54540,SAINT-MAURICE-AUX-FORGES,,,54481,,,,,,,,,,,,,,,,,,,2008-01-01,A,,,,,02.20Z,NAFRev2,N,,,0,,,,,,
433770260,00019,43377026000019,O,2000-09-01,NN,,,2019-11-14T14:00:44,true,5,,5,,RUE,PRELE,54540,SAINT-MAURICE-AUX-FORGES,,,54481,,,,,,,,,,,,,,,,,,,2016-10-31,F,,,,,01.61Z,NAFRev2,O,6.847457,48.510587,0.84,housenumber,5 Rue de la Prèle 54540 Saint-Maurice-aux-Forges,54481_0002_00005,G,5 RUE DE LA PRELE,
434530044,00016,43453004400016,O,2000-11-01,NN,,,2019-11-14T14:00:44,false,3,LA TREILLE,6,,RUE,CLAIRBOIS,54540,SAINT-MAURICE-AUX-FORGES,,,54481,,,,,,,,,,,,,,,,,,,2005-08-31,F,,,,,55.2E,NAFRev1,N,6.847294,48.509938,0.88,housenumber,6 Rue du Clairbois 54540 Saint-Maurice-aux-Forges,54481_0003_00006,G,6 RUE DU CLAIRBOIS,
437647472,00012,43764747200012,O,2001-02-23,NN,,,2019-11-14T14:00:44,true,3,MR SCHWARZ,6,,RUE,DU CLARBOIS,54540,SAINT-MAURICE-AUX-FORGES,,,54481,,,,,,,,,,,,,,,,,,,2008-01-01,A,,,,,68.20A,NAFRev2,N,6.847294,48.509938,0.84,housenumber,6 Rue du Clairbois 54540 Saint-Maurice-aux-Forges,54481_0003_00006,G,6 RUE DU CLAIRBOIS,
452560006,00010,45256000600010,O,2004-06-30,02,2020,,2022-08-29T09:08:12,true,4,,5,,RUE,DE LA PRELE,54540,SAINT-MAURICE-AUX-FORGES,,,54481,,,,,,,,,,,,,,,,,,,2012-12-31,A,,,,,01.11Z,NAFRev2,O,6.847457,48.510587,0.93,housenumber,5 Rue de la Prèle 54540 Saint-Maurice-aux-Forges,54481_0002_00005,G,5 RUE DE LA PRELE,
480609312,00040,48060931200040,O,2020-09-01,,,4334ZC,2021-02-23T13:43:47,true,1,,5,,RUE,DE LA FORGE,54540,SAINT-MAURICE-AUX-FORGES,,,54481,,,,,,,,,,,,,,,,,,,2020-09-01,A,,,,TRAVAUX ET CREATIONS,43.34Z,NAFRev2,N,6.844947,48.509933,0.94,housenumber,5 Rue de la Forge 54540 Saint-Maurice-aux-Forges,54481_0001_00005,G,5 RUE DE LA FORGE,
485182497,00019,48518249700019,O,2005-09-01,NN,,,2019-11-14T14:00:44,true,3,,,,PL,DE LA MAIRIE,54540,SAINT-MAURICE-AUX-FORGES,,,54481,,,,,,,,,,,,,,,,,,,2008-01-01,A,,,,,94.99Z,NAFRev2,O,6.846075,48.510359,0.81,locality,Place de la Mairie 54540 Saint-Maurice-aux-Forges,54481_0005,G,PLACE DE LA MAIRIE,
501433213,00011,50143321300011,O,2008-01-01,,,,2019-11-14T14:00:44,true,1,,,,RUE,DE LA GARE,54540,SAINT-MAURICE-AUX-FORGES,,,54481,,,,,,,,,,,,,,,,,,,2008-01-01,A,,,,,01.45Z,NAFRev2,N,6.842636,48.510248,0.63,street,Rue de la Forge 54540 Saint-Maurice-aux-Forges,54481_0001,G,RUE DE LA FORGE,
535275655,00012,53527565500012,O,2011-10-10,,,,2019-11-14T14:00:44,true,2,,9,,RUE,DE LA FORGE,54540,SAINT-MAURICE-AUX-FORGES,,,54481,,,,,,,,,,,,,,,,,,,2012-04-30,F,,,,,96.09Z,NAFRev2,N,6.843837,48.510005,0.94,housenumber,9 Rue de la Forge 54540 Saint-Maurice-aux-Forges,54481_0001_00009,G,9 RUE DE LA FORGE,
750331944,00017,75033194400017,O,2012-05-01,,,,2019-11-14T14:00:44,false,2,,7,,RUE,DU CLAIRBOIS,54540,SAINT-MAURICE-AUX-FORGES,,,54481,,,,,,,,,,,,,,,,,,,2018-04-01,F,,,,,01.49Z,NAFRev2,N,6.848098,48.510141,0.94,housenumber,7 Rue du Clairbois 54540 Saint-Maurice-aux-Forges,54481_0003_00007,G,7 RUE DU CLAIRBOIS,
753912229,00022,75391222900022,O,2013-01-01,,,9602AB,2021-02-23T16:11:30,true,1,,17,,RUE,DU CLAIRBOIS,54540,SAINT-MAURICE-AUX-FORGES,,,54481,,,,,,,,,,,,,,,,,,,2013-01-01,A,,,,,96.02A,NAFRev2,N,6.850005,48.510322,0.94,housenumber,17 Rue du Clairbois 54540 Saint-Maurice-aux-Forges,54481_0003_00017,G,17 RUE DU CLAIRBOIS,
789978731,00014,78997873100014,O,2012-11-30,,,,2019-11-14T14:00:44,true,1,,4,,PL,DU DOCTEUR APOLLON DE MIRBECK,54540,SAINT-MAURICE-AUX-FORGES,,,54481,,,,,,,,,,,,,,,,,,,2012-11-30,A,,,,,01.50Z,NAFRev2,N,6.846079,48.510055,0.8,housenumber,4 Place Docteur Apollon de Mirbeck 54540 Saint-Maurice-aux-Forges,54481_0010_00004,G,4 PLACE DR APOLLON DE MIRBECK,
789978731,00022,78997873100022,O,2014-05-01,,,,2019-11-14T14:00:44,false,1,,4,,PL,DU DOCTEUR APOLLON DE MIRBECK,54540,SAINT-MAURICE-AUX-FORGES,,,54481,,,,,,,,,,,,,,,,,,,2014-05-01,A,,,,,68.20B,NAFRev2,N,6.846079,48.510055,0.8,housenumber,4 Place Docteur Apollon de Mirbeck 54540 Saint-Maurice-aux-Forges,54481_0010_00004,G,4 PLACE DR APOLLON DE MIRBECK,
794559088,00016,79455908800016,O,2013-08-08,,,,2019-11-14T14:00:44,true,1,,7,,RUE,DE LA FORGE,54540,SAINT-MAURICE-AUX-FORGES,,,54481,,,,,,,,,,,,,,,,,,,2013-08-08,A,,,,,55.90Z,NAFRev2,N,6.843998,48.509994,0.94,housenumber,7 Rue de la Forge 54540 Saint-Maurice-aux-Forges,54481_0001_00007,G,7 RUE DE LA FORGE,
794783878,00018,79478387800018,O,2013-09-01,,,,2019-11-14T14:00:44,true,2,,15,,RUE,DE LA FORGE,54540,SAINT-MAURICE-AUX-FORGES,,,54481,,,,,,,,,,,,,,,,,,,2016-12-31,F,,,,,64.92Z,NAFRev2,N,6.842212,48.510356,0.94,housenumber,15 Rue de la Forge 54540 Saint-Maurice-aux-Forges,54481_0001_00015,G,15 RUE DE LA FORGE,
813213360,00015,81321336000015,O,2015-04-27,,,,2019-11-14T14:00:44,true,1,,,,,LA FORGE,54540,SAINT-MAURICE-AUX-FORGES,,,54481,,,,,,,,,,,,,,,,,,,2015-04-27,A,DANICHERT ELIANE DANICHERT JOSETTE DANICHERT LOUIS,,,,68.20A,NAFRev2,N,6.842636,48.510248,0.92,street,Rue de la Forge 54540 Saint-Maurice-aux-Forges,54481_0001,G,RUE DE LA FORGE,
813650652,00023,81365065200023,O,2015-12-13,,,,2021-02-23T17:32:18,true,1,,5,,RUE,DE LA FORGE,54540,SAINT-MAURICE-AUX-FORGES,,,54481,,,,,,,,,,,,,,,,,,,2015-12-13,A,DES COEURS DE CELINE,,,,01.49Z,NAFRev2,N,6.844947,48.509933,0.94,housenumber,5 Rue de la Forge 54540 Saint-Maurice-aux-Forges,54481_0001_00005,G,5 RUE DE LA FORGE,
814784468,00013,81478446800013,O,2015-11-21,,,,2019-11-14T14:00:44,false,2,,1,,CHE,DE COUVAY,54540,SAINT-MAURICE-AUX-FORGES,,,54481,,,,,,,,,,,,,,,,,,,2018-01-01,F,,,,,86.90D,NAFRev2,N,6.840046,48.511417,0.81,housenumber,1 Chemin de Couvay 54540 Saint-Maurice-aux-Forges,54481_0050_00001,G,1 CHEMIN DE COUVAY,
820307254,00012,82030725400012,O,2016-05-14,,,,2019-11-14T14:00:44,false,2,,12,,RUE,DE LA FORGE,54540,SAINT-MAURICE-AUX-FORGES,,,54481,,,,,,,,,,,,,,,,,,,2018-01-01,F,,,,,86.90D,NAFRev2,N,6.841581,48.51061,0.94,housenumber,12 Rue de la Forge 54540 Saint-Maurice-aux-Forges,54481_0001_00012,G,12 RUE DE LA FORGE,
820930600,00011,82093060000011,O,2016-06-14,,,,2019-11-14T14:00:44,true,1,,6,,RUE,DE LA FORGE,54540,SAINT-MAURICE-AUX-FORGES,,,54481,,,,,,,,,,,,,,,,,,,2016-06-14,A,DSBM,,,DSBM,74.90B,NAFRev2,N,6.844124,48.510056,0.94,housenumber,6 Rue de la Forge 54540 Saint-Maurice-aux-Forges,54481_0001_00006,G,6 RUE DE LA FORGE,
824794051,00014,82479405100014,O,2017-01-05,01,2020,,2022-08-29T10:15:39,true,1,,15,,RUE,DE LA FORGE,54540,SAINT-MAURICE-AUX-FORGES,,,54481,,,,,,,,,,,,,,,,,,,2017-01-05,A,AB SOLUTIONS FINANCEMENT,,,AB SOLUTIONS FINANCEMENT,66.19B,NAFRev2,O,6.842212,48.510356,0.94,housenumber,15 Rue de la Forge 54540 Saint-Maurice-aux-Forges,54481_0001_00015,G,15 RUE DE LA FORGE,
831260237,00019,83126023700019,O,2016-01-01,,,,2019-11-14T14:00:44,true,1,,26,,RUE,CLAIRBOIS,54540,SAINT-MAURICE-AUX-FORGES,,,54481,,,,,,,,,,,,,,,,,,,2016-01-01,A,,,,,68.20A,NAFRev2,N,6.851655,48.510361,0.88,housenumber,26 Rue du Clairbois 54540 Saint-Maurice-aux-Forges,54481_0003_00026,G,26 RUE DU CLAIRBOIS,
842706715,00013,84270671500013,O,2018-07-01,,,,2020-12-11T16:46:36,true,2,,12,,RUE,DE LA FORGE,54540,SAINT-MAURICE-AUX-FORGES,,,54481,,,,,,,,,,,,,,,,,,,2020-12-11,A,,,,,47.81Z,NAFRev2,N,6.841581,48.51061,0.94,housenumber,12 Rue de la Forge 54540 Saint-Maurice-aux-Forges,54481_0001_00012,G,12 RUE DE LA FORGE,
882816184,00015,88281618400015,O,2019-02-15,,,,2020-04-08T11:40:03,true,1,,3,,RUE,DU CLAIRBOIS,54540,SAINT-MAURICE-AUX-FORGES,,,54481,,,,,,,,,,,,,,,,,,,2019-02-15,A,,,,,47.99A,NAFRev2,N,6.847486,48.510133,0.94,housenumber,3 Rue du Clairbois 54540 Saint-Maurice-aux-Forges,54481_0003_00003,G,3 RUE DU CLAIRBOIS,
888076726,00015,88807672600015,O,2018-12-14,,,,2020-08-31T08:58:26,true,1,,,,,LA FORGE,54540,SAINT-MAURICE-AUX-FORGES,,,54481,,,,,,,,,,,,,,,,,,,2018-12-14,A,,,,,02.10Z,NAFRev2,N,6.842636,48.510248,0.92,street,Rue de la Forge 54540 Saint-Maurice-aux-Forges,54481_0001,G,RUE DE LA FORGE,
889044962,00013,88904496200013,O,2020-09-01,,,4321AB,2020-09-18T03:46:21,true,1,,15,,RUE,DU CLAIRBOIS,54540,SAINT-MAURICE-AUX-FORGES,,,54481,,,,,,,,,,,,,,,,,,,2020-09-01,A,,,,S-F ELEC,43.21A,NAFRev2,N,6.849432,48.510199,0.94,housenumber,15 Rue du Clairbois 54540 Saint-Maurice-aux-Forges,54481_0003_00015,G,15 RUE DU CLAIRBOIS,
889714010,00010,88971401000010,P,2020-09-14,,,,2021-05-10T08:06:56,true,3,[ND],[ND],[ND],[ND],[ND],[ND],SAINT-MAURICE-AUX-FORGES,,[ND],54481,[ND],[ND],,,[ND],[ND],[ND],[ND],[ND],[ND],,,[ND],,[ND],[ND],,,2021-05-10,A,[ND],[ND],[ND],[ND],53.20Z,NAFRev2,N,,,0,,,,,,
890807787,00019,89080778700019,P,2020-10-14,,,,2021-11-05T11:35:59,true,3,[ND],[ND],[ND],[ND],[ND],[ND],SAINT-MAURICE-AUX-FORGES,,[ND],54481,[ND],[ND],,,[ND],[ND],[ND],[ND],[ND],[ND],,,[ND],,[ND],[ND],,,2021-10-31,F,[ND],[ND],[ND],[ND],86.90F,NAFRev2,N,,,0,,,,,,
902296946,00012,90229694600012,O,2021-08-01,,,,2021-08-16T09:49:35,true,1,,,,LD,LA FORGE,54540,SAINT-MAURICE-AUX-FORGES,,,54481,,,,,,,,,,,,,,,,,,,2021-08-01,A,DOMAINE DE LA FORGE,,,,01.29Z,NAFRev2,N,6.842636,48.510248,0.92,street,Rue de la Forge 54540 Saint-Maurice-aux-Forges,54481_0001,G,RUE DE LA FORGE,
977462993,00014,97746299300014,P,2023-07-03,,,,2023-07-04T23:59:20,true,1,[ND],[ND],[ND],[ND],[ND],[ND],SAINT-MAURICE-AUX-FORGES,,[ND],54481,[ND],[ND],,,[ND],[ND],[ND],[ND],[ND],[ND],,,[ND],,[ND],[ND],,,2023-07-03,A,[ND],[ND],[ND],[ND],74.30Z,NAFRev2,N,,,0,,,,,,
