siren,nic,siret,statutDiffusionEtablissement,dateCreationEtablissement,trancheEffectifsEtablissement,anneeEffectifsEtablissement,activitePrincipaleRegistreMetiersEtablissement,dateDernierTraitementEtablissement,etablissementSiege,nombrePeriodesEtablissement,complementAdresseEtablissement,numeroVoieEtablissement,indiceRepetitionEtablissement,typeVoieEtablissement,libelleVoieEtablissement,codePostalEtablissement,libelleCommuneEtablissement,libelleCommuneEtrangerEtablissement,distributionSpecialeEtablissement,codeCommuneEtablissement,codeCedexEtablissement,libelleCedexEtablissement,codePaysEtrangerEtablissement,libellePaysEtrangerEtablissement,complementAdresse2Etablissement,numeroVoie2Etablissement,indiceRepetition2Etablissement,typeVoie2Etablissement,libelleVoie2Etablissement,codePostal2Etablissement,libelleCommune2Etablissement,libelleCommuneEtranger2Etablissement,distributionSpeciale2Etablissement,codeCommune2Etablissement,codeCedex2Etablissement,libelleCedex2Etablissement,codePaysEtranger2Etablissement,libellePaysEtranger2Etablissement,dateDebut,etatAdministratifEtablissement,enseigne1Etablissement,enseigne2Etablissement,enseigne3Etablissement,denominationUsuelleEtablissement,activitePrincipaleEtablissement,nomenclatureActivitePrincipaleEtablissement,caractereEmployeurEtablissement,longitude,latitude,geo_score,geo_type,geo_adresse,geo_id,geo_ligne,geo_l4,geo_l5
180092538,00891,18009253800891,O,2014-01-01,02,2020,,2022-08-29T09:04:07,false,1,CHEMIN DU PARC,,,LD,DE KERAUDEN,56730,SAINT-GILDAS-DE-RHUYS,,,56214,,,,,,,,,,,,,,,,,,,2014-01-01,A,ANGDM ACTIVITE SANITAIRE SOC RESIDENCE ST GILDAS,,,,55.20Z,NAFRev2,O,-2.835199,47.5081,0.79,street,Rue de Kéraudren 56730 Saint-Gildas-de-Rhuys,56214_0630,G,RUE DE KERAUDREN,
215602145,00017,21560214500017,O,1983-03-01,12,2020,,2022-08-29T09:07:48,true,4,,,,RUE,ST GOUSTAN,56730,SAINT-GILDAS-DE-RHUYS,,,56214,,,,,,,,,,,,,,,,,,,2008-01-01,A,MAIRIE,,,,84.11Z,NAFRev2,O,-2.834317,47.501147,0.83,street,Rue Saint Goustan 56730 Saint-Gildas-de-Rhuys,56214_1402,G,RUE SAINT GOUSTAN,
215602145,00025,21560214500025,O,1994-12-25,01,2020,,2022-08-29T09:07:48,false,2,MAIRIE,,,RUE,ST GOUSTAN,56730,SAINT-GILDAS-DE-RHUYS,,,56214,,,,,,,,,,,,,,,,,,,2008-01-01,A,SERVICE DU CAMPING DE KERVERT,,,,55.30Z,NAFRev2,N,-2.834317,47.501147,0.83,street,Rue Saint Goustan 56730 Saint-Gildas-de-Rhuys,56214_1402,G,RUE SAINT GOUSTAN,
215602145,00033,21560214500033,O,1994-12-25,NN,,,2019-11-14T14:00:45,false,2,MAIRIE,,,RUE,ST GOUSTAN,56730,SAINT-GILDAS-DE-RHUYS,,,56214,,,,,,,,,,,,,,,,,,,2008-01-01,A,SERVICE DE PORT AUX MOINES,,,,85.51Z,NAFRev2,N,-2.834317,47.501147,0.83,street,Rue Saint Goustan 56730 Saint-Gildas-de-Rhuys,56214_1402,G,RUE SAINT GOUSTAN,
215602145,00041,21560214500041,O,2000-01-01,NN,,,2019-11-14T14:00:45,false,4,,,,,MAIRIE,56730,SAINT-GILDAS-DE-RHUYS,,,56214,,,,,,,,,,,,,,,,,,,2010-01-21,F,LOTISSEMENT COMMUNAL,,,,42.99Z,NAFRev2,N,-2.843474,47.510776,0.38,locality,Domaine de la Baie d'Abraham 56730 Saint-Gildas-de-Rhuys,56214_A027,G,DOMAINE DE LA BAIE D ABRAHAM,
215602145,00058,21560214500058,O,2010-03-25,,,,2023-07-05T15:30:29,false,2,MAIRIE,,,RUE,SAINT GOUSTAN,56730,SAINT-GILDAS-DE-RHUYS,,,56214,,,,,,,,,,,,,,,,,,,2013-04-25,A,AMENAGEMENT CENTRE BOURG,,,,42.99Z,NAFRev2,N,-2.834317,47.501147,0.95,street,Rue Saint Goustan 56730 Saint-Gildas-de-Rhuys,56214_1402,G,RUE SAINT GOUSTAN,
215602145,00066,21560214500066,O,2012-02-16,11,2020,,2022-08-29T09:07:48,false,3,MAIRIE,,,RUE,ST GOUSTAN,56730,SAINT-GILDAS-DE-RHUYS,,,56214,,,,,,,,,,,,,,,,,,,2015-01-01,A,MAISON DE L'ENFANCE,,,,88.91A,NAFRev2,O,-2.834317,47.501147,0.83,street,Rue Saint Goustan 56730 Saint-Gildas-de-Rhuys,56214_1402,G,RUE SAINT GOUSTAN,
215602145,00074,21560214500074,O,2017-02-09,,,,2023-07-05T15:32:31,false,1,,,,RUE,ST GOUSTAN,56730,SAINT-GILDAS-DE-RHUYS,,,56214,,,,,,,,,,,,,,,,,,,2017-02-09,A,LOTISSEMENT COMMUNAL,,,,42.99Z,NAFRev2,N,-2.834317,47.501147,0.83,street,Rue Saint Goustan 56730 Saint-Gildas-de-Rhuys,56214_1402,G,RUE SAINT GOUSTAN,
220300016,00023,22030001600023,O,1968-06-17,NN,,,2019-11-14T14:00:45,false,3,,,,,LA SALINE,56730,SAINT-GILDAS-DE-RHUYS,,,56214,,,,,,,,,,,,,,,,,,,2008-01-01,A,CENTRE DE VACANCES,,,,55.20Z,NAFRev2,N,-2.852239,47.525734,0.94,street,la Saline 56730 Saint-Gildas-de-Rhuys,56214_j62cqc,G,LA SALINE,
265601666,00018,26560166600018,O,1983-03-01,01,2020,,2022-08-29T09:10:34,true,4,MAIRIE,,,RUE,ST GOUSTAN,56730,SAINT-GILDAS-DE-RHUYS,,,56214,,,,,,,,,,,,,,,,,,,2013-01-13,A,CCAS,,,,88.99B,NAFRev2,O,-2.834317,47.501147,0.83,street,Rue Saint Goustan 56730 Saint-Gildas-de-Rhuys,56214_1402,G,RUE SAINT GOUSTAN,
265601666,00026,26560166600026,O,1996-07-08,,,,2019-11-14T14:00:45,false,3,MAIRIE,,,RUE,ST GOUSTAN,56730,SAINT-GILDAS-DE-RHUYS,,,56214,,,,,,,,,,,,,,,,,,,2008-01-01,A,SERVICE AIDE MENAGERE A DOMICILE,,,,88.10A,NAFRev2,N,-2.834317,47.501147,0.83,street,Rue Saint Goustan 56730 Saint-Gildas-de-Rhuys,56214_1402,G,RUE SAINT GOUSTAN,
265601666,00034,26560166600034,O,2004-01-01,03,2020,,2022-08-29T09:10:34,false,3,,,,RUE,SAINT GOUSTAN,56730,SAINT-GILDAS-DE-RHUYS,,,56214,,,,,,,,,,,,,,,,,,,2008-01-01,A,MAISON ACCUEIL PERSONNES AGEES,,,,87.10A,NAFRev2,N,-2.834317,47.501147,0.95,street,Rue Saint Goustan 56730 Saint-Gildas-de-Rhuys,56214_1402,G,RUE SAINT GOUSTAN,
300622297,00053,30062229700053,O,1996-06-01,NN,,,2019-11-14T14:00:45,true,1,,,,PL,MONSEIGNEUR ROPERT,56730,SAINT-GILDAS-DE-RHUYS,,,56214,,,,,,,,,,,,,,,,,,,2002-02-05,F,,,,,55.4B,NAF1993,N,-2.83967,47.500259,0.87,street,Place Monseigneur Ropert 56730 Saint-Gildas-de-Rhuys,56214_1095,G,PLACE MONSEIGNEUR ROPERT,
301745667,00016,30174566700016,O,,NN,,,2019-11-14T14:00:45,true,1,,,,RTE,DE KERAUDRAIN,56730,SAINT-GILDAS-DE-RHUYS,,,56214,,,,,,,,,,,,,,,,,,,1995-03-31,F,,,,,70.2C,NAF1993,N,-2.835199,47.5081,0.65,street,Rue de Kéraudren 56730 Saint-Gildas-de-Rhuys,56214_0630,G,RUE DE KERAUDREN,
304936610,00068,30493661000068,O,2012-05-23,NN,,,2021-02-23T10:36:57,true,2,,,,RUE,DU PUITS DAVID,56730,SAINT-GILDAS-DE-RHUYS,,,56214,,,,,,,,,,,,,,,,,,,2012-09-24,A,,,,,47.11C,NAFRev2,N,-2.838569,47.502875,0.75,street,Chemin du Puits David 56730 Saint-Gildas-de-Rhuys,56214_1237,G,CHEMIN DU PUITS DAVID,
305117251,00077,30511725100077,O,2001-04-01,NN,,,2019-11-14T14:00:45,true,1,,1,,RTE,DE COAT ER SCOUFF,56730,SAINT-GILDAS-DE-RHUYS,,,56214,,,,,,,,,,,,,,,,,,,2001-07-30,F,,,,,51.1T,NAF1993,N,-2.827888,47.520643,0.84,housenumber,1 Route de Coat Er Scouffe 56730 Saint-Gildas-de-Rhuys,56214_0164_00001,G,1 ROUTE DE COAT ER SCOUFFE,
305485302,00015,30548530200015,O,,NN,,,2019-11-14T14:00:45,true,1,,,,LD,KENVOR,56730,SAINT-GILDAS-DE-RHUYS,,,56214,,,,,,,,,,,,,,,,,,,1986-12-25,F,,,,,86.10,NAP,N,,,0,,,,,,
306229717,00013,30622971700013,O,1976-01-01,NN,,,2019-11-14T14:00:45,true,1,,17,,AV,DU GAL DE GAULLE,56730,SAINT-GILDAS-DE-RHUYS,,,56214,,,,,,,,,,,,,,,,,,,2000-01-30,F,,,,,70.2C,NAF1993,N,-2.838018,47.50038,0.75,housenumber,17 Rue du Général de Gaulle 56730 Saint-Gildas-de-Rhuys,56214_0365_00017,G,17 RUE DU GENERAL DE GAULLE,
306452855,00019,30645285500019,O,,NN,,,2019-11-14T14:00:45,true,1,,,,RUE,DE ST GOUSTAN,56730,SAINT-GILDAS-DE-RHUYS,,,56214,,,,,,,,,,,,,,,,,,,1995-03-31,F,,,,,74.2A,NAF1993,N,-2.834317,47.501147,0.78,street,Rue Saint Goustan 56730 Saint-Gildas-de-Rhuys,56214_1402,G,RUE SAINT GOUSTAN,
306949736,00012,30694973600012,O,1996-06-01,NN,,,2019-11-14T14:00:45,true,3,,,,PL,MONSEIGNEUR ROPERT,56730,SAINT-GILDAS-DE-RHUYS,,,56214,,,,,,,,,,,,,,,,,,,2008-01-01,A,,,,,68.20A,NAFRev2,N,-2.83967,47.500259,0.87,street,Place Monseigneur Ropert 56730 Saint-Gildas-de-Rhuys,56214_1095,G,PLACE MONSEIGNEUR ROPERT,
307063073,00026,30706307300026,O,2000-01-01,NN,,,2019-11-14T14:00:45,true,3,,71,,RTE,DE BRAUD MONT,56730,SAINT-GILDAS-DE-RHUYS,,,56214,,,,,,,,,,,,,,,,,,,2008-01-01,A,,,,,90.03A,NAFRev2,N,-2.847439,47.50066,0.61,housenumber,71 Route du Grand Mont 56730 Saint-Gildas-de-Rhuys,56214_0499_00071,G,71 ROUTE DU GRAND MONT,
307793992,00040,30779399200040,O,1988-01-01,NN,,,2019-11-14T14:00:45,false,3,,1,,CHE,DU RANO,56730,SAINT-GILDAS-DE-RHUYS,,,56214,,,,,,,,,,,,,,,,,,,2004-06-29,F,,,,,70.2A,NAFRev1,N,-2.843848,47.512376,0.67,street,Chemin du Rano 56730 Saint-Gildas-de-Rhuys,56214_1261,G,CHEMIN DU RANO,
309012862,00012,30901286200012,O,1977-01-01,NN,,,2023-07-03T20:42:31,true,2,,,,,LE KERVERT,56730,SAINT-GILDAS-DE-RHUYS,,,56214,,,,,,,,,,,,,,,,,,,1990-12-26,F,,,,,,,,-2.858581,47.522809,0.76,locality,Anse de Kervert 56730 Saint-Gildas-de-Rhuys,56214_B142,G,ANSE DE KERVERT,
309068104,00020,30906810400020,O,1988-01-01,NN,,,2019-11-14T14:00:45,true,4,,20,,RTE,DE PEN PALUD,56730,SAINT-GILDAS-DE-RHUYS,,,56214,,,,,,,,,,,,,,,,,,,2008-10-31,F,,,,,68.20A,NAFRev2,N,-2.835234,47.511473,0.86,housenumber,20 Route de Pen Palud 56730 Saint-Gildas-de-Rhuys,56214_1131_00020,G,20 ROUTE DE PEN PALUD,
309357432,00033,30935743200033,O,1987-02-01,NN,,,2019-11-14T14:00:45,true,5,,,,,ZA DE KERSAUX,56730,SAINT-GILDAS-DE-RHUYS,,,56214,,,,,,,,,,,,,,,,,,,2008-01-31,F,,,,,43.22A,NAFRev2,O,-3.8986561,47.8583859,0.72,poi.stadium,Stade de Kersaux Concarneau,https://osm.org/way/40668150,G,,
309462810,00040,30946281000040,O,2004-09-03,NN,,,2019-11-14T14:00:45,false,2,,,,RUE,DES ILIENS,56730,SAINT-GILDAS-DE-RHUYS,,,56214,,,,,,,,,,,,,,,,,,,2004-09-30,F,,,,,,,N,-2.82169,47.491548,0.95,street,Rue des Iliens 56730 Saint-Gildas-de-Rhuys,56214_0590,G,RUE DES ILIENS,
309882553,00014,30988255300014,O,,NN,,,2019-11-14T14:00:45,true,1,,10,,,BOT PENAL,56730,SAINT-GILDAS-DE-RHUYS,,,56214,,,,,,,,,,,,,,,,,,,1992-12-31,F,,,,,92.3B,NAF1993,N,-2.84187,47.527385,0.72,locality,Rue Bot Penal 56730 Saint-Gildas-de-Rhuys,56214_0035,G,RUE BOT PENAL,
309890879,00054,30989087900054,O,1987-05-01,01,2020,,2022-08-29T09:13:15,true,4,,41,,RUE,GENERAL DE GAULLE,56730,SAINT-GILDAS-DE-RHUYS,,,56214,,,,,,,,,,,,,,,,,,,2008-01-01,A,,,,,56.30Z,NAFRev2,O,-2.839292,47.500521,0.95,housenumber,41 Rue du Général de Gaulle 56730 Saint-Gildas-de-Rhuys,56214_0365_00041,G,41 RUE DU GENERAL DE GAULLE,
310228028,00018,31022802800018,O,1900-01-01,NN,,,2019-11-14T14:00:45,true,3,,,,LD,LES KORRIGANS,56730,SAINT-GILDAS-DE-RHUYS,,,56214,,,,,,,,,,,,,,,,,,,2008-01-01,A,,,,,68.20B,NAFRev2,N,-2.806662,47.509221,0.92,street,Zone Artisanale les Korrigans 56730 Saint-Gildas-de-Rhuys,56214_ikfgmw,G,ZONE ARTISANALE LES KORRIGANS,
310977392,00037,31097739200037,O,1998-01-01,,,,2019-11-14T14:00:45,false,2,,20,,RTE,DE KERNOLIVES,56730,SAINT-GILDAS-DE-RHUYS,,,56214,,,,,,,,,,,,,,,,,,,2000-07-03,F,,,,,,,,-2.81975,47.494651,0.87,housenumber,20 Route de Kernolives 56730 Saint-Gildas-de-Rhuys,56214_0899_00020,G,20 ROUTE DE KERNOLIVES,
311406326,00026,31140632600026,O,2001-08-01,00,2020,9524ZZ,2023-02-22T19:32:49,true,7,,,,,LARGUEVEN,56730,SAINT-GILDAS-DE-RHUYS,,,56214,,,,,,,,,,,,,,,,,,,2022-10-31,F,MUSEE DES ARTS ET METIERS,,,,91.02Z,NAFRev2,N,-2.83864,47.531971,0.95,street,Larguéven 56730 Saint-Gildas-de-Rhuys,56214_74fc59,G,LARGUEVEN,
312380058,00130,31238005800130,O,1994-07-01,NN,,,2019-11-14T14:00:45,false,2,,1,,RUE,DES VENETES,56730,SAINT-GILDAS-DE-RHUYS,,,56214,,,,,,,,,,,,,,,,,,,1994-09-01,F,,,,,,,,-2.839941,47.500649,0.95,housenumber,1 Rue des Vénétes 56730 Saint-Gildas-de-Rhuys,56214_1415_00001,G,1 RUE DES VENETES,
313141871,00035,31314187100035,O,1998-02-07,NN,,,2019-11-14T14:00:45,false,3,,12,,CHE,DU GOHVRASS,56730,SAINT-GILDAS-DE-RHUYS,,,56214,,,,,,,,,,,,,,,,,,,2005-07-01,F,,,,,85.1C,NAFRev1,N,-2.84573,47.50762,0.67,housenumber,12 Chemin du Goh Vras 56730 Saint-Gildas-de-Rhuys,56214_0372_00012,G,12 CHEMIN DU GOH VRAS,
313141871,00050,31314187100050,O,2005-07-01,,,,2020-10-06T08:54:11,false,3,,52,,CHE,DU GOHVRASS,56730,SAINT-GILDAS-DE-RHUYS,,,56214,,,,,,,,,,,,,,,,,,,2009-09-10,F,,,,,86.21Z,NAFRev2,N,-2.845952,47.511394,0.67,housenumber,52 Chemin du Goh Vras 56730 Saint-Gildas-de-Rhuys,56214_0372_00052,G,52 CHEMIN DU GOH VRAS,
313243172,00035,31324317200035,O,1994-12-01,NN,,,2019-11-14T14:00:45,false,4,,11,,RUE,DE ST GOUSTAN,56730,SAINT-GILDAS-DE-RHUYS,,,56214,,,,,,,,,,,,,,,,,,,2000-09-01,F,OFFICE IMMOBILIER DE ST GILDAS,,,,70.3A,NAF1993,O,-2.835261,47.500626,0.8,housenumber,11 Rue Saint Goustan 56730 Saint-Gildas-de-Rhuys,56214_1402_00011,G,11 RUE SAINT GOUSTAN,
313476160,00012,31347616000012,O,1978-01-01,NN,,,2019-11-14T14:00:45,true,4,,,,,LES GOVELINS,56730,SAINT-GILDAS-DE-RHUYS,,,56214,,,,,,,,,,,,,,,,,,,2003-12-31,F,,,,,70.2C,NAFRev1,N,-2.841993,47.512915,0.85,street,Route des Govelins le Pradig 56730 Saint-Gildas-de-Rhuys,56214_B132,G,ROUTE DES GOVELINS LE PRADIG,
313593915,00025,31359391500025,O,,NN,,,2019-11-14T14:00:45,true,1,,2,,RUE,DU TOULBAZ,56730,SAINT-GILDAS-DE-RHUYS,,,56214,,,,,,,,,,,,,,,,,,,1991-10-25,F,,,,,81.11,NAP,N,-2.831742,47.498149,0.58,housenumber,2 Rue du Moulin 56730 Saint-Gildas-de-Rhuys,56214_1110_00002,G,2 RUE DU MOULIN,
313763955,00017,31376395500017,O,1978-01-01,,,,2019-11-14T14:00:45,true,1,,,,,CAMPING DU KERUERT,56730,SAINT-GILDAS-DE-RHUYS,,,56214,,,,,,,,,,,,,,,,,,,1999-12-31,F,,,,,55.2C,NAF1993,N,-2.804205,47.490774,0.51,locality,Pres du Camping St Jacques 56730 Saint-Gildas-de-Rhuys,56214_B115,G,PRES DU CAMPING ST JACQUES,
314451196,00013,31445119600013,O,1978-01-01,00,2020,,2022-08-29T09:14:34,true,5,,,,RUE,ST GOUSTAN,56730,SAINT-GILDAS-DE-RHUYS,,,56214,,,,,,,,,,,,,,,,,,,2008-07-04,A,,,,,93.12Z,NAFRev2,O,-2.834317,47.501147,0.83,street,Rue Saint Goustan 56730 Saint-Gildas-de-Rhuys,56214_1402,G,RUE SAINT GOUSTAN,
314589052,00054,31458905200054,O,1988-01-15,,,,2019-11-14T14:00:45,false,4,,13,,RTE,DE GOAHSSINY,56730,SAINT-GILDAS-DE-RHUYS,,,56214,,,,,,,,,,,,,,,,,,,1992-08-01,F,,,,,45.2J,NAF1993,N,-2.826897,47.495616,0.87,interpolation,13 Route de Goahssiny 56730 Saint-Gildas-de-Rhuys,,G,11 ROUTE DE GOAHSSINY,
314589052,00062,31458905200062,O,1992-08-01,NN,,,2019-11-14T14:00:45,false,6,,,,,ZA KERSAUX,56730,SAINT-GILDAS-DE-RHUYS,,,56214,,,,,,,,,,,,,,,,,,,2010-12-08,F,,,,,43.91B,NAFRev2,N,,,0,,,,,,
314851247,00028,31485124700028,O,1988-06-25,NN,,,2019-11-14T14:00:45,false,5,,34,,RUE,DU GEN DE GAULLE,56730,SAINT-GILDAS-DE-RHUYS,,,56214,,,,,,,,,,,,,,,,,,,2003-02-12,F,LE 34,,,,70.2A,NAFRev1,N,-2.838508,47.500396,0.88,housenumber,34 Rue du Général de Gaulle 56730 Saint-Gildas-de-Rhuys,56214_0365_00034,G,34 RUE DU GENERAL DE GAULLE,
315036624,00031,31503662400031,O,2002-06-01,NN,,,2019-11-14T14:00:45,false,2,,,,,LE KERVERT,56730,SAINT-GILDAS-DE-RHUYS,,,56214,,,,,,,,,,,,,,,,,,,2002-06-30,F,,,,,,,,-2.858581,47.522809,0.76,locality,Anse de Kervert 56730 Saint-Gildas-de-Rhuys,56214_B142,G,ANSE DE KERVERT,
316193762,00010,31619376200010,O,,NN,,,2019-11-14T14:00:45,true,1,,,,,,56730,SAINT-GILDAS-DE-RHUYS,,,56214,,,,,,,,,,,,,,,,,,,,F,,,,,67.04,NAP,N,,,0,,,,,,
316573872,00025,31657387200025,O,1998-07-03,,,,2019-11-14T14:00:45,true,1,,2,,RES,KER VELIN,56730,SAINT-GILDAS-DE-RHUYS,,,56214,,,,,,,,,,,,,,,,,,,1998-08-26,F,,,,,15.8B,NAF1993,N,-2.840254,47.512791,0.83,housenumber,2 Residence Ker Velin 56730 Saint-Gildas-de-Rhuys,56214_b624_00002,G,2 RESIDENCE KER VELIN,
316874866,00023,31687486600023,O,1980-06-05,NN,,4322AZ,2019-11-14T14:00:45,true,4,,,,,ZONE ARTISANALE,56730,SAINT-GILDAS-DE-RHUYS,,,56214,,,,,,,,,,,,,,,,,,,2017-11-30,F,,,,,43.22A,NAFRev2,N,-2.806662,47.509221,0.92,street,Zone Artisanale les Korrigans 56730 Saint-Gildas-de-Rhuys,56214_ikfgmw,G,ZONE ARTISANALE LES KORRIGANS,
317379006,00016,31737900600016,O,,NN,,,2019-11-14T14:00:45,true,1,,35,,RUE,DU GENERAL DE GAULLE,56730,SAINT-GILDAS-DE-RHUYS,,,56214,,,,,,,,,,,,,,,,,,,1992-06-01,F,,,,,74.2C,NAF1993,N,-2.839035,47.500524,0.95,housenumber,35 Rue du Général de Gaulle 56730 Saint-Gildas-de-Rhuys,56214_0365_00035,G,35 RUE DU GENERAL DE GAULLE,
317446359,00034,31744635900034,O,2002-09-25,NN,,,2019-11-14T14:00:45,true,4,,11,,CHE,DE GOHVRAS,56730,SAINT-GILDAS-DE-RHUYS,,,56214,,,,,,,,,,,,,,,,,,,2003-08-31,F,,,,,70.2A,NAFRev1,N,-2.813952,47.491593,0.6,housenumber,11 Chemin de Gorlevenan 56730 Saint-Gildas-de-Rhuys,56214_0376_00011,G,11 CHEMIN DE GORLEVENAN,
317489029,00064,31748902900064,O,1998-10-01,,,,2019-11-14T14:00:45,true,1,,16,,RTE,SARZEAU,56730,SAINT-GILDAS-DE-RHUYS,,,56214,,,,,,,,,,,,,,,,,,,2000-12-31,F,,,,,74.8F,NAF1993,N,-2.830813,47.50247,0.83,housenumber,16 Route de Sarzeau 56730 Saint-Gildas-de-Rhuys,56214_1404_00016,G,16 ROUTE DE SARZEAU,
317688836,00012,31768883600012,O,,NN,,,2019-11-14T14:00:45,true,1,,,,,ZONE ARTISANALE KERVAUX,56730,SAINT-GILDAS-DE-RHUYS,,,56214,,,,,,,,,,,,,,,,,,,1990-12-31,F,,,,,55.71,NAP,N,-2.806662,47.509221,0.64,street,Zone Artisanale les Korrigans 56730 Saint-Gildas-de-Rhuys,56214_ikfgmw,G,ZONE ARTISANALE LES KORRIGANS,
318110608,00029,31811060800029,O,2011-03-07,,,,2022-08-09T04:01:10,true,2,,2,B,CHE,DE LA LAGUNE,56730,SAINT-GILDAS-DE-RHUYS,,,56214,,,,,,,,,,,,,,,,,,,2022-03-31,F,,,,,68.20B,NAFRev2,N,-2.839176,47.511525,0.76,housenumber,2bis Chemin de la Lagune 56730 Saint-Gildas-de-Rhuys,56214_1032_00002_bis,G,2BIS CHEMIN DE LA LAGUNE,
319126561,00012,31912656100012,O,,NN,,,2019-11-14T14:00:45,true,1,,41,,RUE,GENERAL DE GAULLE,56730,SAINT-GILDAS-DE-RHUYS,,,56214,,,,,,,,,,,,,,,,,,,1987-12-22,F,,,,,81.21,NAP,N,-2.839292,47.500521,0.95,housenumber,41 Rue du Général de Gaulle 56730 Saint-Gildas-de-Rhuys,56214_0365_00041,G,41 RUE DU GENERAL DE GAULLE,
319555090,00012,31955509000012,O,,,,,2019-11-14T14:00:45,true,1,,,,PL,DE L EGLISE,56730,SAINT-GILDAS-DE-RHUYS,,,56214,,,,,,,,,,,,,,,,,,,1984-12-25,F,,,,,62.11,NAP,N,-2.846589,47.518881,0.46,street,Impasse de l’Etang 56730 Saint-Gildas-de-Rhuys,56214_0335,G,IMPASSE DE L ETANG,
320732746,00047,32073274600047,P,2019-05-01,,,,2023-03-04T12:50:26,false,1,[ND],[ND],[ND],[ND],[ND],[ND],SAINT-GILDAS-DE-RHUYS,,[ND],56214,[ND],[ND],,,[ND],[ND],[ND],[ND],[ND],[ND],,,[ND],,[ND],[ND],,,2019-05-01,A,[ND],[ND],[ND],[ND],68.20A,NAFRev2,N,,,0,,,,,,
320844228,00017,32084422800017,O,,,,,2019-11-14T14:00:45,true,1,,,,,GOUEZAN,56730,SAINT-GILDAS-DE-RHUYS,,,56214,,,,,,,,,,,,,,,,,,,1985-12-25,F,,,,,55.71,NAP,N,-2.8152358,47.5151131,0.88,poi.residential,Gouezan (Zone résidentielle) Saint-Gildas-de-Rhuys,https://osm.org/way/231310501,G,,
322712738,00036,32271273800036,O,,NN,,,2019-11-14T14:00:45,true,1,,34,,RUE,DU GENERAL DE GAULLE,56730,SAINT-GILDAS-DE-RHUYS,,,56214,,,,,,,,,,,,,,,,,,,1997-06-30,F,,,,,52.4Z,NAF1993,O,-2.838508,47.500396,0.95,housenumber,34 Rue du Général de Gaulle 56730 Saint-Gildas-de-Rhuys,56214_0365_00034,G,34 RUE DU GENERAL DE GAULLE,
323331942,00058,32333194200058,O,2023-04-14,,,,2023-05-10T12:19:47,true,1,,,,,MUSEE DE LARGUEVEN,56730,SAINT-GILDAS-DE-RHUYS,,,56214,,,,,,,,,,,,,,,,,,,2023-04-14,A,,,,BROCANTE,47.79Z,NAFRev2,N,-2.838154,47.532261,0.72,street,Rue de Largueven 56730 Saint-Gildas-de-Rhuys,56214_1042,G,RUE DE LARGUEVEN,
323358143,00044,32335814300044,O,2003-04-05,,,,2019-11-14T14:00:45,true,2,,39,,RUE,DU GENERAL DE GAULLE,56730,SAINT-GILDAS-DE-RHUYS,,,56214,,,,,,,,,,,,,,,,,,,2003-08-30,F,,,,,,,,-2.839221,47.500491,0.95,housenumber,39 Rue du Général de Gaulle 56730 Saint-Gildas-de-Rhuys,56214_0365_00039,G,39 RUE DU GENERAL DE GAULLE,
323498980,00016,32349898000016,O,,NN,,,2019-11-14T14:00:45,true,1,,,,,BOTPENAL,56730,SAINT-GILDAS-DE-RHUYS,,,56214,,,,,,,,,,,,,,,,,,,1995-10-01,F,,,,,85.1G,NAF1993,N,-2.826808,47.520911,0.94,street,Botpenal 56730 Saint-Gildas-de-Rhuys,56214_gc80e8,G,BOTPENAL,
323653501,00011,32365350100011,O,1982-01-01,NN,,,2019-11-14T14:00:45,true,4,,5,,RUE,DU GAL DE GAULLE,56730,SAINT-GILDAS-DE-RHUYS,,,56214,,,,,,,,,,,,,,,,,,,2006-05-31,F,,,,,15.8C,NAFRev1,O,-2.837346,47.500239,0.91,housenumber,5 Rue du Général de Gaulle 56730 Saint-Gildas-de-Rhuys,56214_0365_00005,G,5 RUE DU GENERAL DE GAULLE,
323786830,00014,32378683000014,O,,,,,2019-11-14T14:00:45,true,1,,10,,,VILLAGE DE LARGUEVEN,56730,SAINT-GILDAS-DE-RHUYS,,,56214,,,,,,,,,,,,,,,,,,,1997-03-31,F,,,,,15.8C,NAF1993,N,-2.837818,47.532599,0.66,housenumber,10 Rue de Largueven 56730 Saint-Gildas-de-Rhuys,56214_1042_00010,G,10 RUE DE LARGUEVEN,
323878587,00043,32387858700043,O,2022-06-06,,,,2023-04-11T08:42:39,true,2,,21,,,CHEMIN DES GABELOUS,56730,SAINT-GILDAS-DE-RHUYS,,,56214,,,,,,,,,,,,,,,,,,,2023-01-01,F,,,,DGCONSULTANT,71.12B,NAFRev2,N,-2.829668,47.495174,0.95,housenumber,21 Chemin des Gabelous 56730 Saint-Gildas-de-Rhuys,56214_0358_00021,G,21 CHEMIN DES GABELOUS,
324477959,00013,32447795900013,O,,NN,,,2019-11-14T14:00:45,true,1,,,,CHE,DU PUITS DAVID,56730,SAINT-GILDAS-DE-RHUYS,,,56214,,,,,,,,,,,,,,,,,,,1996-05-13,F,,,,,45.2V,NAF1993,O,-2.838569,47.502875,0.85,street,Chemin du Puits David 56730 Saint-Gildas-de-Rhuys,56214_1237,G,CHEMIN DU PUITS DAVID,
324899095,00032,32489909500032,O,1994-05-01,NN,,,2019-11-14T14:00:45,true,3,KERAUDRIN,,,IMP,PRAT AR MENER,56730,SAINT-GILDAS-DE-RHUYS,,,56214,,,,,,,,,,,,,,,,,,,2005-12-31,F,,,,,74.8K,NAFRev1,N,-2.832665,47.505868,0.74,street,Chemin de Prat Ar Mener 56730 Saint-Gildas-de-Rhuys,56214_1226,G,CHEMIN DE PRAT AR MENER,
325325090,00026,32532509000026,O,1988-07-01,NN,,,2019-11-14T14:00:45,false,3,,23,,RUE,GENERAL DE GAULLE,56730,SAINT-GILDAS-DE-RHUYS,,,56214,,,,,,,,,,,,,,,,,,,2002-09-30,F,,,,,36.6E,NAF1993,N,-2.838288,47.500429,0.95,housenumber,23 Rue du Général de Gaulle 56730 Saint-Gildas-de-Rhuys,56214_0365_00023,G,23 RUE DU GENERAL DE GAULLE,
325908481,00030,32590848100030,O,2021-07-22,,,,2022-03-05T12:52:14,true,1,,11,,RUE,SAINT GOUSTAN,56730,SAINT-GILDAS-DE-RHUYS,,,56214,,,,,,,,,,,,,,,,,,,2021-07-22,A,,,,LE MEDREVIL,47.11B,NAFRev2,N,-2.835261,47.500626,0.95,housenumber,11 Rue Saint Goustan 56730 Saint-Gildas-de-Rhuys,56214_1402_00011,G,11 RUE SAINT GOUSTAN,
325908622,00013,32590862200013,O,1982-10-29,NN,,,2019-11-14T14:00:45,false,4,,16,,ALL,GUEPRATTE,56730,SAINT-GILDAS-DE-RHUYS,,,56214,,,,,,,,,,,,,,,,,,,2003-05-28,F,,,,,70.1D,NAFRev1,N,-2.826043,47.491341,0.84,housenumber,16 Allee Guepratte 56730 Saint-Gildas-de-Rhuys,56214_0571_00016,G,16 ALLEE GUEPRATTE,
325934859,00035,32593485900035,P,2005-01-17,NN,,4332AA,2022-04-20T15:53:43,false,5,[ND],[ND],[ND],[ND],[ND],[ND],SAINT-GILDAS-DE-RHUYS,,[ND],56214,[ND],[ND],,,[ND],[ND],[ND],[ND],[ND],[ND],,,[ND],,[ND],[ND],,,2014-01-06,F,[ND],[ND],[ND],[ND],43.32A,NAFRev2,N,,,0,,,,,,
325934859,00043,32593485900043,P,2010-09-30,,,,2022-04-02T13:06:51,false,1,[ND],[ND],[ND],[ND],[ND],[ND],SAINT-GILDAS-DE-RHUYS,,[ND],56214,[ND],[ND],,,[ND],[ND],[ND],[ND],[ND],[ND],,,[ND],,[ND],[ND],,,2010-09-30,A,[ND],[ND],[ND],[ND],01.49Z,NAFRev2,N,,,0,,,,,,
325934859,00050,32593485900050,P,2014-01-06,,,3109BA,2022-04-02T13:06:51,true,2,[ND],[ND],[ND],[ND],[ND],[ND],SAINT-GILDAS-DE-RHUYS,,[ND],56214,[ND],[ND],,,[ND],[ND],[ND],[ND],[ND],[ND],,,[ND],,[ND],[ND],,,2022-03-22,A,[ND],[ND],[ND],[ND],31.09B,NAFRev2,N,,,0,,,,,,
326097607,00062,32609760700062,O,1995-10-01,NN,,,2019-11-14T14:00:45,false,4,,12,,RTE,GOAHSSIGNY,56730,SAINT-GILDAS-DE-RHUYS,,,56214,,,,,,,,,,,,,,,,,,,1998-05-16,F,,,,,85.1G,NAF1993,N,-2.827373,47.495792,0.7,housenumber,12 Route de Goahssiny 56730 Saint-Gildas-de-Rhuys,56214_0371_00012,G,12 ROUTE DE GOAHSSINY,
326254489,00056,32625448900056,O,2007-09-06,,,,2019-11-14T14:00:45,false,3,,29,B,RUE,DU PARGO LE GOUEZAN,56730,SAINT-GILDAS-DE-RHUYS,,,56214,,,,,,,,,,,,,,,,,,,2008-08-25,F,,,,,46.18Z,NAFRev2,N,-2.813252,47.515439,0.56,housenumber,29bis Rue du Pargo 56730 Saint-Gildas-de-Rhuys,56214_1128_00029_bis,G,29BIS RUE DU PARGO,
326674660,00013,32667466000013,O,1983-01-01,NN,,,2019-11-14T14:00:45,true,4,,,,LD,KERVERT,56730,SAINT-GILDAS-DE-RHUYS,,,56214,,,,,,,,,,,,,,,,,,,2004-09-02,F,,,,,55.3A,NAFRev1,O,-2.858581,47.522809,0.92,locality,Anse de Kervert 56730 Saint-Gildas-de-Rhuys,56214_B142,G,ANSE DE KERVERT,
326833399,00024,32683339900024,O,1985-10-11,01,2020,1392ZD,2022-08-29T09:19:30,true,4,,,,LD,LE NET,56730,SAINT-GILDAS-DE-RHUYS,,,56214,,,,,,,,,,,,,,,,,,,2008-01-01,A,,,,,33.15Z,NAFRev2,O,-2.843097,47.504649,0.65,street,Lotissement le Pre Neuf 56730 Saint-Gildas-de-Rhuys,56214_B180,G,LOTISSEMENT LE PRE NEUF,