siren,nic,siret,statutDiffusionEtablissement,dateCreationEtablissement,trancheEffectifsEtablissement,anneeEffectifsEtablissement,activitePrincipaleRegistreMetiersEtablissement,dateDernierTraitementEtablissement,etablissementSiege,nombrePeriodesEtablissement,complementAdresseEtablissement,numeroVoieEtablissement,indiceRepetitionEtablissement,typeVoieEtablissement,libelleVoieEtablissement,codePostalEtablissement,libelleCommuneEtablissement,libelleCommuneEtrangerEtablissement,distributionSpecialeEtablissement,codeCommuneEtablissement,codeCedexEtablissement,libelleCedexEtablissement,codePaysEtrangerEtablissement,libellePaysEtrangerEtablissement,complementAdresse2Etablissement,numeroVoie2Etablissement,indiceRepetition2Etablissement,typeVoie2Etablissement,libelleVoie2Etablissement,codePostal2Etablissement,libelleCommune2Etablissement,libelleCommuneEtranger2Etablissement,distributionSpeciale2Etablissement,codeCommune2Etablissement,codeCedex2Etablissement,libelleCedex2Etablissement,codePaysEtranger2Etablissement,libellePaysEtranger2Etablissement,dateDebut,etatAdministratifEtablissement,enseigne1Etablissement,enseigne2Etablissement,enseigne3Etablissement,denominationUsuelleEtablissement,activitePrincipaleEtablissement,nomenclatureActivitePrincipaleEtablissement,caractereEmployeurEtablissement,longitude,latitude,geo_score,geo_type,geo_adresse,geo_id,geo_ligne,geo_l4,geo_l5
175706613,00494,17570661300494,O,1981-06-23,NN,,,2019-11-14T14:00:46,false,4,,1,,RUE,DES MOULINS,57920,KEDANGE-SUR-CANNER,,,57358,,,,,,,,,,,,,,,,,,,2009-12-31,F,CENTRE D EXPLOITATION,,,,84.13Z,NAFRev2,N,6.337196,49.307964,0.95,housenumber,1 Rue des Moulins 57920 Kédange-sur-Canner,57358_0190_00001,G,1 RUE DES MOULINS,
185703139,00013,18570313900013,O,1985-10-28,NN,,,2019-11-14T14:00:46,true,3,,,,,,57920,KEDANGE-SUR-CANNER,,,57358,,,,,,,,,,,,,,,,,,,2008-01-01,A,,,,,94.91Z,NAFRev2,N,,,0,,,,,,
195703152,00015,19570315200015,O,1983-03-01,NN,,,2019-11-14T14:00:46,false,4,,5,,RUE,DE LA FORET,57920,KEDANGE-SUR-CANNER,,,57358,,,,,,,,,,,,,,,,,,,2014-09-01,F,,,,,85.31Z,NAFRev2,N,6.34261,49.308224,0.95,housenumber,5 Rue de la Foret 57920 Kédange-sur-Canner,57358_0120_00005,G,5 RUE DE LA FORET,
195703152,00023,19570315200023,O,2014-09-01,21,2020,,2022-08-29T09:04:32,true,1,,14,,RUE,DES MOULINS,57920,KEDANGE-SUR-CANNER,,,57358,,,,,,,,,,,,,,,,,,,2014-09-01,A,,,,,85.31Z,NAFRev2,O,6.331437,49.312935,0.95,housenumber,14 Rue des Moulins 57920 Kédange-sur-Canner,57358_0190_00014,G,14 RUE DES MOULINS,
215703588,00016,21570358800016,O,1983-03-01,11,2020,,2022-08-29T09:07:51,true,4,,4,,RUE,DES ECOLES,57920,KEDANGE-SUR-CANNER,,,57358,,,,,,,,,,,,,,,,,,,2008-01-01,A,MAIRIE,,,,84.11Z,NAFRev2,O,6.334457,49.310028,0.95,housenumber,4 Rue des Ecoles 57920 Kédange-sur-Canner,57358_0060_00004,G,4 RUE DES ECOLES,
215703588,00024,21570358800024,O,1983-12-21,NN,,,2019-11-14T14:00:46,false,3,,1,,RUE,DES ECOLES,57920,KEDANGE-SUR-CANNER,,,57358,,,,,,,,,,,,,,,,,,,2008-01-01,A,ECOLE MATERNELLE PUBLIQUE,,,,85.10Z,NAFRev2,N,6.334457,49.310028,0.95,housenumber,1 Rue des Ecoles 57920 Kédange-sur-Canner,57358_0060_00001,G,1 RUE DES ECOLES,
215703588,00032,21570358800032,O,1983-12-21,11,2020,,2022-08-29T09:07:51,false,4,,6,,RUE,DES ECOLES,57920,KEDANGE-SUR-CANNER,,,57358,,,,,,,,,,,,,,,,,,,2008-01-01,A,ECOLE ELEMENTAIRE PUBLIQUE,,,,85.20Z,NAFRev2,N,6.335356,49.310129,0.95,housenumber,6 Rue des Ecoles 57920 Kédange-sur-Canner,57358_0060_00006,G,6 RUE DES ECOLES,
215703588,00040,21570358800040,O,1995-12-25,NN,,,2019-11-14T14:00:46,false,2,,,,RUE,DES ECOLES,57920,KEDANGE-SUR-CANNER,,,57358,,,,,,,,,,,,,,,,,,,2008-01-01,A,SCE ASSAINISSEMENT,,,,37.00Z,NAFRev2,N,6.336276,49.310148,0.95,street,Rue des Ecoles 57920 Kédange-sur-Canner,57358_0060,G,RUE DES ECOLES,
255703019,00018,25570301900018,O,1983-03-01,NN,,,2019-11-14T14:00:46,false,4,COLLEGE DE LA FORET,,,,,57920,KEDANGE-SUR-CANNER,,,57358,,,,,,,,,,,,,,,,,,,1997-09-25,F,,,,,75.1A,NAF1993,N,6.339863,49.306379,0.65,street,Rue de la Foret 57920 Kédange-sur-Canner,57358_0120,D,RUE DE LA FORET,
255703555,00011,25570355500011,O,1985-01-10,NN,,,2019-11-14T14:00:46,true,4,MAIRIE,4,,RUE,DES ECOLES,57920,KEDANGE-SUR-CANNER,,,57358,,,,,,,,,,,,,,,,,,,2018-10-05,F,,,,,84.12Z,NAFRev2,N,6.334457,49.310028,0.95,housenumber,4 Rue des Ecoles 57920 Kédange-sur-Canner,57358_0060_00004,G,4 RUE DES ECOLES,
265702233,00015,26570223300015,O,1983-03-01,NN,,,2019-11-14T14:00:46,true,4,,,,RUE,DES ECOLES,57920,KEDANGE-SUR-CANNER,,,57358,,,,,,,,,,,,,,,,,,,2016-12-31,F,CCAS,,,,88.99B,NAFRev2,N,6.336276,49.310148,0.95,street,Rue des Ecoles 57920 Kédange-sur-Canner,57358_0060,G,RUE DES ECOLES,
300398880,00017,30039888000017,O,1958-01-01,NN,,,2019-11-14T14:00:46,false,6,,4,,RUE,DE LA GARE,57920,KEDANGE-SUR-CANNER,,,57358,,,,,,,,,,,,,,,,,,,2010-02-01,A,,,,,20.52Z,NAFRev2,O,6.334152,49.306676,0.95,housenumber,4 Rue de la Gare 57920 Kédange-sur-Canner,57358_0140_00004,G,4 RUE DE LA GARE,
300398880,00058,30039888000058,O,2009-06-30,22,2020,2030ZZ,2023-07-26T19:33:49,true,2,,1,A,RUE,DE LA GARE,57920,KEDANGE-SUR-CANNER,,,57358,,,,,,,,,,,,,,,,,,,2011-10-11,A,,,,,20.30Z,NAFRev2,O,6.333701,49.306496,0.81,street,Rue de la Gare 57920 Kédange-sur-Canner,57358_0140,G,RUE DE LA GARE,
300425113,00010,30042511300010,O,1973-01-01,NN,,,2019-11-14T14:00:46,true,6,,2,,RUE,PRINCIPALE,57920,KEDANGE-SUR-CANNER,,,57358,,,,,,,,,,,,,,,,,,,2008-01-01,A,,,,,68.20B,NAFRev2,N,6.335997,49.306904,0.42,housenumber,2 Rue de Thionville 57920 Kédange-sur-Canner,57358_0295_00002,G,2 RUE DE THIONVILLE,
300455466,00015,30045546600015,O,,,,,2019-11-14T14:00:46,true,1,,23,,RUE,CLEMENCEAU,57920,KEDANGE-SUR-CANNER,,,57358,,,,,,,,,,,,,,,,,,,1984-12-25,F,,,,,,,N,6.339784,49.307206,0.41,housenumber,23 Rue du College 57920 Kédange-sur-Canner,57358_0025_00023,G,23 RUE DU COLLEGE,
301863577,00039,30186357700039,O,,NN,,,2019-11-14T14:00:46,true,1,,,,RTE,D'ELZING,57920,KEDANGE-SUR-CANNER,,,57358,,,,,,,,,,,,,,,,,,,1996-10-17,F,,,,,55.3A,NAF1993,O,6.33747,49.311801,0.31,street,Route de Klang 57920 Kédange-sur-Canner,57358_B060,G,ROUTE DE KLANG,
303321541,00136,30332154100136,O,1986-01-01,,,,2019-11-14T14:00:46,false,3,,,,,,57920,KEDANGE-SUR-CANNER,,,57358,,,,,,,,,,,,,,,,,,,1993-11-09,F,,,,,52.2C,NAF1993,N,,,0,,,,,,
303535496,00028,30353549600028,O,,NN,,,2019-11-14T14:00:46,true,1,,,,RTE,DEKLANG  LOT LA CANNER,57920,KEDANGE-SUR-CANNER,,,57358,,,,,,,,,,,,,,,,,,,1988-12-25,F,,,,,84.12,NAP,N,6.33747,49.311801,0.53,street,Route de Klang 57920 Kédange-sur-Canner,57358_B060,G,ROUTE DE KLANG,
303925796,00029,30392579600029,O,,,,,2019-11-14T14:00:46,true,1,,14,,RUE,DE LA FONTAINE,57920,KEDANGE-SUR-CANNER,,,57358,,,,,,,,,,,,,,,,,,,1988-07-31,F,,,,,84.12,NAP,N,6.339863,49.306379,0.55,street,Rue de la Foret 57920 Kédange-sur-Canner,57358_0120,G,RUE DE LA FORET,
304550817,00080,30455081700080,O,1900-01-01,NN,,,2019-11-14T14:00:46,false,4,,9,A,RUE,DE LA PLATRERIE,57920,KEDANGE-SUR-CANNER,,,57358,,,,,,,,,,,,,,,,,,,1997-08-31,F,,,,,52.6H,NAF1993,O,6.333292,49.305721,0.95,housenumber,9a Rue de la Platrerie 57920 Kédange-sur-Canner,57358_0235_00009_a,G,9A RUE DE LA PLATRERIE,
307233270,00015,30723327000015,O,1977-01-01,NN,,,2019-11-14T14:00:46,true,3,,24,,RTE,DE KLANG,57920,KEDANGE-SUR-CANNER,,,57358,,,,,,,,,,,,,,,,,,,2006-05-15,F,,,,,28.6D,NAFRev1,N,6.340412,49.311026,0.78,housenumber,24 Rue de Klang 57920 Kédange-sur-Canner,57358_0155_00024,G,24 RUE DE KLANG,
308089192,00014,30808919200014,O,1900-01-01,NN,,,2019-11-14T14:00:46,false,4,,,,LOT,LA CANNER,57920,KEDANGE-SUR-CANNER,,,57358,,,,,,,,,,,,,,,,,,,2014-08-01,F,,,,,86.90D,NAFRev2,N,6.339863,49.306379,0.61,street,Rue de la Foret 57920 Kédange-sur-Canner,57358_0120,G,RUE DE LA FORET,
309706380,00024,30970638000024,O,1987-06-29,11,2020,4312BA,2022-08-29T09:13:12,true,4,,24,,RTE,DE THIONVILLE,57920,KEDANGE-SUR-CANNER,,,57358,,,,,,,,,,,,,,,,,,,2008-01-01,A,,,,,43.99C,NAFRev2,O,6.330397,49.306889,0.82,housenumber,24 Rue de Thionville 57920 Kédange-sur-Canner,57358_0295_00024,G,24 RUE DE THIONVILLE,
310966254,00016,31096625400016,O,1977-01-01,NN,,,2019-11-14T14:00:46,true,5,,6,,RUE,DU MOULIN,57920,KEDANGE-SUR-CANNER,,,57358,,,,,,,,,,,,,,,,,,,2006-10-09,F,,,,,52.4Y,NAFRev1,N,6.336661,49.308346,0.72,housenumber,6 Rue des Moulins 57920 Kédange-sur-Canner,57358_0190_00006,G,6 RUE DES MOULINS,
312641392,00013,31264139200013,O,,,,,2019-11-14T14:00:46,true,1,,9,,RUE,DES VERGERS,57920,KEDANGE-SUR-CANNER,,,57358,,,,,,,,,,,,,,,,,,,2000-02-26,F,,,,,55.60,NAP,N,6.335324,49.310915,0.95,housenumber,9 Rue des Vergers 57920 Kédange-sur-Canner,57358_0300_00009,G,9 RUE DES VERGERS,
312742976,00029,31274297600029,O,,NN,,,2019-11-14T14:00:46,true,1,,9,,RUE,ST ETIENNE,57920,KEDANGE-SUR-CANNER,,,57358,,,,,,,,,,,,,,,,,,,,F,,,,,55.73,NAP,N,6.329391,49.306252,0.84,housenumber,9 Rue Saint Etienne 57920 Kédange-sur-Canner,57358_0280_00009,G,9 RUE SAINT ETIENNE,
313380024,00031,31338002400031,O,1984-07-02,NN,,,2019-11-14T14:00:46,false,4,,49,,RUE,PRINCIPALE,57920,KEDANGE-SUR-CANNER,,,57358,,,,,,,,,,,,,,,,,,,2001-12-31,F,OLIVIER ET ALEXANDRA,,,,93.0D,NAF1993,O,6.332863,49.306961,0.35,street,Rue de Thionville 57920 Kédange-sur-Canner,57358_0295,G,RUE DE THIONVILLE,
314368440,00017,31436844000017,O,,,,,2019-11-14T14:00:46,true,1,,4,,RUE,DE KLANG,57920,KEDANGE-SUR-CANNER,,,57358,,,,,,,,,,,,,,,,,,,1984-12-25,F,,,,,67.04,NAP,N,6.338265,49.310045,0.95,housenumber,4 Rue de Klang 57920 Kédange-sur-Canner,57358_0155_00004,G,4 RUE DE KLANG,
314970823,00022,31497082300022,O,,NN,,,2019-11-14T14:00:46,true,1,,16,,PL,DE LA FONTAINE,57920,KEDANGE-SUR-CANNER,,,57358,,,,,,,,,,,,,,,,,,,1997-05-17,F,,,,,52.1B,NAF1993,O,6.339863,49.306379,0.39,street,Rue de la Foret 57920 Kédange-sur-Canner,57358_0120,G,RUE DE LA FORET,
315427955,00010,31542795500010,O,,NN,,,2019-11-14T14:00:46,true,1,,9,,RUE,NATIONALE,57920,KEDANGE-SUR-CANNER,,,57358,,,,,,,,,,,,,,,,,,,,F,,,,,67.2Z,NAFRev1,N,6.339368,49.309783,0.44,housenumber,9 Rue Notre Dame 57920 Kédange-sur-Canner,57358_0220_00009,G,9 RUE NOTRE DAME,
315428417,00010,31542841700010,O,,,,,2019-11-14T14:00:46,true,1,,19,,RUE,DE L'EGLISE,57920,KEDANGE-SUR-CANNER,,,57358,,,,,,,,,,,,,,,,,,,1984-12-25,F,,,,,78.02,NAP,N,6.338886,49.309459,0.95,housenumber,19 Rue de l’Eglise 57920 Kédange-sur-Canner,57358_0065_00019,G,19 RUE DE L EGLISE,
315494211,00016,31549421100016,O,1979-01-01,NN,,,2019-11-14T14:00:46,true,3,,,,RUE,DE LA FONTAINE,57920,KEDANGE-SUR-CANNER,,,57358,,,,,,,,,,,,,,,,,,,2008-01-01,A,,,,,68.20B,NAFRev2,N,6.339863,49.306379,0.62,street,Rue de la Foret 57920 Kédange-sur-Canner,57358_0120,G,RUE DE LA FORET,
315812495,00036,31581249500036,O,,NN,,,2019-11-14T14:00:46,true,1,,,,RUE,DE KLANG,57920,KEDANGE-SUR-CANNER,,,57358,,,,,,,,,,,,,,,,,,,,F,,,,,78.02,NAP,N,6.340132,49.311021,0.95,street,Rue de Klang 57920 Kédange-sur-Canner,57358_0155,G,RUE DE KLANG,
315961508,00019,31596150800019,O,,,,,2019-11-14T14:00:46,true,1,,2,,IMP,AU BOIS,57920,KEDANGE-SUR-CANNER,,,57358,,,,,,,,,,,,,,,,,,,1984-12-25,F,,,,,62.43,NAP,N,6.340216,49.307047,0.81,housenumber,2 Impasse au Bois 57920 Kédange-sur-Canner,57358_0010_00002,G,2 IMPASSE AU BOIS,
316040716,00011,31604071600011,O,,NN,,,2019-11-14T14:00:46,true,1,,,,RUE,DE LA FONTAINE,57920,KEDANGE-SUR-CANNER,,,57358,,,,,,,,,,,,,,,,,,,,F,,,,,84.12,NAP,N,6.339863,49.306379,0.62,street,Rue de la Foret 57920 Kédange-sur-Canner,57358_0120,G,RUE DE LA FORET,
317161776,00016,31716177600016,O,,,,,2019-11-14T14:00:46,true,1,,14,,RUE,DE LA FONTAINE,57920,KEDANGE-SUR-CANNER,,,57358,,,,,,,,,,,,,,,,,,,1985-12-25,F,,,,,84.12,NAP,N,6.339863,49.306379,0.55,street,Rue de la Foret 57920 Kédange-sur-Canner,57358_0120,G,RUE DE LA FORET,
318020831,00018,31802083100018,O,1980-01-01,NN,,,2019-11-14T14:00:46,true,4,,,,RTE,DE THIONVILLE,57920,KEDANGE-SUR-CANNER,,,57358,,,,,,,,,,,,,,,,,,,2003-06-30,F,,,,,85.1G,NAFRev1,N,6.332021,49.30683,0.84,street,Route de Thionville 57920 Kédange-sur-Canner,57358_B063,G,ROUTE DE THIONVILLE,
319945614,00026,31994561400026,O,,,,,2019-11-14T14:00:46,true,1,,41,,RUE,DU COLLEGE,57920,KEDANGE-SUR-CANNER,,,57358,,,,,,,,,,,,,,,,,,,1997-08-31,F,,,,,70.2C,NAF1993,N,6.339123,49.306102,0.95,housenumber,41 Rue du College 57920 Kédange-sur-Canner,57358_0025_00041,G,41 RUE DU COLLEGE,
320164304,00018,32016430400018,O,,,,,2019-11-14T14:00:46,true,1,,49,,RUE,PRINCIPALE,57920,KEDANGE-SUR-CANNER,,,57358,,,,,,,,,,,,,,,,,,,1985-12-25,F,,,,,87.03,NAP,N,6.332863,49.306961,0.35,street,Rue de Thionville 57920 Kédange-sur-Canner,57358_0295,G,RUE DE THIONVILLE,
321391633,00013,32139163300013,O,,,,,2019-11-14T14:00:46,true,1,,,,RUE,PRINCIPALE,57920,KEDANGE-SUR-CANNER,,,57358,,,,,,,,,,,,,,,,,,,,F,,,,,62.46,NAP,N,6.332863,49.306961,0.35,street,Rue de Thionville 57920 Kédange-sur-Canner,57358_0295,G,RUE DE THIONVILLE,
322382136,00016,32238213600016,O,1981-07-06,NN,,,2019-11-14T14:00:46,true,6,,29,,RUE,DE BOUZONVILLE,57920,KEDANGE-SUR-CANNER,,,57358,,,,,,,,,,,,,,,,,,,2011-06-30,F,,,,,47.73Z,NAFRev2,O,6.337894,49.305177,0.7,street,Route de Bouzonville 57920 Kédange-sur-Canner,57358_0012,G,ROUTE DE BOUZONVILLE,
322408345,00013,32240834500013,O,,,,,2019-11-14T14:00:46,true,1,,29,,RUE,DE BOUZONVILLE,57920,KEDANGE-SUR-CANNER,,,57358,,,,,,,,,,,,,,,,,,,,F,,,,,52.3A,NAFRev1,N,6.337894,49.305177,0.7,street,Route de Bouzonville 57920 Kédange-sur-Canner,57358_0012,G,ROUTE DE BOUZONVILLE,
325054377,00024,32505437700024,O,2008-10-12,,,,2019-11-14T14:00:46,false,2,MAISON DES ASSOCIATIONS  FOYER RURAL,7,,RUE,DES ECOLES,57920,KEDANGE-SUR-CANNER,,,57358,,,,,,,,,,,,,,,,,,,2009-04-30,F,,,,,90.03A,NAFRev2,N,6.337965,49.309295,0.95,housenumber,7 Rue des Ecoles 57920 Kédange-sur-Canner,57358_0060_00007,G,7 RUE DES ECOLES,
325189082,00010,32518908200010,O,,,,,2019-11-14T14:00:46,true,1,,6,,RTE,DE BOUZONVILLE,57920,KEDANGE-SUR-CANNER,,,57358,,,,,,,,,,,,,,,,,,,1984-12-25,F,,,,,65.06,NAP,N,6.336692,49.306653,0.86,housenumber,6 Route de Bouzonville 57920 Kédange-sur-Canner,57358_0012_00006,G,6 ROUTE DE BOUZONVILLE,
326282456,00010,32628245600010,O,,,,,2019-11-14T14:00:46,true,1,,3,,PL,DU LAVOIR,57920,KEDANGE-SUR-CANNER,,,57358,,,,,,,,,,,,,,,,,,,1985-12-25,F,,,,,77.14,NAP,N,5.7587953,48.8443408,0.76,poi.track,Place du Lavoir (Chemin) Rambucourt,https://osm.org/way/556500434,G,,
328462148,00011,32846214800011,O,,,,,2019-11-14T14:00:46,true,1,,2,,RUE,PRINCIPALE,57920,KEDANGE-SUR-CANNER,,,57358,,,,,,,,,,,,,,,,,,,,F,,,,,62.11,NAP,N,6.335997,49.306904,0.42,housenumber,2 Rue de Thionville 57920 Kédange-sur-Canner,57358_0295_00002,G,2 RUE DE THIONVILLE,
328645676,00045,32864567600045,O,,NN,,,2019-11-14T14:00:46,true,1,,102,,RUE,DU COLLEGE,57920,KEDANGE-SUR-CANNER,,,57358,,,,,,,,,,,,,,,,,,,1993-07-15,F,,,,,52.1B,NAF1993,N,6.339576,49.307366,0.78,street,Rue du College 57920 Kédange-sur-Canner,57358_0025,G,RUE DU COLLEGE,
328735550,00019,32873555000019,O,,,,,2019-11-14T14:00:46,true,1,,4,,RUE,DU KLANG,57920,KEDANGE-SUR-CANNER,,,57358,,,,,,,,,,,,,,,,,,,,F,,,,,67.04,NAP,N,6.338265,49.310045,0.77,housenumber,4 Rue de Klang 57920 Kédange-sur-Canner,57358_0155_00004,G,4 RUE DE KLANG,
329248660,00014,32924866000014,O,,NN,,,2019-11-14T14:00:46,true,1,,4,,RTE,DE KLANG,57920,KEDANGE-SUR-CANNER,,,57358,,,,,,,,,,,,,,,,,,,,F,,,,,64.43,NAP,N,6.338265,49.310045,0.77,housenumber,4 Rue de Klang 57920 Kédange-sur-Canner,57358_0155_00004,G,4 RUE DE KLANG,
329632889,00013,32963288900013,O,1984-04-01,NN,,,2019-11-14T14:00:46,false,4,,41,,RUE,DU COLLEGE,57920,KEDANGE-SUR-CANNER,,,57358,,,,,,,,,,,,,,,,,,,2001-01-01,F,,,,,93.0H,NAF1993,O,6.339123,49.306102,0.95,housenumber,41 Rue du College 57920 Kédange-sur-Canner,57358_0025_00041,G,41 RUE DU COLLEGE,
329943724,00016,32994372400016,O,,,,,2019-11-14T14:00:46,true,1,,41,,RUE,DU COLLEGE,57920,KEDANGE-SUR-CANNER,,,57358,,,,,,,,,,,,,,,,,,,1997-08-31,F,,,,,70.2C,NAF1993,N,6.339123,49.306102,0.95,housenumber,41 Rue du College 57920 Kédange-sur-Canner,57358_0025_00041,G,41 RUE DU COLLEGE,
330381278,00051,33038127800051,O,2003-09-15,NN,,,2019-11-14T14:00:46,false,4,,6,,RUE,DE NONNENFELS,57920,KEDANGE-SUR-CANNER,,,57358,,,,,,,,,,,,,,,,,,,2014-01-01,F,,,,,86.90D,NAFRev2,N,6.348309,49.311041,0.82,housenumber,6 Rue du Nonnenfels 57920 Kédange-sur-Canner,57358_0210_00006,G,6 RUE DU NONNENFELS,
330414434,00010,33041443400010,O,1984-07-01,NN,,4722ZB,2019-11-14T14:00:46,true,5,,7,,RUE,DE L EGLISE,57920,KEDANGE-SUR-CANNER,,,57358,,,,,,,,,,,,,,,,,,,2017-03-31,F,,,,,47.22Z,NAFRev2,O,6.338832,49.308403,0.95,housenumber,7 Rue de l’Eglise 57920 Kédange-sur-Canner,57358_0065_00007,G,7 RUE DE L EGLISE,
331005397,00012,33100539700012,O,1984-10-15,NN,,,2019-11-14T14:00:46,false,4,,4,,RUE,DE NONNENFELS,57920,KEDANGE-SUR-CANNER,,,57358,,,,,,,,,,,,,,,,,,,2003-12-31,F,,,,,74.2B,NAFRev1,O,6.34688,49.311028,0.82,housenumber,4 Rue du Nonnenfels 57920 Kédange-sur-Canner,57358_0210_00004,G,4 RUE DU NONNENFELS,
331005397,00020,33100539700020,O,2001-02-09,NN,,,2021-10-27T08:28:16,true,6,,4,,RTE,DE THIONVILLE,57920,KEDANGE-SUR-CANNER,,,57358,,,,,,,,,,,,,,,,,,,2015-11-05,A,,,,,71.11Z,NAFRev2,N,6.335646,49.30695,0.82,housenumber,4 Rue de Thionville 57920 Kédange-sur-Canner,57358_0295_00004,G,4 RUE DE THIONVILLE,
333577526,00028,33357752600028,O,1988-10-01,NN,,,2019-11-14T14:00:46,false,3,,14,,RUE,DE THIONVILLE,57920,KEDANGE-SUR-CANNER,,,57358,,,,,,,,,,,,,,,,,,,2007-10-01,F,,,,,85.1C,NAFRev1,N,6.334248,49.307105,0.95,housenumber,14 Rue de Thionville 57920 Kédange-sur-Canner,57358_0295_00014,G,14 RUE DE THIONVILLE,
333577526,00036,33357752600036,O,2007-10-01,,,,2021-02-23T10:52:59,true,2,,12,,RTE,DE THIONVILLE,57920,KEDANGE-SUR-CANNER,,,57358,,,,,,,,,,,,,,,,,,,2008-01-01,A,,,,,86.21Z,NAFRev2,N,6.334596,49.307064,0.82,housenumber,12 Rue de Thionville 57920 Kédange-sur-Canner,57358_0295_00012,G,12 RUE DE THIONVILLE,
334134848,00046,33413484800046,O,1991-08-01,01,2020,,2022-08-29T09:23:35,true,4,,1,B,RUE,DES MOULINS,57920,KEDANGE-SUR-CANNER,,,57358,,,,,,,,,,,,,,,,,,,2008-01-01,A,,,,,86.90E,NAFRev2,O,6.336179,49.308235,0.86,housenumber,1bis Rue des Moulins 57920 Kédange-sur-Canner,57358_0190_00001_bis,G,1BIS RUE DES MOULINS,
335780300,02246,33578030002246,O,1996-01-01,NN,,,2019-11-14T14:00:46,false,3,,21,,RUE,DU COLLEGE,57920,KEDANGE-SUR-CANNER,,,57358,,,,,,,,,,,,,,,,,,,1997-12-31,F,PF MOSELLANES VIRTE PF FRANCIS HENTZEN,,,,93.0H,NAF1993,O,6.339764,49.307288,0.95,housenumber,21 Rue du College 57920 Kédange-sur-Canner,57358_0025_00021,G,21 RUE DU COLLEGE,
338069891,00012,33806989100012,O,,,,,2019-11-14T14:00:46,true,1,,102,,RUE,DU COLLEGE,57920,KEDANGE-SUR-CANNER,,,57358,,,,,,,,,,,,,,,,,,,1990-09-06,F,,,,,62.11,NAP,N,6.339576,49.307366,0.78,street,Rue du College 57920 Kédange-sur-Canner,57358_0025,G,RUE DU COLLEGE,
338279953,00024,33827995300024,O,,NN,,,2019-11-14T14:00:46,true,1,,8,B,RTE,THIONVILLE,57920,KEDANGE-SUR-CANNER,,,57358,,,,,,,,,,,,,,,,,,,1990-12-21,F,,,,,80.06,NAP,N,6.334585,49.307062,0.7,housenumber,8bis Rue de Thionville 57920 Kédange-sur-Canner,57358_0295_00008_bis,G,8BIS RUE DE THIONVILLE,
338433709,00023,33843370900023,O,1988-04-01,NN,,,2019-11-14T14:00:46,true,3,,2,,RUE,DES ECOLES,57920,KEDANGE-SUR-CANNER,,,57358,,,,,,,,,,,,,,,,,,,2008-01-01,A,,,,,01.62Z,NAFRev2,N,6.333705,49.310127,0.95,housenumber,2 Rue des Ecoles 57920 Kédange-sur-Canner,57358_0060_00002,G,2 RUE DES ECOLES,
338486343,00019,33848634300019,O,,,,,2019-11-14T14:00:46,true,1,,,,,CHATEAU DE HOMBOURG-BUDANG,57920,KEDANGE-SUR-CANNER,,,57358,,,,,,,,,,,,,,,,,,,1988-12-25,F,,,,,77.09,NAP,N,6.3415169,49.2953723,0.88,poi.castle,Château de Hombourg Hombourg-Budange,https://osm.org/way/130402368,G,,
338826944,00013,33882694400013,O,,NN,,,2019-11-14T14:00:46,true,1,,4,,RUE,DE KLANG,57920,KEDANGE-SUR-CANNER,,,57358,,,,,,,,,,,,,,,,,,,1995-06-30,F,,,,,55.4B,NAF1993,O,6.338265,49.310045,0.95,housenumber,4 Rue de Klang 57920 Kédange-sur-Canner,57358_0155_00004,G,4 RUE DE KLANG,
340020627,00014,34002062700014,O,1987-01-01,01,2020,1061BZ,2023-07-06T03:47:25,true,5,,23,,RTE,DE THIONVILLE,57920,KEDANGE-SUR-CANNER,,,57358,,,,,,,,,,,,,,,,,,,2022-05-31,F,,,,,46.21Z,NAFRev2,O,6.334039,49.307117,0.82,housenumber,23 Rue de Thionville 57920 Kédange-sur-Canner,57358_0295_00023,G,23 RUE DE THIONVILLE,
340151406,00022,34015140600022,O,1987-04-01,00,2020,,2022-08-29T09:26:07,true,4,,7,,RUE,DE L'EGLISE,57920,KEDANGE-SUR-CANNER,,,57358,,,,,,,,,,,,,,,,,,,2008-02-10,A,,,,,86.21Z,NAFRev2,O,6.338832,49.308403,0.95,housenumber,7 Rue de l’Eglise 57920 Kédange-sur-Canner,57358_0065_00007,G,7 RUE DE L EGLISE,
340151463,00023,34015146300023,O,1987-03-09,NN,,,2019-11-14T14:00:46,true,3,,7,,RUE,EGLISE,57920,KEDANGE-SUR-CANNER,,,57358,,,,,,,,,,,,,,,,,,,2008-01-01,A,,,,,86.21Z,NAFRev2,N,6.338832,49.308403,0.87,housenumber,7 Rue de l’Eglise 57920 Kédange-sur-Canner,57358_0065_00007,G,7 RUE DE L EGLISE,
340310150,00016,34031015000016,O,,NN,,,2019-11-14T14:00:46,true,1,,20,,RUE,DE THIONVILLE,57920,KEDANGE-SUR-CANNER,,,57358,,,,,,,,,,,,,,,,,,,1987-12-15,F,,,,,78.02,NAP,N,6.332315,49.306815,0.95,housenumber,20 Rue de Thionville 57920 Kédange-sur-Canner,57358_0295_00020,G,20 RUE DE THIONVILLE,
340316116,00052,34031611600052,O,2000-03-21,NN,,,2019-11-14T14:00:46,true,3,,6,,RUE,DE LA PLATRERIE,57920,KEDANGE-SUR-CANNER,,,57358,,,,,,,,,,,,,,,,,,,2008-01-01,A,,,,,71.12B,NAFRev2,O,6.335799,49.306098,0.95,housenumber,6 Rue de la Platrerie 57920 Kédange-sur-Canner,57358_0235_00006,G,6 RUE DE LA PLATRERIE,
342851466,00017,34285146600017,O,,NN,,,2019-11-14T14:00:46,true,1,,8,B,RTE,THIONVILLE,57920,KEDANGE-SUR-CANNER,,,57358,,,,,,,,,,,,,,,,,,,1989-02-01,F,,,,,80.06,NAP,N,6.334585,49.307062,0.7,housenumber,8bis Rue de Thionville 57920 Kédange-sur-Canner,57358_0295_00008_bis,G,8BIS RUE DE THIONVILLE,
344692538,00012,34469253800012,O,,,,,2019-11-14T14:00:46,true,1,,14,,RUE,DE LA FONTAINE,57920,KEDANGE-SUR-CANNER,,,57358,,,,,,,,,,,,,,,,,,,1988-08-01,F,,,,,84.12,NAP,N,6.339863,49.306379,0.55,street,Rue de la Foret 57920 Kédange-sur-Canner,57358_0120,G,RUE DE LA FORET,
344697909,00036,34469790900036,O,2002-12-02,NN,,,2019-11-14T14:00:46,false,4,,2,,RUE,DE L ANCIENNE MAIRIE,57920,KEDANGE-SUR-CANNER,,,57358,,,,,,,,,,,,,,,,,,,2008-07-03,F,,,,,81.30Z,NAFRev2,N,5.6182437,46.2286271,0.9,poi,Rue de l'Ancienne Mairie (Pont) Groissiat,https://osm.org/way/255873006,G,,
345212112,00014,34521211200014,O,,NN,,,2019-11-14T14:00:46,true,1,,9,,RUE,DE LA PLATRERIE,57920,KEDANGE-SUR-CANNER,,,57358,,,,,,,,,,,,,,,,,,,1995-08-31,F,,,,,52.6D,NAF1993,N,6.332999,49.305756,0.95,housenumber,9 Rue de la Platrerie 57920 Kédange-sur-Canner,57358_0235_00009,G,9 RUE DE LA PLATRERIE,
348242082,00017,34824208200017,O,,NN,,,2019-11-14T14:00:46,true,1,,23,,RUE,FONTAINE,57920,KEDANGE-SUR-CANNER,,,57358,,,,,,,,,,,,,,,,,,,1989-03-31,F,,,,,64.11,NAP,N,6.328397,49.306365,0.55,housenumber,23 Rue Saint Etienne 57920 Kédange-sur-Canner,57358_0280_00023,G,23 RUE SAINT ETIENNE,
349016675,00028,34901667500028,O,2002-03-19,NN,,9602AA,2020-08-25T10:43:47,false,4,,2,,PL,SAINT PIERRE,57920,KEDANGE-SUR-CANNER,,,57358,,,,,,,,,,,,,,,,,,,2018-03-31,F,CREA'TIF,,,,96.02A,NAFRev2,N,6.339537,49.309305,0.53,housenumber,2 Place Pierre Barre 57920 Kédange-sur-Canner,57358_0234_00002,G,2 PLACE PIERRE BARRE,
349776765,00019,34977676500019,O,,NN,,,2019-11-14T14:00:46,true,1,,5,,RUE,DE BOUZONVILLE,57920,KEDANGE-SUR-CANNER,,,57358,,,,,,,,,,,,,,,,,,,1990-03-16,F,,,,,64.46,NAP,N,6.337854,49.304737,0.82,housenumber,5 Route de Bouzonville 57920 Kédange-sur-Canner,57358_0012_00005,G,5 ROUTE DE BOUZONVILLE,
350459434,00030,35045943400030,O,1997-01-01,NN,,,2019-11-14T14:00:46,false,4,,10,,RUE,DE L'EGLISE,57920,KEDANGE-SUR-CANNER,,,57358,,,,,,,,,,,,,,,,,,,2000-08-01,F,,,,,85.1E,NAF1993,O,6.339132,49.308894,0.95,housenumber,10 Rue de l’Eglise 57920 Kédange-sur-Canner,57358_0065_00010,G,10 RUE DE L EGLISE,
350459434,00048,35045943400048,O,2000-08-01,NN,,,2019-11-14T14:00:46,true,4,,29,B,RUE,DU COLLEGE,57920,KEDANGE-SUR-CANNER,,,57358,,,,,,,,,,,,,,,,,,,2012-04-07,F,,,,,86.23Z,NAFRev2,O,6.339764,49.306836,0.86,housenumber,29bis Rue du College 57920 Kédange-sur-Canner,57358_0025_00029_bis,G,29BIS RUE DU COLLEGE,