siren,nic,siret,statutDiffusionEtablissement,dateCreationEtablissement,trancheEffectifsEtablissement,anneeEffectifsEtablissement,activitePrincipaleRegistreMetiersEtablissement,dateDernierTraitementEtablissement,etablissementSiege,nombrePeriodesEtablissement,complementAdresseEtablissement,numeroVoieEtablissement,indiceRepetitionEtablissement,typeVoieEtablissement,libelleVoieEtablissement,codePostalEtablissement,libelleCommuneEtablissement,libelleCommuneEtrangerEtablissement,distributionSpecialeEtablissement,codeCommuneEtablissement,codeCedexEtablissement,libelleCedexEtablissement,codePaysEtrangerEtablissement,libellePaysEtrangerEtablissement,complementAdresse2Etablissement,numeroVoie2Etablissement,indiceRepetition2Etablissement,typeVoie2Etablissement,libelleVoie2Etablissement,codePostal2Etablissement,libelleCommune2Etablissement,libelleCommuneEtranger2Etablissement,distributionSpeciale2Etablissement,codeCommune2Etablissement,codeCedex2Etablissement,libelleCedex2Etablissement,codePaysEtranger2Etablissement,libellePaysEtranger2Etablissement,dateDebut,etatAdministratifEtablissement,enseigne1Etablissement,enseigne2Etablissement,enseigne3Etablissement,denominationUsuelleEtablissement,activitePrincipaleEtablissement,nomenclatureActivitePrincipaleEtablissement,caractereEmployeurEtablissement,longitude,latitude,geo_score,geo_type,geo_adresse,geo_id,geo_ligne,geo_l4,geo_l5
075740639,00010,07574063900010,O,,,,,,true,1,,,,RTE,DE FURNES,59123,ZUYDCOOTE,,,59668,,,,,,,,,,,,,,,,,,,1984-12-25,F,,,,,00.98,NAP,N,2.494122,51.058762,0.81,street,Route de Furnes 59123 Zuydcoote,59668_0184,G,ROUTE DE FURNES,
075850354,00012,07585035400012,O,,,,,,true,1,,,,RUE,DU PALAIS,59123,ZUYDCOOTE,,,59668,,,,,,,,,,,,,,,,,,,1984-12-25,F,,,,,00.98,NAP,N,2.491948,51.062042,0.5,street,Rue du Général de Gaulle 59123 Zuydcoote,59668_0120,G,RUE DU GENERAL DE GAULLE,
076041953,00019,07604195300019,O,,,,,,true,1,,,,,PO DE ZUYDCOOTE,59123,ZUYDCOOTE,,,59668,,,,,,,,,,,,,,,,,,,1984-12-25,F,,,,,62.11,NAP,N,2.491948,51.062042,0.77,street,Rue du Général de Gaulle 59123 Zuydcoote,59668_0120,G,RUE DU GENERAL DE GAULLE,
076043496,00017,07604349600017,O,,,,,,true,1,,,,RUE,DE VALENCIENNES,59123,ZUYDCOOTE,,,59668,,,,,,,,,,,,,,,,,,,1984-12-25,F,,,,,00.98,NAP,N,2.48785,51.068481,0.96,street,Rue de Valenciennes 59123 Zuydcoote,59668_0240,G,RUE DE VALENCIENNES,
076143064,00012,07614306400012,O,1961-01-01,NN,,,,true,1,,123,,RUE,DU GENERAL DE GAULLE,59123,ZUYDCOOTE,,,59668,,,,,,,,,,,,,,,,,,,2002-08-25,F,,,,,70.2C,NAF1993,N,2.490968,51.063217,0.96,housenumber,123 Rue du Général de Gaulle 59123 Zuydcoote,59668_0120_00123,G,123 RUE DU GENERAL DE GAULLE,
076243450,00012,07624345000012,O,,,,,,true,1,,,,RUE,DE ROUBAIX,59123,ZUYDCOOTE,,,59668,,,,,,,,,,,,,,,,,,,1984-12-25,F,,,,,00.98,NAP,N,2.488922,51.068994,0.95,street,Rue de Roubaix 59123 Zuydcoote,59668_0220,G,RUE DE ROUBAIX,
076250364,00023,07625036400023,O,1980-10-01,NN,,,2017-07-21T03:16:47,true,6,,,,RUE,DE ROUBAIX,59123,ZUYDCOOTE,,,59668,,,,,,,,,,,,,,,,,,,2017-05-18,F,,,,,55.30Z,NAFRev2,N,2.488922,51.068994,0.95,street,Rue de Roubaix 59123 Zuydcoote,59668_0220,G,RUE DE ROUBAIX,
076340983,00014,07634098300014,O,,,,,,true,1,,,,RUE,DU GENERAL DE GAULLE,59123,ZUYDCOOTE,,,59668,,,,,,,,,,,,,,,,,,,1984-12-25,F,,,,,67.04,NAP,N,2.491948,51.062042,0.96,street,Rue du Général de Gaulle 59123 Zuydcoote,59668_0120,G,RUE DU GENERAL DE GAULLE,
076443779,00012,07644377900012,O,1964-01-01,NN,,,,true,1,,58,,RUE,DU GENERAL DE GAULLE,59123,ZUYDCOOTE,,,59668,,,,,,,,,,,,,,,,,,,1998-12-31,F,,,,,50.1Z,NAF1993,O,2.493109,51.061204,0.96,housenumber,58 Rue du Général de Gaulle 59123 Zuydcoote,59668_0120_00058,G,58 RUE DU GENERAL DE GAULLE,
076940485,00014,07694048500014,O,1969-01-01,NN,,,2008-01-04T18:10:30,true,3,,,,RTE,DE FURNES,59123,ZUYDCOOTE,,,59668,,,,,,,,,,,,,,,,,,,2007-12-31,F,,,,,55.4B,NAFRev1,N,2.494122,51.058762,0.81,street,Route de Furnes 59123 Zuydcoote,59668_0184,G,ROUTE DE FURNES,
077141893,00048,07714189300048,O,,,,,,true,1,,160,,RUE,GENERAL DE GAULLE,59123,ZUYDCOOTE,,,59668,,,,,,,,,,,,,,,,,,,1989-01-01,F,,,,,67.08,NAP,N,2.490866,51.063493,0.95,housenumber,160 Rue du Général de Gaulle 59123 Zuydcoote,59668_0120_00160,G,160 RUE DU GENERAL DE GAULLE,
077240810,00018,07724081000018,O,,NN,,,,true,1,,,,RUE,DE VALENCIENNES,59123,ZUYDCOOTE,,,59668,,,,,,,,,,,,,,,,,,,1987-08-20,F,,,,,67.08,NAP,N,2.48785,51.068481,0.96,street,Rue de Valenciennes 59123 Zuydcoote,59668_0240,G,RUE DE VALENCIENNES,
077250025,00044,07725002500044,O,1998-08-01,,,,,false,3,,15,,RUE,CENTRALE,59123,ZUYDCOOTE,,,59668,,,,,,,,,,,,,,,,,,,2000-11-24,F,,,,,45.1A,NAF1993,N,2.489047,51.068849,0.95,housenumber,15 Rue Centrale 59123 Zuydcoote,59668_0060_00015,G,15 RUE CENTRALE,
077340305,00018,07734030500018,O,,NN,,,,true,1,,,,RUE,DE LA RESISTANCE,59123,ZUYDCOOTE,,,59668,,,,,,,,,,,,,,,,,,,1985-12-31,F,,,,,50.1Z,NAF1993,N,2.493138,51.065604,0.95,street,Rue de la Résistance 59123 Zuydcoote,59668_0200,G,RUE DE LA RESISTANCE,
215906686,00013,21590668600013,O,1983-03-01,12,2020,,2022-08-29T09:08:03,true,4,,,,RUE,DU GENERAL DE GAULLE,59123,ZUYDCOOTE,,,59668,,,,,,,,,,,,,,,,,,,2008-01-01,A,MAIRIE,,,,84.11Z,NAFRev2,O,2.491948,51.062042,0.96,street,Rue du Général de Gaulle 59123 Zuydcoote,59668_0120,G,RUE DU GENERAL DE GAULLE,
215906686,00021,21590668600021,O,1983-03-16,NN,,,,false,4,,,,RUE,DES DUNES,59123,ZUYDCOOTE,,,59668,,,,,,,,,,,,,,,,,,,2001-02-16,F,CAMPING MUNICIPAL,,,,55.2C,NAF1993,N,2.491345,51.065907,0.96,street,Rue des Dunes 59123 Zuydcoote,59668_0100,G,RUE DES DUNES,
215906686,00039,21590668600039,O,1983-12-21,03,2020,,2022-08-29T09:08:03,false,3,,,,RUE,DU GENERAL DE GAULLE,59123,ZUYDCOOTE,,,59668,,,,,,,,,,,,,,,,,,,2008-01-01,A,ECOLE PRIMAIRE PUBLIQUE,,,,85.20Z,NAFRev2,N,2.491948,51.062042,0.96,street,Rue du Général de Gaulle 59123 Zuydcoote,59668_0120,G,RUE DU GENERAL DE GAULLE,
255901506,00030,25590150600030,O,2011-09-01,01,2020,,2022-08-29T09:10:05,false,3,,,,RUE,JEAN DELVALLEZ,59123,ZUYDCOOTE,,,59668,,,,,,,,,,,,,,,,,,,2021-12-31,F,GESTION CENTRES HEBERGEMENT,,,,84.12Z,NAFRev2,O,2.488715,51.064128,0.95,street,Rue Jean Delvallez 59123 Zuydcoote,59668_0148,G,RUE JEAN DELVALLEZ,
255901506,00048,25590150600048,O,2022-05-18,,,,2022-05-30T07:27:34,true,1,,2,,RUE,JEAN DELVALLEZ,59123,ZUYDCOOTE,,,59668,,,,,,,,,,,,,,,,,,,2022-05-18,A,,,,,84.11Z,NAFRev2,O,2.488544,51.064387,0.95,housenumber,2 Rue Jean Delvallez 59123 Zuydcoote,59668_0148_00002,G,2 RUE JEAN DELVALLEZ,
265906685,00010,26590668500010,O,1983-03-01,NN,,,2010-06-26T03:12:38,true,3,MAISON COMMUNALE,,,RUE,DU GENERAL DE GAULLE,59123,ZUYDCOOTE,,,59668,,,,,,,,,,,,,,,,,,,2008-01-01,A,CCAS,,,,88.99B,NAFRev2,N,2.491948,51.062042,0.96,street,Rue du Général de Gaulle 59123 Zuydcoote,59668_0120,G,RUE DU GENERAL DE GAULLE,
265907022,00015,26590702200015,O,1983-03-01,32,2020,,2022-08-29T09:10:36,true,4,,,,BD,VANCAUWENBERGHE,59123,ZUYDCOOTE,,,59668,,,,,,,,,,,,,,,,,,,2008-01-01,A,,,,,86.10Z,NAFRev2,O,2.480347,51.065946,0.84,street,Boulevard Vancauwenberghe 59123 Zuydcoote,59668_0260,G,BOULEVARD VANCAUWENBERGHE,
265907022,00023,26590702200023,O,1984-12-19,11,2020,,2022-08-29T09:10:36,false,3,,,,BD,VANCAUWENBERGHE,59123,ZUYDCOOTE,,,59668,,,,,,,,,,,,,,,,,,,2008-01-01,A,CRECHE DE L HOPITAL,,,,88.91A,NAFRev2,N,2.480347,51.065946,0.84,street,Boulevard Vancauwenberghe 59123 Zuydcoote,59668_0260,G,BOULEVARD VANCAUWENBERGHE,
265907022,00049,26590702200049,O,2002-12-25,,,,2008-01-04T19:01:20,false,2,,,,BD,VANCAUWENBERGHE,59123,ZUYDCOOTE,,,59668,,,,,,,,,,,,,,,,,,,2008-01-01,A,DOTATION NON AFFECTEE,,,,66.19A,NAFRev2,N,2.480347,51.065946,0.84,street,Boulevard Vancauwenberghe 59123 Zuydcoote,59668_0260,G,BOULEVARD VANCAUWENBERGHE,
265907964,00018,26590796400018,O,1993-04-05,31,2020,,2022-08-29T09:10:36,true,4,,,,BD,VANCAUWENBERGHE,59123,ZUYDCOOTE,,,59668,,,,,,,,,,,,,,,,,,,2008-01-01,A,,,,,87.10B,NAFRev2,O,2.480347,51.065946,0.84,street,Boulevard Vancauwenberghe 59123 Zuydcoote,59668_0260,G,BOULEVARD VANCAUWENBERGHE,
265907964,00026,26590796400026,O,1994-01-01,NN,,,2013-05-18T02:21:39,false,3,,,,BD,VANCAUWENBERGHE,59123,ZUYDCOOTE,,,59668,,,,,,,,,,,,,,,,,,,2008-01-01,A,SCE EDUC SPECIALE & SOINS DOMICILE,,,,88.91B,NAFRev2,N,2.480347,51.065946,0.84,street,Boulevard Vancauwenberghe 59123 Zuydcoote,59668_0260,G,BOULEVARD VANCAUWENBERGHE,
265907964,00034,26590796400034,O,2004-01-01,NN,,,2013-05-18T02:21:39,false,3,,,,BD,VANCAUWENBERGHE,59123,ZUYDCOOTE,,,59668,,,,,,,,,,,,,,,,,,,2008-01-01,A,MAISON D'ACCUEIL SPECIALISEE,,,,87.20A,NAFRev2,N,2.480347,51.065946,0.84,street,Boulevard Vancauwenberghe 59123 Zuydcoote,59668_0260,G,BOULEVARD VANCAUWENBERGHE,
302581665,00015,30258166500015,O,,,,,,true,1,,129,,RUE,DU GAL DE GAULLE,59123,ZUYDCOOTE,,,59668,,,,,,,,,,,,,,,,,,,1985-12-25,F,,,,,62.11,NAP,N,2.490816,51.063392,0.91,housenumber,129 Rue du Général de Gaulle 59123 Zuydcoote,59668_0120_00129,G,129 RUE DU GENERAL DE GAULLE,
305236812,00031,30523681200031,O,1986-06-04,NN,,,2006-10-27T00:07:43,true,3,,49,,RUE,DES DUNES,59123,ZUYDCOOTE,,,59668,,,,,,,,,,,,,,,,,,,2005-01-31,F,,,,,70.2C,NAFRev1,N,2.490428,51.06595,0.96,housenumber,49 Rue des Dunes 59123 Zuydcoote,59668_0100_00049,G,49 RUE DES DUNES,
305978223,00017,30597822300017,O,,,,,,true,1,,29,,RUE,RESISTANCE,59123,ZUYDCOOTE,,,59668,,,,,,,,,,,,,,,,,,,1984-12-25,F,,,,,64.43,NAP,N,2.491596,51.065036,0.9,interpolation,29 Rue de la Résistance 59123 Zuydcoote,,G,27 RUE DE LA RESISTANCE,
310332028,00011,31033202800011,O,1977-01-01,NN,,,2006-11-25T09:26:09,true,3,,2,,RUE,DU GENERAL DE GAULLE,59123,ZUYDCOOTE,,,59668,,,,,,,,,,,,,,,,,,,2004-03-31,F,,,,,55.4B,NAFRev1,N,2.494633,51.059454,0.96,housenumber,2 Rue du Général de Gaulle 59123 Zuydcoote,59668_0120_00002,G,2 RUE DU GENERAL DE GAULLE,
311152714,00011,31115271400011,O,,NN,,,,true,1,,94,,RUE,DE VALENCIENNES,59123,ZUYDCOOTE,,,59668,,,,,,,,,,,,,,,,,,,1992-12-31,F,,,,,55.3A,NAF1993,N,2.487542,51.06909,0.96,housenumber,94 Rue de Valenciennes 59123 Zuydcoote,59668_0240_00094,G,94 RUE DE VALENCIENNES,
311376644,00010,31137664400010,O,1965-01-01,NN,,,,true,3,,122,,RUE,DU GENERAL DE GAULLE,59123,ZUYDCOOTE,,,59668,,,,,,,,,,,,,,,,,,,1995-12-25,F,,,,,70.2C,NAF1993,N,2.491948,51.062042,0.85,street,Rue du Général de Gaulle 59123 Zuydcoote,59668_0120,G,RUE DU GENERAL DE GAULLE,
316134105,00063,31613410500063,O,2008-06-04,NN,,,2011-04-23T04:53:31,false,2,,169,,RUE,DU GENERAL DE GAULLE,59123,ZUYDCOOTE,,,59668,,,,,,,,,,,,,,,,,,,2009-03-03,F,LE SAINT GERMAIN,,,,56.10C,NAFRev2,O,2.489225,51.064555,0.96,housenumber,169 Rue du Général de Gaulle 59123 Zuydcoote,59668_0120_00169,G,169 RUE DU GENERAL DE GAULLE,
318002912,00026,31800291200026,O,1989-01-01,NN,,,2015-05-14T05:03:43,true,5,,73,,RUE,DE ROUBAIX,59123,ZUYDCOOTE,,,59668,,,,,,,,,,,,,,,,,,,2013-07-01,F,,,,,86.21Z,NAFRev2,O,2.48839,51.070024,0.95,housenumber,73 Rue de Roubaix 59123 Zuydcoote,59668_0220_00073,G,73 RUE DE ROUBAIX,
318297447,00027,31829744700027,O,1989-01-01,NN,,,2008-01-04T20:59:21,false,3,,34,,RUE,DU GENERAL DE GAULLE,59123,ZUYDCOOTE,,,59668,,,,,,,,,,,,,,,,,,,2006-12-31,F,,,,,85.1G,NAFRev1,N,2.493818,51.060478,0.96,housenumber,34 Rue du Général de Gaulle 59123 Zuydcoote,59668_0120_00034,G,34 RUE DU GENERAL DE GAULLE,
319209474,00059,31920947400059,O,2003-07-01,NN,,,2008-09-12T09:47:47,true,4,,129,,RUE,DU GENERAL DE GAULLE,59123,ZUYDCOOTE,,,59668,,,,,,,,,,,,,,,,,,,2008-07-31,F,,,,,47.26Z,NAFRev2,N,2.490816,51.063392,0.96,housenumber,129 Rue du Général de Gaulle 59123 Zuydcoote,59668_0120_00129,G,129 RUE DU GENERAL DE GAULLE,
319937421,00034,31993742100034,O,2005-03-04,,,,2021-02-23T10:44:06,true,2,,29,,RUE,DU GENERAL DE GAULLE,59123,ZUYDCOOTE,,,59668,,,,,,,,,,,,,,,,,,,2008-01-01,A,,,,,68.31Z,NAFRev2,N,2.493792,51.06028,0.96,housenumber,29 Rue du Général de Gaulle 59123 Zuydcoote,59668_0120_00029,G,29 RUE DU GENERAL DE GAULLE,
321555161,00033,32155516100033,O,1995-06-01,NN,,,,true,1,,129,,RUE,DU GENERAL DE GAULLE,59123,ZUYDCOOTE,,,59668,,,,,,,,,,,,,,,,,,,2000-03-28,F,,,,,52.2L,NAF1993,O,2.490816,51.063392,0.96,housenumber,129 Rue du Général de Gaulle 59123 Zuydcoote,59668_0120_00129,G,129 RUE DU GENERAL DE GAULLE,
321962581,00013,32196258100013,O,1981-04-01,01,2020,,2022-08-29T09:17:19,true,5,,,,,SANATORIUM,59123,ZUYDCOOTE,,,59668,,,,,,,,,,,,,,,,,,,2020-12-31,F,,,,,56.30Z,NAFRev2,O,7.1042141,48.3613787,0.9,poi.hospital,Centre médical de Saâles (Hôpital) Saales,https://osm.org/way/245544372,G,,
322199043,00025,32219904300025,O,1986-08-14,,,,,true,1,,,,RTE,DE FURNES,59123,ZUYDCOOTE,,,59668,,,,,,,,,,,,,,,,,,,2002-07-01,F,,,,,50.1Z,NAF1993,N,2.494122,51.058762,0.81,street,Route de Furnes 59123 Zuydcoote,59668_0184,G,ROUTE DE FURNES,
322965542,00010,32296554200010,O,,NN,,,,true,1,,82,,RUE,DES DUNES,59123,ZUYDCOOTE,,,59668,,,,,,,,,,,,,,,,,,,,F,,,,,55.72,NAP,N,2.492613,51.066448,0.96,housenumber,82 Rue des Dunes 59123 Zuydcoote,59668_0100_00082,G,82 RUE DES DUNES,
323375931,00017,32337593100017,O,1981-12-15,NN,,,2008-11-07T00:40:00,false,4,,138,,RUE,DU GENERAL DE GAULLE,59123,ZUYDCOOTE,,,59668,,,,,,,,,,,,,,,,,,,2000-07-27,F,,,,,45.2V,NAF1993,O,2.490419,51.063875,0.96,housenumber,138 Rue du Général de Gaulle 59123 Zuydcoote,59668_0120_00138,G,138 RUE DU GENERAL DE GAULLE,
323781484,00015,32378148400015,O,,NN,,,2006-11-25T09:55:24,true,1,,,,CHE,PRIVE,59123,ZUYDCOOTE,,,59668,,,,,,,,,,,,,,,,,,,1988-12-16,F,,,,,97.23,NAP,N,2.48394,51.061744,0.76,street,Chemin Privé 59123 Zuydcoote,59668_0177,G,CHEMIN PRIVE,
324543404,00010,32454340400010,O,,,,,,true,1,,,,,DIGUE DE MER,59123,ZUYDCOOTE,,,59668,,,,,,,,,,,,,,,,,,,1990-09-24,F,,,,,67.08,NAP,N,2.491948,51.062042,0.39,street,Rue du Général de Gaulle 59123 Zuydcoote,59668_0120,G,RUE DU GENERAL DE GAULLE,
324954569,00012,32495456900012,O,1965-11-01,NN,,,,true,1,,72,,RUE,DE LA RESISTANCE,59123,ZUYDCOOTE,,,59668,,,,,,,,,,,,,,,,,,,2000-05-31,F,,,,,01.1A,NAF1993,N,2.495691,51.064841,0.95,housenumber,72 Rue de la Résistance 59123 Zuydcoote,59668_0200_00072,G,72 RUE DE LA RESISTANCE,
326861911,00013,32686191100013,O,,NN,,,,true,1,,95,,RUE,DE VALENCIENNES,59123,ZUYDCOOTE,,,59668,,,,,,,,,,,,,,,,,,,1988-02-16,F,,,,,55.73,NAP,N,2.487463,51.069078,0.96,housenumber,95 Rue de Valenciennes 59123 Zuydcoote,59668_0240_00095,G,95 RUE DE VALENCIENNES,
327970885,00015,32797088500015,O,1981-01-01,NN,,,2006-10-27T01:47:24,true,3,,125,,RUE,DE VALENCIENNES,59123,ZUYDCOOTE,,,59668,,,,,,,,,,,,,,,,,,,2005-12-25,F,,,,,70.2A,NAFRev1,N,2.486856,51.070252,0.96,housenumber,125 Rue de Valenciennes 59123 Zuydcoote,59668_0240_00125,G,125 RUE DE VALENCIENNES,
328280235,00016,32828023500016,O,1983-07-01,NN,,,2008-01-04T19:37:00,true,3,,18,,RUE,DE BRAY DUNES,59123,ZUYDCOOTE,,,59668,,,,,,,,,,,,,,,,,,,2008-01-01,A,,,,,68.20B,NAFRev2,N,2.489976,51.06696,0.94,housenumber,18 Rue de Bray-dunes 59123 Zuydcoote,59668_0040_00018,G,18 RUE DE BRAY DUNES,
329361414,00017,32936141400017,O,,,,,,true,1,,58,,RUE,DU GEN DE GAULLE,59123,ZUYDCOOTE,,,59668,,,,,,,,,,,,,,,,,,,1990-01-02,F,,,,,65.03,NAP,N,2.493109,51.061204,0.88,housenumber,58 Rue du Général de Gaulle 59123 Zuydcoote,59668_0120_00058,G,58 RUE DU GENERAL DE GAULLE,
329976484,00017,32997648400017,O,,,,,,true,1,,129,,RUE,DU GENERAL DE GAULLE,59123,ZUYDCOOTE,,,59668,,,,,,,,,,,,,,,,,,,1991-12-31,F,,,,,62.11,NAP,N,2.490816,51.063392,0.96,housenumber,129 Rue du Général de Gaulle 59123 Zuydcoote,59668_0120_00129,G,129 RUE DU GENERAL DE GAULLE,
331019349,00025,33101934900025,O,1994-05-06,NN,,,,true,1,,,,,DIGUE DE MER,59123,ZUYDCOOTE,,,59668,,,,,,,,,,,,,,,,,,,2002-02-27,F,,,,,55.3A,NAF1993,O,2.491948,51.062042,0.39,street,Rue du Général de Gaulle 59123 Zuydcoote,59668_0120,G,RUE DU GENERAL DE GAULLE,
332709823,00014,33270982300014,O,,NN,,,,true,1,,133,,RUE,DE VALENCIENNES,59123,ZUYDCOOTE,,,59668,,,,,,,,,,,,,,,,,,,1988-08-31,F,,,,,62.46,NAP,N,2.486761,51.070428,0.96,housenumber,133 Rue de Valenciennes 59123 Zuydcoote,59668_0240_00133,G,133 RUE DE VALENCIENNES,
333213296,00010,33321329600010,O,1985-06-01,NN,,,2019-11-15T03:48:31,true,3,,18,,RUE,DE BRAY DUNES,59123,ZUYDCOOTE,,,59668,,,,,,,,,,,,,,,,,,,2008-01-01,A,,,,,68.20B,NAFRev2,N,2.489976,51.06696,0.94,housenumber,18 Rue de Bray-dunes 59123 Zuydcoote,59668_0040_00018,G,18 RUE DE BRAY DUNES,
333374916,00018,33337491600018,O,,,,,,true,1,,82,,RUE,DES DUNES,59123,ZUYDCOOTE,,,59668,,,,,,,,,,,,,,,,,,,1989-10-06,F,,,,,55.60,NAP,N,2.492613,51.066448,0.96,housenumber,82 Rue des Dunes 59123 Zuydcoote,59668_0100_00082,G,82 RUE DES DUNES,
334034626,00021,33403462600021,O,1987-04-06,NN,,,,false,4,,2,,RUE,DES DUNES,59123,ZUYDCOOTE,,,59668,,,,,,,,,,,,,,,,,,,2003-04-03,F,,,,,85.1E,NAFRev1,N,2.488959,51.064844,0.96,housenumber,2 Rue des Dunes 59123 Zuydcoote,59668_0100_00002,G,2 RUE DES DUNES,
335185054,00012,33518505400012,O,1986-01-06,NN,,,2007-05-19T09:49:04,true,4,,,,RUE,DE LA RESISTANCE,59123,ZUYDCOOTE,,,59668,,,,,,,,,,,,,,,,,,,2005-08-31,F,,,,,60.2M,NAFRev1,O,2.493138,51.065604,0.95,street,Rue de la Résistance 59123 Zuydcoote,59668_0200,G,RUE DE LA RESISTANCE,
335295580,00013,33529558000013,O,1986-01-01,NN,,,2012-12-07T09:59:23,false,4,,,,RUE,DE LA RESISTANCE,59123,ZUYDCOOTE,,,59668,,,,,,,,,,,,,,,,,,,2012-11-19,F,,,,,68.20B,NAFRev2,N,2.493138,51.065604,0.95,street,Rue de la Résistance 59123 Zuydcoote,59668_0200,G,RUE DE LA RESISTANCE,
335295580,00021,33529558000021,O,2012-11-19,,,,2019-11-22T03:38:52,true,1,,49,,RUE,DES DUNES,59123,ZUYDCOOTE,,,59668,,,,,,,,,,,,,,,,,,,2012-11-19,A,,,,,68.20B,NAFRev2,N,2.490428,51.06595,0.96,housenumber,49 Rue des Dunes 59123 Zuydcoote,59668_0100_00049,G,49 RUE DES DUNES,
338765167,00014,33876516700014,O,,,,,,true,1,,,,RUE,DE LA RESISTANCE,59123,ZUYDCOOTE,,,59668,,,,,,,,,,,,,,,,,,,1989-06-30,F,,,,,65.06,NAP,N,2.493138,51.065604,0.95,street,Rue de la Résistance 59123 Zuydcoote,59668_0200,G,RUE DE LA RESISTANCE,
339486508,00015,33948650800015,O,1986-10-06,NN,,,2006-12-15T00:29:27,false,3,LOTISSEMENT LES SILENES,2,,RUE,AVESNES,59123,ZUYDCOOTE,,,59668,,,,,,,,,,,,,,,,,,,1992-12-22,F,,,,,85.1G,NAF1993,N,2.48956,51.069416,0.74,street,Rue d'Avesnes 59123 Zuydcoote,59668_0033,G,RUE D AVESNES,
339595407,00026,33959540700026,O,1986-11-01,NN,,,2006-10-27T02:57:27,false,3,HOPITAL MARITIME,,,BD,VANCAUWENBERGHE,59123,ZUYDCOOTE,,,59668,,,,,,,,,,,,,,,,,,,2005-05-01,F,,,,,85.1C,NAFRev1,N,2.480347,51.065946,0.84,street,Boulevard Vancauwenberghe 59123 Zuydcoote,59668_0260,G,BOULEVARD VANCAUWENBERGHE,
340215219,00015,34021521900015,O,,NN,,,,true,1,,140,,RUE,GAULLE,59123,ZUYDCOOTE,,,59668,,,,,,,,,,,,,,,,,,,1988-10-25,F,,,,,55.60,NAP,N,2.49032,51.063948,0.93,housenumber,140 Rue du Général de Gaulle 59123 Zuydcoote,59668_0120_00140,G,140 RUE DU GENERAL DE GAULLE,
340697028,00017,34069702800017,O,,,,,,true,1,,19,,RUE,DES CREVETTES,59123,ZUYDCOOTE,,,59668,,,,,,,,,,,,,,,,,,,1989-06-23,F,,,,,55.70,NAP,N,2.488976,51.063208,0.95,housenumber,19 Rue des Crevettes 59123 Zuydcoote,59668_0080_00019,G,19 RUE DES CREVETTES,
341758035,00016,34175803500016,O,,,,,,true,1,,113,,RUE,DU GAL DE GAULLE,59123,ZUYDCOOTE,,,59668,,,,,,,,,,,,,,,,,,,1995-03-28,F,,,,,50.1Z,NAF1993,N,2.491321,51.062844,0.91,housenumber,113 Rue du Général de Gaulle 59123 Zuydcoote,59668_0120_00113,G,113 RUE DU GENERAL DE GAULLE,
343153615,00020,34315361500020,O,,,,,,true,1,,34,,RUE,DES DUNES,59123,ZUYDCOOTE,,,59668,,,,,,,,,,,,,,,,,,,1989-12-31,F,,,,,55.70,NAP,N,2.489568,51.065577,0.96,housenumber,34 Rue des Dunes 59123 Zuydcoote,59668_0100_00034,G,34 RUE DES DUNES,
343650297,00017,34365029700017,O,,NN,,,,true,1,,2,,RUE,DU GENERAL DE GAULLE,59123,ZUYDCOOTE,,,59668,,,,,,,,,,,,,,,,,,,1988-01-01,F,,,,,45.3A,NAF1993,N,2.494633,51.059454,0.96,housenumber,2 Rue du Général de Gaulle 59123 Zuydcoote,59668_0120_00002,G,2 RUE DU GENERAL DE GAULLE,
344608211,00019,34460821100019,O,,NN,,,,true,1,,6,,RUE,VALENCIENNES,59123,ZUYDCOOTE,,,59668,,,,,,,,,,,,,,,,,,,1990-03-31,F,,,,,69.12,NAP,N,2.489259,51.065917,0.95,housenumber,6 Rue de Valenciennes 59123 Zuydcoote,59668_0240_00006,G,6 RUE DE VALENCIENNES,
344839923,00010,34483992300010,P,1988-04-05,NN,,,2022-11-21T20:01:19,false,1,[ND],[ND],[ND],[ND],[ND],[ND],ZUYDCOOTE,,[ND],59668,[ND],[ND],,,[ND],[ND],[ND],[ND],[ND],[ND],,,[ND],,[ND],[ND],,,1988-04-05,F,[ND],[ND],[ND],[ND],,,N,,,0,,,,,,
344839923,00036,34483992300036,P,1988-04-05,,,,2022-11-21T20:01:19,true,2,[ND],[ND],[ND],[ND],[ND],[ND],ZUYDCOOTE,,[ND],59668,[ND],[ND],,,[ND],[ND],[ND],[ND],[ND],[ND],,,[ND],,[ND],[ND],,,2022-09-30,F,[ND],[ND],[ND],[ND],86.90E,NAFRev2,N,,,0,,,,,,
344875307,00011,34487530700011,O,,NN,,,,true,1,,169,,RUE,DU GENERAL DE GAULLE,59123,ZUYDCOOTE,,,59668,,,,,,,,,,,,,,,,,,,1997-04-29,F,,,,,52.1C,NAF1993,O,2.489225,51.064555,0.96,housenumber,169 Rue du Général de Gaulle 59123 Zuydcoote,59668_0120_00169,G,169 RUE DU GENERAL DE GAULLE,
348086935,00015,34808693500015,O,1988-09-15,,,,2006-10-27T03:39:51,false,4,,101,,AV,DU GENERAL DE GAULLE,59123,ZUYDCOOTE,,,59668,,,,,,,,,,,,,,,,,,,2004-05-03,F,,,,,60.2M,NAFRev1,N,2.491607,51.062541,0.83,housenumber,101 Rue du Général de Gaulle 59123 Zuydcoote,59668_0120_00101,G,101 RUE DU GENERAL DE GAULLE,
349789875,00011,34978987500011,O,1989-02-17,NN,,,2008-01-04T23:08:46,true,3,,2,,RUE,DE LA RESISTANCE,59123,ZUYDCOOTE,,,59668,,,,,,,,,,,,,,,,,,,2008-01-01,A,,,,,68.20A,NAFRev2,N,2.490292,51.064302,0.95,housenumber,2 Rue de la Résistance 59123 Zuydcoote,59668_0200_00002,G,2 RUE DE LA RESISTANCE,
349855874,00013,34985587400013,O,,,,,,true,1,,160,,RUE,DU GENERAL DE GAULLE,59123,ZUYDCOOTE,,,59668,,,,,,,,,,,,,,,,,,,1991-12-31,F,,,,,67.08,NAP,N,2.490866,51.063493,0.96,housenumber,160 Rue du Général de Gaulle 59123 Zuydcoote,59668_0120_00160,G,160 RUE DU GENERAL DE GAULLE,
350331062,00025,35033106200025,O,2008-11-01,11,2020,,2022-08-29T09:00:49,true,1,,,,RUE,DELVALLEZ,59123,ZUYDCOOTE,,,59668,,,,,,,,,,,,,,,,,,,2008-11-01,A,,,,,91.04Z,NAFRev2,O,2.488715,51.064128,0.88,street,Rue Jean Delvallez 59123 Zuydcoote,59668_0148,G,RUE JEAN DELVALLEZ,
350386934,00011,35038693400011,O,1989-04-10,NN,,4399CZ,2018-09-29T12:00:47,true,5,LD LES 7 MESURES,,,RTE,DE FURNES,59123,ZUYDCOOTE,,,59668,,,,,,,,,,,,,,,,,,,2016-12-31,F,,,,,43.99C,NAFRev2,O,2.494122,51.058762,0.81,street,Route de Furnes 59123 Zuydcoote,59668_0184,G,ROUTE DE FURNES,
351020185,00028,35102018500028,O,,NN,,,,true,1,,,,,HOPITAL MARITIME,59123,ZUYDCOOTE,,,59668,,,,,,,,,,,,,,,,,,,1990-08-20,F,,,,,84.10,NAP,N,1.5589033,50.4007643,0.9,poi.hospital,Hôpital Maritime de Berck Berck,https://osm.org/way/428426097,G,,
351928510,00020,35192851000020,O,1989-10-02,NN,,,,false,4,,2,,RUE,DE VALENCIENNES,59123,ZUYDCOOTE,,,59668,,,,,,,,,,,,,,,,,,,1994-01-01,F,,,,,74.2A,NAF1993,N,2.489318,51.065803,0.96,housenumber,2 Rue de Valenciennes 59123 Zuydcoote,59668_0240_00002,G,2 RUE DE VALENCIENNES,
351928510,00061,35192851000061,O,2011-08-01,,,,2019-12-16T10:57:21,false,4,,11,,RUE,DE VALENCIENNES,59123,ZUYDCOOTE,,,59668,,,,,,,,,,,,,,,,,,,2018-12-31,F,,,,URBAN DEVELOPMENT,55.20Z,NAFRev2,N,2.489047,51.066045,0.96,housenumber,11 Rue de Valenciennes 59123 Zuydcoote,59668_0240_00011,G,11 RUE DE VALENCIENNES,
352396808,00011,35239680800011,O,,,,,,true,1,,122,,RUE,DU GENERAL DE GAULLE,59123,ZUYDCOOTE,,,59668,,,,,,,,,,,,,,,,,,,1990-10-05,F,,,,,38.40,NAP,N,2.491948,51.062042,0.85,street,Rue du Général de Gaulle 59123 Zuydcoote,59668_0120,G,RUE DU GENERAL DE GAULLE,
352628101,00037,35262810100037,O,1996-05-15,NN,,,2011-04-23T06:53:26,false,4,,128,,RUE,DU GAL DE GAULLE,59123,ZUYDCOOTE,,,59668,,,,,,,,,,,,,,,,,,,2009-10-01,F,,,,,94.99Z,NAFRev2,O,2.490861,51.063497,0.91,housenumber,128 Rue du Général de Gaulle 59123 Zuydcoote,59668_0120_00128,G,128 RUE DU GENERAL DE GAULLE,
353750466,00016,35375046600016,O,1990-02-01,NN,,,,true,1,,61,,RUE,DU GENERAL DE GAULLE,59123,ZUYDCOOTE,,,59668,,,,,,,,,,,,,,,,,,,1999-06-08,F,,,,,45.3E,NAF1993,N,2.492817,51.061298,0.96,housenumber,61 Rue du Général de Gaulle 59123 Zuydcoote,59668_0120_00061,G,61 RUE DU GENERAL DE GAULLE,