siren,nic,siret,statutDiffusionEtablissement,dateCreationEtablissement,trancheEffectifsEtablissement,anneeEffectifsEtablissement,activitePrincipaleRegistreMetiersEtablissement,dateDernierTraitementEtablissement,etablissementSiege,nombrePeriodesEtablissement,complementAdresseEtablissement,numeroVoieEtablissement,indiceRepetitionEtablissement,typeVoieEtablissement,libelleVoieEtablissement,codePostalEtablissement,libelleCommuneEtablissement,libelleCommuneEtrangerEtablissement,distributionSpecialeEtablissement,codeCommuneEtablissement,codeCedexEtablissement,libelleCedexEtablissement,codePaysEtrangerEtablissement,libellePaysEtrangerEtablissement,complementAdresse2Etablissement,numeroVoie2Etablissement,indiceRepetition2Etablissement,typeVoie2Etablissement,libelleVoie2Etablissement,codePostal2Etablissement,libelleCommune2Etablissement,libelleCommuneEtranger2Etablissement,distributionSpeciale2Etablissement,codeCommune2Etablissement,codeCedex2Etablissement,libelleCedex2Etablissement,codePaysEtranger2Etablissement,libellePaysEtranger2Etablissement,dateDebut,etatAdministratifEtablissement,enseigne1Etablissement,enseigne2Etablissement,enseigne3Etablissement,denominationUsuelleEtablissement,activitePrincipaleEtablissement,nomenclatureActivitePrincipaleEtablissement,caractereEmployeurEtablissement,longitude,latitude,geo_score,geo_type,geo_adresse,geo_id,geo_ligne,geo_l4,geo_l5
096410493,00017,09641049300017,O,,,,,2019-11-14T14:00:49,true,1,,,,,,61170,LE MENIL-GUYON,,,61266,,,,,,,,,,,,,,,,,,,1984-12-25,F,,,,,67.05,NAP,N,,,0,,,,,,
216102665,00017,21610266500017,O,1983-03-01,01,2020,,2022-08-29T09:08:09,true,3,,,,,LE BOURG,61170,LE MENIL-GUYON,,,61266,,,,,,,,,,,,,,,,,,,2008-01-01,A,MAIRIE,,,,84.11Z,NAFRev2,N,0.29511,48.582963,0.94,street,Le Bourg 61170 Le Ménil-Guyon,61266_g5pmv1,G,LE BOURG,
266101344,00015,26610134400015,O,1994-07-25,NN,,,2019-11-14T14:00:49,true,4,MAIRIE,,,,LE BOURG,61170,LE MENIL-GUYON,,,61266,,,,,,,,,,,,,,,,,,,2016-01-01,F,CCAS,,,,88.99B,NAFRev2,N,0.29511,48.582963,0.94,street,Le Bourg 61170 Le Ménil-Guyon,61266_g5pmv1,G,LE BOURG,
302274014,00018,30227401400018,O,,NN,,,2019-11-14T14:00:49,true,1,,,,,,61170,LE MENIL-GUYON,,,61266,,,,,,,,,,,,,,,,,,,1994-12-31,F,,,,,55.3A,NAF1993,N,,,0,,,,,,
317471548,00014,31747154800014,O,1979-01-01,NN,,,2019-11-14T14:00:49,true,4,,,,,LA FERME,61170,LE MENIL-GUYON,,,61266,,,,,,,,,,,,,,,,,,,2015-09-01,F,,,,,01.42Z,NAFRev2,N,0.29141,48.583257,0.93,street,la Ferme 61170 Le Ménil-Guyon,61266_06uc9v,G,LA FERME,
321225716,00018,32122571600018,O,1981-02-02,01,2020,,2022-08-29T09:17:02,true,3,,,,,MAIRIE,61170,LE MENIL-GUYON,,,61266,,,,,,,,,,,,,,,,,,,2008-01-01,A,,,,,01.61Z,NAFRev2,N,0.29767,48.578647,0.38,street,Lieu Dit Pavillerie 61170 Le Ménil-Guyon,61266_ow1v8k,G,LIEU DIT PAVILLERIE,
328748389,00017,32874838900017,O,1984-01-02,NN,,,2019-11-14T14:00:49,false,6,,,,,LE BOURG,61170,LE MENIL-GUYON,,,61266,,,,,,,,,,,,,,,,,,,2008-01-01,F,,,,,01.11Z,NAFRev2,N,0.29511,48.582963,0.94,street,Le Bourg 61170 Le Ménil-Guyon,61266_g5pmv1,G,LE BOURG,
341476810,00039,34147681000039,O,2004-02-01,,,,2022-09-23T09:02:15,true,6,LA CHEVALLERIE,,,LD,LA CHEVALLERIE,61170,LE MENIL-GUYON,,,61266,,,,,,,,,,,,,,,,,,,2021-12-31,F,,,,,68.31Z,NAFRev2,N,0.292507,48.577009,0.74,street,Lieu Dit Chevallerie 61170 Le Ménil-Guyon,61266_dtxu3g,G,LIEU DIT CHEVALLERIE,
349621110,00015,34962111000015,O,1989-01-01,NN,,,2019-11-14T14:00:49,true,4,,,,,LA BELLE MADELEINE,61170,LE MENIL-GUYON,,,61266,,,,,,,,,,,,,,,,,,,2005-02-14,F,,,,,55.4B,NAFRev1,N,0.298562,48.575655,0.69,street,La Belle Magdelaine 61170 Le Ménil-Guyon,61266_B003,G,LA BELLE MAGDELAINE,
350673836,00010,35067383600010,O,1900-01-01,NN,,,2019-11-14T14:00:49,false,3,,,,,LES VERGERS,61170,LE MENIL-GUYON,,,61266,,,,,,,,,,,,,,,,,,,1993-04-10,F,,,,,01.4A,NAF1993,N,0.295862,48.586838,0.7,street,les Vergées 61170 Le Ménil-Guyon,61266_gh7ord,G,LES VERGEES,
350673836,00028,35067383600028,O,2009-07-01,,,,2021-02-23T11:03:23,true,1,,,,,LE PRE NEUF,61170,LE MENIL-GUYON,,,61266,,,,,,,,,,,,,,,,,,,2009-07-01,A,,,,,81.30Z,NAFRev2,N,0.297978,48.577543,0.93,street,Le Pre Neuf 61170 Le Ménil-Guyon,61266_B066,G,LE PRE NEUF,
399272269,00016,39927226900016,O,1995-01-01,NN,,,2019-11-14T14:00:49,true,1,,,,,LE BOURG,61170,LE MENIL-GUYON,,,61266,,,,,,,,,,,,,,,,,,,1999-03-31,F,,,,,55.3A,NAF1993,N,0.29511,48.582963,0.94,street,Le Bourg 61170 Le Ménil-Guyon,61266_g5pmv1,G,LE BOURG,
403159510,00011,40315951000011,O,1995-11-01,NN,,,2023-01-18T03:44:26,true,4,,,,,LA BELLE MAGDELEINE,61170,LE MENIL-GUYON,,,61266,,,,,,,,,,,,,,,,,,,2008-01-01,A,,,,,01.42Z,NAFRev2,N,0.298562,48.575655,0.79,street,La Belle Magdelaine 61170 Le Ménil-Guyon,61266_B003,G,LA BELLE MAGDELAINE,
411285133,00038,41128513300038,O,2005-12-01,,,,2021-02-23T11:33:31,true,2,,,,,LES VERGEES,61170,LE MENIL-GUYON,,,61266,,,,,,,,,,,,,,,,,,,2008-01-01,A,,,,,68.20B,NAFRev2,N,0.295862,48.586838,0.93,street,les Vergées 61170 Le Ménil-Guyon,61266_gh7ord,G,LES VERGEES,
412669574,00011,41266957400011,O,1997-07-02,,,,2019-11-14T14:00:49,true,1,,,,,LE PETIT CHARBONNET,61170,LE MENIL-GUYON,,,61266,,,,,,,,,,,,,,,,,,,1998-05-25,F,,,,,51.1R,NAF1993,N,0.301307,48.569897,0.93,street,Le Petit Charbonnet 61170 Le Ménil-Guyon,61266_B085,G,LE PETIT CHARBONNET,
413326844,00011,41332684400011,O,1990-01-01,NN,,,2019-11-14T14:00:49,true,3,,,,,,61170,LE MENIL-GUYON,,,61266,,,,,,,,,,,,,,,,,,,2008-01-01,A,,,,,01.42Z,NAFRev2,N,,,0,,,,,,
413326869,00018,41332686900018,O,1990-01-01,NN,,,2023-01-07T06:00:10,true,6,,,,,LA CROIX,61170,LE MENIL-GUYON,,,61266,,,,,,,,,,,,,,,,,,,2023-01-01,A,,,,,01.42Z,NAFRev2,N,0.290247,48.583589,0.93,street,La Croix 61170 Le Ménil-Guyon,61266_r0x3kw,G,LA CROIX,
418718219,00011,41871821900011,O,1998-03-12,NN,,,2019-11-14T14:00:49,true,3,,,,,CHARBONNET,61170,LE MENIL-GUYON,,,61266,,,,,,,,,,,,,,,,,,,2005-03-29,F,,,,,70.2C,NAFRev1,N,0.301941,48.570467,0.93,street,Charbonnet 61170 Le Ménil-Guyon,61266_sdofmr,G,CHARBONNET,
423037373,00010,42303737300010,O,1998-12-09,NN,,,2019-11-14T14:00:49,true,4,,,,,LES PARQUETS,61170,LE MENIL-GUYON,,,61266,,,,,,,,,,,,,,,,,,,2013-02-28,F,,,,,01.42Z,NAFRev2,N,0.290828,48.585161,0.93,street,les Parquets 61170 Le Ménil-Guyon,61266_vmv075,G,LES PARQUETS,
429287444,00013,42928744400013,O,1982-01-01,NN,,,2019-11-14T14:00:49,true,5,,,,,LE PONT,61170,LE MENIL-GUYON,,,61266,,,,,,,,,,,,,,,,,,,2008-01-01,F,,,,,01.42Z,NAFRev2,N,0.297276,48.578965,0.93,street,Le Pont 61170 Le Ménil-Guyon,61266_wbj79q,G,LE PONT,
433421484,00059,43342148400059,O,2007-03-22,,,,2019-11-14T14:00:49,false,2,,,,,LA CHEVALERIE,61170,LE MENIL-GUYON,,,61266,,,,,,,,,,,,,,,,,,,2007-12-31,F,,,,,45.2J,NAFRev1,N,0.294753,48.576851,0.85,street,La Petite Chevalerie 61170 Le Ménil-Guyon,61266_B086,G,LA PETITE CHEVALERIE,
440356145,00027,44035614500027,O,2009-11-01,,,4399CZ,2022-04-02T12:49:49,true,2,,,,,LE BOURG,61170,LE MENIL-GUYON,,,61266,,,,,,,,,,,,,,,,,,,2015-01-01,A,,,,,43.99C,NAFRev2,N,0.29511,48.582963,0.94,street,Le Bourg 61170 Le Ménil-Guyon,61266_g5pmv1,G,LE BOURG,
441965522,00010,44196552200010,O,1982-01-01,NN,,,2019-11-14T14:00:49,true,3,,,,,LA BASTIPTERIE,61170,LE MENIL-GUYON,,,61266,,,,,,,,,,,,,,,,,,,2008-01-01,A,,,,,01.42Z,NAFRev2,N,0.295255,48.58158,0.57,street,la Baptisterie 61170 Le Ménil-Guyon,61266_wvpp9n,G,LA BAPTISTERIE,
443672704,00014,44367270400014,O,2002-10-07,NN,,,2019-11-14T14:00:49,false,4,LE MENIL GUYON,,,,LA CHEVALERIE,61170,LE MENIL-GUYON,,,61266,,,,,,,,,,,,,,,,,,,2016-11-06,F,,,,,68.20B,NAFRev2,N,0.294753,48.576851,0.85,street,La Petite Chevalerie 61170 Le Ménil-Guyon,61266_B086,G,LA PETITE CHEVALERIE,
452650583,00019,45265058300019,O,2004-02-01,NN,,,2019-11-14T14:00:49,true,3,,,,,LA CHEVALLERIE,61170,LE MENIL-GUYON,,,61266,,,,,,,,,,,,,,,,,,,2006-12-31,F,,,,,74.1G,NAFRev1,N,0.292507,48.577009,0.74,street,Lieu Dit Chevallerie 61170 Le Ménil-Guyon,61266_dtxu3g,G,LIEU DIT CHEVALLERIE,
482129863,00015,48212986300015,O,2005-03-23,02,2020,4391BZ,2022-08-29T09:15:38,true,3,,,,,LES VERGEES,61170,LE MENIL-GUYON,,,61266,,,,,,,,,,,,,,,,,,,2008-01-01,A,,,,,43.91B,NAFRev2,O,0.295862,48.586838,0.93,street,les Vergées 61170 Le Ménil-Guyon,61266_gh7ord,G,LES VERGEES,
533034724,00013,53303472400013,O,2011-06-01,,,,2019-11-14T14:00:49,true,1,,,,,LA CROIX,61170,LE MENIL-GUYON,,,61266,,,,,,,,,,,,,,,,,,,2011-06-01,A,,,,,01.43Z,NAFRev2,N,0.290247,48.583589,0.93,street,La Croix 61170 Le Ménil-Guyon,61266_r0x3kw,G,LA CROIX,
790747273,00015,79074727300015,O,2012-12-20,,,,2019-11-14T14:00:49,true,1,,,,,LA CHEVALLERIE,61170,LE MENIL-GUYON,,,61266,,,,,,,,,,,,,,,,,,,2012-12-20,A,,,,,68.20A,NAFRev2,N,0.292507,48.577009,0.74,street,Lieu Dit Chevallerie 61170 Le Ménil-Guyon,61266_dtxu3g,G,LIEU DIT CHEVALLERIE,
791304033,00016,79130403300016,O,2013-03-01,,,,2019-11-14T14:00:49,true,1,,,,,LES OUCHES DE LA CROIX,61170,LE MENIL-GUYON,,,61266,,,,,,,,,,,,,,,,,,,2013-03-01,A,,,,,01.42Z,NAFRev2,N,0.291485,48.584227,0.93,street,les Ouches de la Croix 61170 Le Ménil-Guyon,61266_B038,G,LES OUCHES DE LA CROIX,
804668069,00011,80466806900011,O,2014-10-01,01,2020,,2022-08-29T09:59:34,true,1,,,,,LA FERME,61170,LE MENIL-GUYON,,,61266,,,,,,,,,,,,,,,,,,,2014-10-01,A,,,,,01.50Z,NAFRev2,O,0.29141,48.583257,0.93,street,la Ferme 61170 Le Ménil-Guyon,61266_06uc9v,G,LA FERME,
804834752,00029,80483475200029,P,2021-04-28,,,,2021-08-07T09:04:17,true,1,[ND],[ND],[ND],[ND],[ND],[ND],LE MENIL-GUYON,,[ND],61266,[ND],[ND],,,[ND],[ND],[ND],[ND],[ND],[ND],,,[ND],,[ND],[ND],,,2021-04-28,A,[ND],[ND],[ND],[ND],47.99A,NAFRev2,N,,,0,,,,,,
809365166,00010,80936516600010,O,2015-02-04,,,,2019-11-14T14:00:49,true,2,,,,,CHARBONNET,61170,LE MENIL-GUYON,,,61266,,,,,,,,,,,,,,,,,,,2016-03-24,F,,,,,62.01Z,NAFRev2,N,0.301941,48.570467,0.93,street,Charbonnet 61170 Le Ménil-Guyon,61266_sdofmr,G,CHARBONNET,
817915168,00014,81791516800014,O,2015-12-12,,,,2019-11-14T14:00:49,true,1,,,,,LES CARRIERES,61170,LE MENIL-GUYON,,,61266,,,,,,,,,,,,,,,,,,,2015-12-12,A,,,,,68.20B,NAFRev2,N,0.301229,48.572043,0.93,street,Les Carrieres 61170 Le Ménil-Guyon,61266_vpr6dh,G,LES CARRIERES,
839383411,00015,83938341100015,P,2018-05-01,,,,2019-11-14T14:00:49,false,2,[ND],[ND],[ND],[ND],[ND],[ND],LE MENIL-GUYON,,[ND],61266,[ND],[ND],,,[ND],[ND],[ND],[ND],[ND],[ND],,,[ND],,[ND],[ND],,,2018-09-13,F,[ND],[ND],[ND],[ND],86.90F,NAFRev2,N,,,0,,,,,,
839383411,00023,83938341100023,P,2018-09-13,,,,2021-02-23T17:58:33,true,1,[ND],[ND],[ND],[ND],[ND],[ND],LE MENIL-GUYON,,[ND],61266,[ND],[ND],,,[ND],[ND],[ND],[ND],[ND],[ND],,,[ND],,[ND],[ND],,,2018-09-13,A,[ND],[ND],[ND],[ND],86.90F,NAFRev2,N,,,0,,,,,,
850137167,00019,85013716700019,O,2019-03-14,,,,2022-09-03T04:05:43,true,2,,,,LD,LE PRE NEUF,61170,LE MENIL-GUYON,,,61266,,,,,,,,,,,,,,,,,,,2022-07-12,F,,,,,68.20B,NAFRev2,N,0.297978,48.577543,0.93,street,Le Pre Neuf 61170 Le Ménil-Guyon,61266_B066,G,LE PRE NEUF,
909025579,00014,90902557900014,O,2021-04-12,,,,2022-02-24T10:32:35,false,1,,,,,LA BAPTISTERIE,61170,LE MENIL-GUYON,,,61266,,,,,,,,,,,,,,,,,,,2021-04-12,A,,,,,35.11Z,NAFRev2,N,0.295255,48.58158,0.93,street,la Baptisterie 61170 Le Ménil-Guyon,61266_wvpp9n,G,LA BAPTISTERIE,
909025579,00022,90902557900022,O,2021-08-15,,,,2022-03-05T13:23:53,true,1,,,,,LA BAPTISTERIE,61170,LE MENIL-GUYON,,,61266,,,,,,,,,,,,,,,,,,,2021-08-15,A,,,,,47.99A,NAFRev2,N,0.295255,48.58158,0.93,street,la Baptisterie 61170 Le Ménil-Guyon,61266_wvpp9n,G,LA BAPTISTERIE,
920223393,00017,92022339300017,P,2022-09-29,,,,2023-07-07T12:04:42,true,1,[ND],[ND],[ND],[ND],[ND],[ND],LE MENIL-GUYON,,[ND],61266,[ND],[ND],,,[ND],[ND],[ND],[ND],[ND],[ND],,,[ND],,[ND],[ND],,,2022-09-29,A,[ND],[ND],[ND],[ND],90.02Z,NAFRev2,N,,,0,,,,,,
953166402,00016,95316640200016,O,2023-06-01,,,,2023-06-05T15:00:08,true,1,,,,,LE BOURG,61170,LE MENIL-GUYON,,,61266,,,,,,,,,,,,,,,,,,,2023-06-01,A,,,,AUX CREAS DE SANDRA,74.10Z,NAFRev2,N,0.29511,48.582963,0.94,street,Le Bourg 61170 Le Ménil-Guyon,61266_g5pmv1,G,LE BOURG,
