siren,nic,siret,statutDiffusionEtablissement,dateCreationEtablissement,trancheEffectifsEtablissement,anneeEffectifsEtablissement,activitePrincipaleRegistreMetiersEtablissement,dateDernierTraitementEtablissement,etablissementSiege,nombrePeriodesEtablissement,complementAdresseEtablissement,numeroVoieEtablissement,indiceRepetitionEtablissement,typeVoieEtablissement,libelleVoieEtablissement,codePostalEtablissement,libelleCommuneEtablissement,libelleCommuneEtrangerEtablissement,distributionSpecialeEtablissement,codeCommuneEtablissement,codeCedexEtablissement,libelleCedexEtablissement,codePaysEtrangerEtablissement,libellePaysEtrangerEtablissement,complementAdresse2Etablissement,numeroVoie2Etablissement,indiceRepetition2Etablissement,typeVoie2Etablissement,libelleVoie2Etablissement,codePostal2Etablissement,libelleCommune2Etablissement,libelleCommuneEtranger2Etablissement,distributionSpeciale2Etablissement,codeCommune2Etablissement,codeCedex2Etablissement,libelleCedex2Etablissement,codePaysEtranger2Etablissement,libellePaysEtranger2Etablissement,dateDebut,etatAdministratifEtablissement,enseigne1Etablissement,enseigne2Etablissement,enseigne3Etablissement,denominationUsuelleEtablissement,activitePrincipaleEtablissement,nomenclatureActivitePrincipaleEtablissement,caractereEmployeurEtablissement,longitude,latitude,geo_score,geo_type,geo_adresse,geo_id,geo_ligne,geo_l4,geo_l5
216201277,00011,21620127700011,O,1983-03-01,02,2020,,2022-08-29T09:08:11,true,4,,,,CHE,DEPARTEMENTAL 127,62650,BEZINGHEM,,,62127,,,,,,,,,,,,,,,,,,,2008-01-01,A,MAIRIE,,,,84.11Z,NAFRev2,O,,,0,,,,,,
216201277,00029,21620127700029,O,1983-12-21,01,2020,,2022-08-29T09:08:11,false,4,,,,PL,DE L'EGLISE,62650,BEZINGHEM,,,62127,,,,,,,,,,,,,,,,,,,2020-12-25,A,ECOLE ELEMENTAIRE RPI 71,,,,85.20Z,NAFRev2,N,1.839652,50.596211,0.34,street,Impasse de la Ferme du Fay 62650 Bezinghem,62127_0020,G,IMPASSE DE LA FERME DU FAY,
266201276,00018,26620127600018,O,1983-03-01,NN,,,2016-07-23T12:21:38,true,4,MAIRIE,,,CHE,DEPARTEMENTAL 127,62650,BEZINGHEM,,,62127,,,,,,,,,,,,,,,,,,,2016-01-01,F,CCAS,,,,88.99B,NAFRev2,N,,,0,,,,,,
304419864,00018,30441986400018,O,1976-01-01,NN,,,,true,3,LES AULNES HAMD ESGRANGES,,,RTE,DE MONTREUIL,62650,BEZINGHEM,,,62127,,,,,,,,,,,,,,,,,,,2002-11-29,F,,,,,70.2C,NAF1993,N,1.823973,50.593259,0.78,street,Rue de Montreuil 62650 Bezinghem,62127_0030,G,RUE DE MONTREUIL,
323611582,00012,32361158200012,O,,,,,,true,1,,,,RUE,PUCHELARD,62650,BEZINGHEM,,,62127,,,,,,,,,,,,,,,,,,,1997-02-17,F,,,,,01.3Z,NAF1993,N,1.830874,50.598249,0.74,street,Rue du Puchelart 62650 Bezinghem,62127_0040,G,RUE DU PUCHELART,
331713685,00039,33171368500039,O,2001-04-01,,,,,true,1,,,,RUE,DE MONTREUIL,62650,BEZINGHEM,,,62127,,,,,,,,,,,,,,,,,,,2001-09-30,F,,,,,55.5D,NAF1993,N,1.823973,50.593259,0.94,street,Rue de Montreuil 62650 Bezinghem,62127_0030,G,RUE DE MONTREUIL,
332658723,00017,33265872300017,O,1985-05-02,NN,,,,false,4,,,,,,62650,BEZINGHEM,,,62127,,,,,,,,,,,,,,,,,,,1998-02-04,F,,,,,51.1A,NAF1993,O,,,0,,,,,,
334466430,00033,33446643000033,O,2010-02-15,,,,2012-11-09T00:31:04,false,2,,33,,RUE,DES GRANGES,62650,BEZINGHEM,,,62127,,,,,,,,,,,,,,,,,,,2010-05-20,F,,,,,43.99C,NAFRev2,N,1.825546,50.591768,0.75,housenumber,33 Rue d'Egranges 62650 Bezinghem,62127_0012_00033,G,33 RUE D EGRANGES,
335114187,00016,33511418700016,O,1985-01-01,NN,,,2006-12-15T00:27:56,false,4,,,,,LE FAILLY,62650,BEZINGHEM,,,62127,,,,,,,,,,,,,,,,,,,1999-04-01,F,,,,,01.3Z,NAF1993,N,1.839564,50.59618,0.37,locality,Le Hameau du Fay 62650 Bezinghem,62127_B038,G,LE HAMEAU DU FAY,
335114187,00024,33511418700024,O,2002-01-10,NN,,,2018-04-12T08:35:06,true,5,LE FRAY,,,HAM,DU FAY,62650,BEZINGHEM,,,62127,,,,,,,,,,,,,,,,,,,2016-12-31,A,,,,,68.20A,NAFRev2,N,1.833171,50.595767,0.92,street,Route du Fay 62650 Bezinghem,62127_0019,G,ROUTE DU FAY,
338906779,00016,33890677900016,O,1900-01-01,NN,,,2013-02-05T15:28:01,true,6,,235,,RUE,DE GRIGNY,62650,BEZINGHEM,,,62127,,,,,,,,,,,,,,,,,,,2011-12-30,F,,,,,01.50Z,NAFRev2,N,1.84937,50.589767,0.94,housenumber,235 Rue de Grigny 62650 Bezinghem,62127_0027_00235,G,235 RUE DE GRIGNY,
340589811,00017,34058981100017,O,1987-01-01,NN,,,2008-01-04T21:43:45,true,3,,,,HAM,DE GOURNAY,62650,BEZINGHEM,,,62127,,,,,,,,,,,,,,,,,,,2008-01-01,A,,,,,01.41Z,NAFRev2,N,1.870937,50.597736,0.93,street,Rue de Gournay 62650 Bezinghem,62127_0023,G,RUE DE GOURNAY,
341580082,00012,34158008200012,O,,NN,,,,true,1,,,,RUE,DES PRES,62650,BEZINGHEM,,,62127,,,,,,,,,,,,,,,,,,,1989-08-31,F,,,,,84.12,NAP,N,1.874918,50.619514,0.62,street,Rue des Courtils 62650 Bezinghem,62127_1pdhy6,G,RUE DES COURTILS,
343600052,00017,34360005200017,O,1987-04-01,NN,,,2008-01-04T22:17:20,true,3,,,,,,62650,BEZINGHEM,,,62127,,,,,,,,,,,,,,,,,,,2008-01-01,A,,,,,01.41Z,NAFRev2,N,,,0,,,,,,
344314380,00017,34431438000017,O,,NN,,,,true,1,,,,,LE MARAIS,62650,BEZINGHEM,,,62127,,,,,,,,,,,,,,,,,,,1988-12-31,F,,,,,01.56,NAP,N,1.820167,50.588589,0.37,street,Le Bois de Commont 62650 Bezinghem,62127_B007,G,LE BOIS DE COMMONT,
344314604,00010,34431460400010,O,,NN,,,,true,1,,,,,LE MARAIS,62650,BEZINGHEM,,,62127,,,,,,,,,,,,,,,,,,,1988-12-31,F,,,,,01.56,NAP,N,1.820167,50.588589,0.37,street,Le Bois de Commont 62650 Bezinghem,62127_B007,G,LE BOIS DE COMMONT,
344558531,00028,34455853100028,O,2006-04-01,11,2020,,2023-04-02T03:36:45,true,2,DEPARTEMENTALE 343,440,,RTE,D HUCQUELIERS,62650,BEZINGHEM,,,62127,,,,,,,,,,,,,,,,,,,2008-01-01,A,,,,,49.41B,NAFRev2,O,1.883669,50.600125,0.86,housenumber,440 Route d'Hucqueliers 62650 Bezinghem,62127_0025_00440,G,440 ROUTE D HUCQUELIERS,
378464838,00010,37846483800010,O,1990-03-01,01,2020,,2022-08-29T09:05:37,true,3,LES AULNES,114,,HAM,D ESGRANGES,62650,BEZINGHEM,,,62127,,,,,,,,,,,,,,,,,,,2008-01-01,A,,,,,55.30Z,NAFRev2,O,1.826166,50.585299,0.71,housenumber,114 Rue d'Egranges 62650 Bezinghem,62127_0012_00114,G,114 RUE D EGRANGES,
381693522,00017,38169352200017,O,1991-03-28,NN,,,,false,4,,,,,HAMEAU D ESGRANGES,62650,BEZINGHEM,,,62127,,,,,,,,,,,,,,,,,,,2001-07-05,F,,,,,71.3A,NAF1993,N,1.826413,50.584984,0.69,street,Le Hameau d'Egrange 62650 Bezinghem,62127_B033,G,LE HAMEAU D EGRANGE,
381693522,00025,38169352200025,O,2001-07-05,NN,,,2018-09-29T12:10:19,true,3,MAIRIE,,,CHE,DEPARTEMENTAL 127,62650,BEZINGHEM,,,62127,,,,,,,,,,,,,,,,,,,2008-01-01,A,,,,,77.31Z,NAFRev2,N,,,0,,,,,,
382528743,00018,38252874300018,O,1991-07-17,NN,,,2016-09-02T04:26:47,true,4,,,,,FERME DE BEAURIETZ,62650,BEZINGHEM,,,62127,,,,,,,,,,,,,,,,,,,2008-08-31,F,,,,,01.11Z,NAFRev2,N,1.861664,50.596651,0.71,street,Rue de Beaurietz 62650 Bezinghem,62127_0004,G,RUE DE BEAURIETZ,
387892920,00019,38789292000019,O,1992-06-19,NN,,,2008-01-04T23:00:49,true,3,,,,,HAMEAU DE LA FOLIE,62650,BEZINGHEM,,,62127,,,,,,,,,,,,,,,,,,,2008-01-01,A,,,,,68.20A,NAFRev2,N,1.853253,50.609579,0.93,locality,Hameau de la Folie 62650 Bezinghem,62127_B037,G,HAMEAU DE LA FOLIE,
388359176,00012,38835917600012,O,,,,,,true,1,,,,RUE,DE L EGLISE,62650,BEZINGHEM,,,62127,,,,,,,,,,,,,,,,,,,1992-12-31,F,,,,,45.2L,NAF1993,N,1.854418,50.609808,0.49,street,Rue de la Folie 62650 Bezinghem,62127_0021,G,RUE DE LA FOLIE,
388906992,00010,38890699200010,O,1992-07-01,,,,,true,4,,,,RUE,DE L'EGLISE,62650,BEZINGHEM,,,62127,,,,,,,,,,,,,,,,,,,1993-12-25,F,,,,,20.3Z,NAF1993,N,1.854418,50.609808,0.49,street,Rue de la Folie 62650 Bezinghem,62127_0021,G,RUE DE LA FOLIE,
390086858,00011,39008685800011,O,1993-01-01,NN,,,2007-01-18T09:32:24,true,3,LE FAY,,,,,62650,BEZINGHEM,,,62127,,,,,,,,,,,,,,,,,,,1996-01-01,F,,,,,01.3Z,NAF1993,N,1.839564,50.59618,0.77,locality,Le Hameau du Fay 62650 Bezinghem,62127_B038,D,LE HAMEAU DU FAY,
391975117,00022,39197511700022,O,2008-01-01,11,2020,4321AB,2022-12-01T19:33:44,false,5,,354,,HAM,DE LA FOLIE,62650,BEZINGHEM,,,62127,,,,,,,,,,,,,,,,,,,2022-09-30,F,,,,,82.99Z,NAFRev2,N,1.858063,50.611801,0.88,housenumber,354 Rue de la Folie 62650 Bezinghem,62127_0021_00354,G,354 RUE DE LA FOLIE,
394240626,00017,39424062600017,O,1994-01-01,01,2020,,2022-08-29T09:18:00,true,4,,,,HAM,D'ESGRANGES,62650,BEZINGHEM,,,62127,,,,,,,,,,,,,,,,,,,2014-12-31,A,,,,,01.41Z,NAFRev2,O,1.826349,50.584482,0.71,street,Rue d'Egranges 62650 Bezinghem,62127_0012,G,RUE D EGRANGES,
395237357,00011,39523735700011,O,1994-04-01,NN,,,2006-10-28T02:20:24,true,3,,,,,HAMEAU DE GOURNAY,62650,BEZINGHEM,,,62127,,,,,,,,,,,,,,,,,,,2004-11-30,F,,,,,01.3Z,NAFRev1,N,1.870937,50.597736,0.6,street,Rue de Gournay 62650 Bezinghem,62127_0023,G,RUE DE GOURNAY,
397892142,00019,39789214200019,O,1976-01-01,NN,,,,true,3,,,,,ESGRANGES,62650,BEZINGHEM,,,62127,,,,,,,,,,,,,,,,,,,2003-12-22,F,,,,,01.1A,NAFRev1,N,1.826349,50.584482,0.66,street,Rue d'Egranges 62650 Bezinghem,62127_0012,G,RUE D EGRANGES,
398022517,00021,39802251700021,O,1994-07-27,NN,,,,true,4,,,,,HAMEAU DE GOURNAY,62650,BEZINGHEM,,,62127,,,,,,,,,,,,,,,,,,,2002-09-25,F,,,,,92.3H,NAF1993,O,1.870937,50.597736,0.6,street,Rue de Gournay 62650 Bezinghem,62127_0023,G,RUE DE GOURNAY,
399582725,00012,39958272500012,O,1995-01-01,NN,,,2008-01-04T19:12:23,true,3,,,,HAM,DE GOURNAY,62650,BEZINGHEM,,,62127,,,,,,,,,,,,,,,,,,,2008-01-01,A,,,,,01.50Z,NAFRev2,N,1.870937,50.597736,0.93,street,Rue de Gournay 62650 Bezinghem,62127_0023,G,RUE DE GOURNAY,
400700829,00015,40070082900015,O,1995-05-01,NN,,,,true,1,,,,,,62650,BEZINGHEM,,,62127,,,,,,,,,,,,,,,,,,,2000-12-31,F,,,,,55.4B,NAF1993,N,,,0,,,,,,
400816724,00019,40081672400019,O,1984-01-01,NN,,,2008-03-17T13:23:54,true,3,,,,,ESGRANGES,62650,BEZINGHEM,,,62127,,,,,,,,,,,,,,,,,,,2007-12-26,F,,,,,01.3Z,NAFRev1,N,1.826349,50.584482,0.66,street,Rue d'Egranges 62650 Bezinghem,62127_0012,G,RUE D EGRANGES,
401372602,00011,40137260200011,O,1993-01-01,NN,,,2007-06-15T07:43:29,true,3,,,,,,62650,BEZINGHEM,,,62127,,,,,,,,,,,,,,,,,,,2007-01-31,F,,,,,02.0D,NAFRev1,N,,,0,,,,,,
403206139,00012,40320613900012,O,1995-11-15,NN,,,2008-10-05T05:56:26,true,3,,,,HAM,DE GRIGNY,62650,BEZINGHEM,,,62127,,,,,,,,,,,,,,,,,,,2008-01-01,A,,,,,01.41Z,NAFRev2,N,1.851404,50.589593,0.93,street,Rue de Grigny 62650 Bezinghem,62127_0027,G,RUE DE GRIGNY,
403579402,00013,40357940200013,O,1996-01-01,NN,,,2019-03-06T09:09:02,true,3,LE FAY,,,,,62650,BEZINGHEM,,,62127,,,,,,,,,,,,,,,,,,,2008-01-01,A,,,,,01.50Z,NAFRev2,N,1.839564,50.59618,0.77,locality,Le Hameau du Fay 62650 Bezinghem,62127_B038,D,LE HAMEAU DU FAY,
404230849,00014,40423084900014,O,1974-03-01,NN,,,2017-09-13T12:22:42,true,5,,,,,,62650,BEZINGHEM,,,62127,,,,,,,,,,,,,,,,,,,2016-12-31,F,,,,,68.20B,NAFRev2,N,,,0,,,,,,
404249120,00019,40424912000019,O,1957-01-01,NN,,,2008-01-04T20:37:39,true,3,,,,,,62650,BEZINGHEM,,,62127,,,,,,,,,,,,,,,,,,,2008-01-01,A,,,,,01.11Z,NAFRev2,N,,,0,,,,,,
404249138,00011,40424913800011,O,1970-01-01,NN,,,,true,4,,,,,,62650,BEZINGHEM,,,62127,,,,,,,,,,,,,,,,,,,1999-08-31,F,,,,,01.1A,NAF1993,N,,,0,,,,,,
404249146,00014,40424914600014,O,1969-01-01,NN,,,,true,1,,,,,,62650,BEZINGHEM,,,62127,,,,,,,,,,,,,,,,,,,2000-10-01,F,,,,,01.3Z,NAF1993,N,,,0,,,,,,
404249153,00010,40424915300010,O,1969-01-01,NN,,,,true,3,,,,,,62650,BEZINGHEM,,,62127,,,,,,,,,,,,,,,,,,,2003-12-31,F,,,,,01.3Z,NAFRev1,N,,,0,,,,,,
404249161,00013,40424916100013,O,1983-07-01,NN,,,2006-10-28T03:20:07,true,3,,,,HAM,,62650,BEZINGHEM,,,62127,,,,,,,,,,,,,,,,,,,2004-12-01,F,,,,,01.3Z,NAFRev1,N,,,0,,,,,,
404249179,00015,40424917900015,O,1976-04-07,NN,,,2008-01-04T20:37:39,true,3,,,,,LE VILLAGE,62650,BEZINGHEM,,,62127,,,,,,,,,,,,,,,,,,,2007-12-31,F,,,,,01.3Z,NAFRev1,N,1.826413,50.584984,0.34,street,Le Hameau d'Egrange 62650 Bezinghem,62127_B033,G,LE HAMEAU D EGRANGE,
404249187,00018,40424918700018,O,1982-12-31,NN,,,2008-01-04T20:37:39,true,3,,,,,,62650,BEZINGHEM,,,62127,,,,,,,,,,,,,,,,,,,2008-01-01,A,,,,,01.11Z,NAFRev2,N,,,0,,,,,,
404249195,00011,40424919500011,O,1984-10-01,NN,,,,true,3,,,,HAM,DE LA FOLIE,62650,BEZINGHEM,,,62127,,,,,,,,,,,,,,,,,,,2003-02-05,F,,,,,01.2C,NAFRev1,N,1.854418,50.609808,0.93,street,Rue de la Folie 62650 Bezinghem,62127_0021,G,RUE DE LA FOLIE,
404262727,00021,40426272700021,O,2003-02-05,NN,,,2021-10-27T08:30:27,true,4,,280,,RUE,DE LA FOLIE,62650,BEZINGHEM,,,62127,,,,,,,,,,,,,,,,,,,2019-10-31,F,,,,,01.43Z,NAFRev2,N,1.851098,50.607578,0.95,housenumber,280 Rue de la Folie 62650 Bezinghem,62127_0021_00280,G,280 RUE DE LA FOLIE,
408075539,00010,40807553900010,O,1991-01-01,NN,,,2016-05-04T04:11:42,true,4,,,,,BEAURIETZ,62650,BEZINGHEM,,,62127,,,,,,,,,,,,,,,,,,,2016-04-30,F,,,,,68.20B,NAFRev2,N,1.86131,50.596598,0.93,street,Beaurietz 62650 Bezinghem,62127_sdobyf,G,BEAURIETZ,
408793008,00017,40879300800017,O,1977-11-01,NN,,,2010-07-05T21:58:18,true,4,,,,,,62650,BEZINGHEM,,,62127,,,,,,,,,,,,,,,,,,,2008-01-01,A,,,,,68.20B,NAFRev2,N,,,0,,,,,,
408793016,00010,40879301600010,O,1984-12-31,NN,,,2006-10-28T03:36:41,true,3,,,,RUE,DU MARAIS,62650,BEZINGHEM,,,62127,,,,,,,,,,,,,,,,,,,2004-10-01,F,,,,,01.3Z,NAFRev1,N,1.86566,50.602604,0.53,street,Rue du Moulin 62650 Bezinghem,62127_0032,G,RUE DU MOULIN,
408793024,00014,40879302400014,O,1983-10-01,NN,,,2008-01-04T21:16:51,true,3,,,,,,62650,BEZINGHEM,,,62127,,,,,,,,,,,,,,,,,,,2008-01-01,A,,,,,01.41Z,NAFRev2,N,,,0,,,,,,
410645360,00018,41064536000018,O,1997-01-06,,,,2008-11-08T01:23:41,false,2,,,,,BEAURIETZ,62650,BEZINGHEM,,,62127,,,,,,,,,,,,,,,,,,,1997-09-30,F,,,,,,,,1.86131,50.596598,0.93,street,Beaurietz 62650 Bezinghem,62127_sdobyf,G,BEAURIETZ,
410887467,00018,41088746700018,O,1997-01-01,NN,,,2021-11-18T16:19:36,true,5,,,,,LIEU DIT LE MARAIS,62650,BEZINGHEM,,,62127,,,,,,,,,,,,,,,,,,,2020-12-31,F,,,,,68.20B,NAFRev2,N,1.820167,50.588589,0.37,street,Le Bois de Commont 62650 Bezinghem,62127_B007,G,LE BOIS DE COMMONT,
413821398,00018,41382139800018,O,1997-07-01,NN,,,2009-10-05T10:28:29,true,6,,,,,HAMEAU D ESGRANGES,62650,BEZINGHEM,,,62127,,,,,,,,,,,,,,,,,,,2009-07-01,F,,,,,56.10A,NAFRev2,N,1.826413,50.584984,0.69,street,Le Hameau d'Egrange 62650 Bezinghem,62127_B033,G,LE HAMEAU D EGRANGE,
414198499,00017,41419849900017,O,1997-09-17,NN,,,2011-09-06T09:24:26,true,4,HARAS DE LA CARNOYE,,,RUE,DES PRES,62650,BEZINGHEM,,,62127,,,,,,,,,,,,,,,,,,,2011-05-27,F,,,,,46.49Z,NAFRev2,N,1.874918,50.619514,0.62,street,Rue des Courtils 62650 Bezinghem,62127_1pdhy6,G,RUE DES COURTILS,
414419101,00012,41441910100012,O,1996-05-01,NN,,,2006-11-25T15:46:44,true,1,,,,,HAMEAU DE GOURNAY,62650,BEZINGHEM,,,62127,,,,,,,,,,,,,,,,,,,2002-09-30,F,,,,,74.1J,NAF1993,N,1.870937,50.597736,0.6,street,Rue de Gournay 62650 Bezinghem,62127_0023,G,RUE DE GOURNAY,
417771227,00028,41777122700028,O,1999-06-30,,,,2006-11-25T15:53:32,true,1,,,,,LES CHATEAUX,62650,BEZINGHEM,,,62127,,,,,,,,,,,,,,,,,,,1999-06-30,F,,,,,74.1J,NAF1993,N,7.2730037,48.0387598,0.89,poi.castle,(Château) Husseren-les-Châteaux,https://osm.org/way/485380133,G,,
420571341,00015,42057134100015,O,1998-10-01,NN,,,,true,3,,,,,HAMEAU DES GRANGES,62650,BEZINGHEM,,,62127,,,,,,,,,,,,,,,,,,,2003-12-22,F,,,,,01.1A,NAFRev1,N,1.826413,50.584984,0.62,street,Le Hameau d'Egrange 62650 Bezinghem,62127_B033,G,LE HAMEAU D EGRANGE,
421970955,00017,42197095500017,O,1999-01-02,NN,,,2014-07-08T01:57:51,true,4,,,,,LES CHATEAUX,62650,BEZINGHEM,,,62127,,,,,,,,,,,,,,,,,,,2009-09-15,F,,,,,41.20A,NAFRev2,O,7.2730037,48.0387598,0.89,poi.castle,(Château) Husseren-les-Châteaux,https://osm.org/way/485380133,G,,
423052935,00073,42305293500073,P,2021-04-01,,,,2023-04-27T03:42:29,true,2,[ND],[ND],[ND],[ND],[ND],[ND],BEZINGHEM,,[ND],62127,[ND],[ND],,,[ND],[ND],[ND],[ND],[ND],[ND],,,[ND],,[ND],[ND],,,2023-04-06,F,[ND],[ND],[ND],[ND],46.19B,NAFRev2,N,,,0,,,,,,
423360338,00010,42336033800010,O,1999-05-01,NN,,,2023-04-12T03:42:34,true,3,,,,,LE FAY,62650,BEZINGHEM,,,62127,,,,,,,,,,,,,,,,,,,2008-01-01,A,,,,,01.11Z,NAFRev2,N,1.839564,50.59618,0.77,locality,Le Hameau du Fay 62650 Bezinghem,62127_B038,G,LE HAMEAU DU FAY,
423604669,00014,42360466900014,O,1999-07-05,NN,,,2012-05-05T06:54:25,true,5,,,,,LE FAY,62650,BEZINGHEM,,,62127,,,,,,,,,,,,,,,,,,,2010-08-31,F,,,,,16.29Z,NAFRev2,O,1.839564,50.59618,0.77,locality,Le Hameau du Fay 62650 Bezinghem,62127_B038,G,LE HAMEAU DU FAY,
428310106,00011,42831010600011,O,1977-01-01,NN,,,2008-01-05T01:25:30,true,3,,,,,,62650,BEZINGHEM,,,62127,,,,,,,,,,,,,,,,,,,2008-01-01,A,,,,,68.20B,NAFRev2,N,,,0,,,,,,
429377641,00015,42937764100015,O,2000-02-01,NN,,,2008-01-05T01:38:25,true,3,MR DE SAINTE MARESVILLE,,,HAM,LE FAY,62650,BEZINGHEM,,,62127,,,,,,,,,,,,,,,,,,,2008-01-01,A,,,,,68.20A,NAFRev2,N,1.839564,50.59618,0.77,locality,Le Hameau du Fay 62650 Bezinghem,62127_B038,G,LE HAMEAU DU FAY,
433043445,00017,43304344500017,O,2000-10-01,NN,,,,true,4,,,,HAM,DE BEAURIETZ,62650,BEZINGHEM,,,62127,,,,,,,,,,,,,,,,,,,2002-10-31,F,,,,,01.3Z,NAF1993,N,1.861664,50.596651,0.93,street,Rue de Beaurietz 62650 Bezinghem,62127_0004,G,RUE DE BEAURIETZ,
438704207,00010,43870420700010,O,2001-07-01,NN,,,2007-01-04T11:52:37,true,3,LA PLACE,,,,,62650,BEZINGHEM,,,62127,,,,,,,,,,,,,,,,,,,2006-12-31,F,,,,,55.4B,NAFRev1,N,1.854418,50.609808,0.31,street,Rue de la Folie 62650 Bezinghem,62127_0021,D,RUE DE LA FOLIE,
441011392,00012,44101139200012,O,1996-01-09,NN,,,2008-01-04T21:10:02,true,3,,,,RUE,DU MARAIS,62650,BEZINGHEM,,,62127,,,,,,,,,,,,,,,,,,,2008-01-01,A,,,,,01.45Z,NAFRev2,N,1.86566,50.602604,0.53,street,Rue du Moulin 62650 Bezinghem,62127_0032,G,RUE DU MOULIN,
444138317,00011,44413831700011,O,2002-11-01,NN,,,2017-10-30T09:18:30,true,3,,316,,HAM,DU BEAU RIETZ,62650,BEZINGHEM,,,62127,,,,,,,,,,,,,,,,,,,2008-01-01,A,,,,,01.50Z,NAFRev2,N,,,0,,,,,,
444138317,00029,44413831700029,O,2010-09-01,,,,2017-10-30T09:13:35,false,2,,316,,,HAMEAU DE BEAURIETZ,62650,BEZINGHEM,,,62127,,,,,,,,,,,,,,,,,,,2017-10-10,F,,,,,70.10Z,NAFRev2,N,1.860861,50.5969,0.93,street,Le Hameau de Beaurietz 62650 Bezinghem,62127_B034,G,LE HAMEAU DE BEAURIETZ,
444990055,00014,44499005500014,O,2003-01-13,NN,,,2009-05-15T04:57:20,true,4,,,,,GOURNAY,62650,BEZINGHEM,,,62127,,,,,,,,,,,,,,,,,,,2009-04-01,A,,,,,68.20B,NAFRev2,N,1.870937,50.597736,0.92,street,Rue de Gournay 62650 Bezinghem,62127_0023,G,RUE DE GOURNAY,
449291772,00019,44929177200019,O,2003-07-01,NN,,,2016-07-13T03:34:17,true,4,BOIS DE COMMONT,,,,BOIS DE COMMONT,62650,BEZINGHEM,,,62127,,,,,,,,,,,,,,,,,,,2011-03-31,A,,,,,35.11Z,NAFRev2,N,1.820167,50.588589,0.93,street,Le Bois de Commont 62650 Bezinghem,62127_B007,G,LE BOIS DE COMMONT,
451805667,00016,45180566700016,O,2003-12-23,NN,,,2015-05-13T03:37:34,true,3,ESGRANGES,,,,,62650,BEZINGHEM,,,62127,,,,,,,,,,,,,,,,,,,2008-01-01,A,,,,,01.50Z,NAFRev2,N,1.826349,50.584482,0.66,street,Rue d'Egranges 62650 Bezinghem,62127_0012,D,RUE D EGRANGES,
451920839,00011,45192083900011,O,2004-01-01,NN,,,2023-06-08T03:43:11,true,3,LE MARAIS,,,,,62650,BEZINGHEM,,,62127,,,,,,,,,,,,,,,,,,,2008-01-01,A,,,,,01.41Z,NAFRev2,N,1.820167,50.588589,0.37,street,Le Bois de Commont 62650 Bezinghem,62127_B007,D,LE BOIS DE COMMONT,
453767204,00010,45376720400010,O,2003-01-01,NN,,,2008-01-05T03:11:12,true,3,VVE DELSEAUX-MALVOISIN M.,,,,LES AULNES,62650,BEZINGHEM,,,62127,,,,,,,,,,,,,,,,,,,2008-01-01,A,,,,,68.20A,NAFRev2,N,1.825797,50.585173,0.37,street,Les Fonds d'Egrange 62650 Bezinghem,62127_B030,G,LES FONDS D EGRANGE,
479239592,00013,47923959200013,O,2004-10-01,01,2020,,2022-08-29T09:12:18,true,3,,,,RUE,DU MARAIS,62650,BEZINGHEM,,,62127,,,,,,,,,,,,,,,,,,,2008-01-01,A,,,,,01.11Z,NAFRev2,N,1.86566,50.602604,0.53,street,Rue du Moulin 62650 Bezinghem,62127_0032,G,RUE DU MOULIN,
479359127,00012,47935912700012,O,2004-07-01,NN,,,2017-06-26T08:35:23,true,4,,,,,HAMEAU DE GRIGNY,62650,BEZINGHEM,,,62127,,,,,,,,,,,,,,,,,,,2017-06-21,A,,,,,70.22Z,NAFRev2,O,1.851404,50.589593,0.58,street,Rue de Grigny 62650 Bezinghem,62127_0027,G,RUE DE GRIGNY,
479671562,00011,47967156200011,O,2004-11-01,,,,2017-10-10T11:32:51,true,3,,,,HAM,DE GRIGNY,62650,BEZINGHEM,,,62127,,,,,,,,,,,,,,,,,,,2008-01-01,A,,,,,01.50Z,NAFRev2,N,1.851404,50.589593,0.93,street,Rue de Grigny 62650 Bezinghem,62127_0027,G,RUE DE GRIGNY,
479671562,00029,47967156200029,O,2017-08-16,,,,2021-02-23T13:42:17,false,1,,251,,RUE,GRIGNY,62650,BEZINGHEM,,,62127,,,,,,,,,,,,,,,,,,,2017-08-16,A,,,,,35.11Z,NAFRev2,N,1.851404,50.589593,0.93,housenumber,251 Rue de Grigny 62650 Bezinghem,62127_0027_00251,G,251 RUE DE GRIGNY,
479710717,00022,47971071700022,O,2020-02-01,,,,2021-02-23T13:42:20,true,1,,320,,RUE,DE BEAURIETZ,62650,BEZINGHEM,,,62127,,,,,,,,,,,,,,,,,,,2020-02-01,A,,,,,01.46Z,NAFRev2,N,1.861361,50.5963,0.94,housenumber,320 Rue de Beaurietz 62650 Bezinghem,62127_0004_00320,G,320 RUE DE BEAURIETZ,
480850791,00033,48085079100033,O,2020-07-01,01,2020,,2022-08-29T09:14:14,true,1,,251,,RUE,DE GRIGNY,62650,BEZINGHEM,,,62127,,,,,,,,,,,,,,,,,,,2020-07-01,A,,,,,78.30Z,NAFRev2,O,1.851404,50.589593,0.94,housenumber,251 Rue de Grigny 62650 Bezinghem,62127_0027_00251,G,251 RUE DE GRIGNY,
481942654,00015,48194265400015,O,2005-04-20,,,,2019-09-04T08:41:45,true,2,,,,,HAMEAU DE GOURNAY,62650,BEZINGHEM,,,62127,,,,,,,,,,,,,,,,,,,2008-01-01,A,,,,,68.20A,NAFRev2,N,1.870937,50.597736,0.6,street,Rue de Gournay 62650 Bezinghem,62127_0023,G,RUE DE GOURNAY,
492187356,00018,49218735600018,O,2006-10-02,NN,,,2015-05-14T08:19:51,true,4,,465,,RTE,D'HUCQUELIERS,62650,BEZINGHEM,,,62127,,,,,,,,,,,,,,,,,,,2013-07-30,F,,,,,43.22A,NAFRev2,O,1.886523,50.596897,0.86,housenumber,465 Route d'Hucqueliers 62650 Bezinghem,62127_0025_00465,G,465 ROUTE D HUCQUELIERS,
500315650,00019,50031565000019,O,2007-09-15,,,,2016-12-30T08:54:27,true,5,,17,,RUE,PRINCIPALE,62650,BEZINGHEM,,,62127,,,,,,,,,,,,,,,,,,,2016-12-31,F,,,,,69.10Z,NAFRev2,N,1.826422,50.595896,0.95,housenumber,17 Rue Principale 62650 Bezinghem,62127_0037_00017,G,17 RUE PRINCIPALE,
501591994,00014,50159199400014,O,2008-01-01,,,,2021-02-23T14:12:03,true,2,,32,,RUE,PRINCIPALE,62650,BEZINGHEM,,,62127,,,,,,,,,,,,,,,,,,,2014-10-31,A,,,,,01.11Z,NAFRev2,N,1.828558,50.596685,0.95,housenumber,32 Rue Principale 62650 Bezinghem,62127_0037_00032,G,32 RUE PRINCIPALE,
501845697,00017,50184569700017,O,2008-01-01,,,,2013-01-04T09:12:43,false,2,,280,,RUE,DE LA FOLIE,62650,BEZINGHEM,,,62127,,,,,,,,,,,,,,,,,,,2012-08-31,F,EQUI D'OR,,,,93.19Z,NAFRev2,N,1.851098,50.607578,0.95,housenumber,280 Rue de la Folie 62650 Bezinghem,62127_0021_00280,G,280 RUE DE LA FOLIE,
502121858,00018,50212185800018,O,2007-12-26,,,,2009-05-15T04:57:21,true,2,HAMEAU D'ESGRANGES,128,,RUE,D'ESGRANGES,62650,BEZINGHEM,,,62127,,,,,,,,,,,,,,,,,,,2009-04-01,A,,,,,68.20B,NAFRev2,N,1.826681,50.583231,0.82,housenumber,128 Rue d'Egranges 62650 Bezinghem,62127_0012_00128,G,128 RUE D EGRANGES,
502207434,00015,50220743400015,O,2008-02-02,,,,2016-07-18T10:41:34,false,2,,270,,RUE,DE LA FOLIE,62650,BEZINGHEM,,,62127,,,,,,,,,,,,,,,,,,,2008-06-30,F,,,,,47.82Z,NAFRev2,N,1.850354,50.60675,0.95,housenumber,270 Rue de la Folie 62650 Bezinghem,62127_0021_00270,G,270 RUE DE LA FOLIE,
502207434,00031,50220743400031,O,2016-08-01,,,,2021-11-15T03:32:52,true,2,,284,,RUE,DE LA FOLIE,62650,BEZINGHEM,,,62127,,,,,,,,,,,,,,,,,,,2021-09-30,F,,,,,86.90D,NAFRev2,N,1.852031,50.60752,0.95,housenumber,284 Rue de la Folie 62650 Bezinghem,62127_0021_00284,G,284 RUE DE LA FOLIE,
505331256,00014,50533125600014,O,2008-08-01,NN,,,2018-11-28T04:01:02,true,4,,10,,RUE,DE MONTREUIL,62650,BEZINGHEM,,,62127,,,,,,,,,,,,,,,,,,,2018-10-19,F,,,,,68.31Z,NAFRev2,N,1.824184,50.593973,0.94,housenumber,10 Rue de Montreuil 62650 Bezinghem,62127_0030_00010,G,10 RUE DE MONTREUIL,
508605359,00019,50860535900019,O,2008-10-01,,,,2008-10-17T13:58:11,true,1,,177,,RUE,EGRANGE,62650,BEZINGHEM,,,62127,,,,,,,,,,,,,,,,,,,2008-10-01,A,,,,,55.20Z,NAFRev2,N,1.82673,50.578957,0.83,housenumber,177 Rue d'Egranges 62650 Bezinghem,62127_0012_00177,G,177 RUE D EGRANGES,
511889024,00010,51188902400010,O,2009-03-01,,,,2009-04-17T09:55:57,true,1,,362,,RUE,DE LA FOLIE,62650,BEZINGHEM,,,62127,,,,,,,,,,,,,,,,,,,2009-03-01,A,,,,,68.20B,NAFRev2,N,1.860014,50.611706,0.95,housenumber,362 Rue de la Folie 62650 Bezinghem,62127_0021_00362,G,362 RUE DE LA FOLIE,