siren,nic,siret,statutDiffusionEtablissement,dateCreationEtablissement,trancheEffectifsEtablissement,anneeEffectifsEtablissement,activitePrincipaleRegistreMetiersEtablissement,dateDernierTraitementEtablissement,etablissementSiege,nombrePeriodesEtablissement,complementAdresseEtablissement,numeroVoieEtablissement,indiceRepetitionEtablissement,typeVoieEtablissement,libelleVoieEtablissement,codePostalEtablissement,libelleCommuneEtablissement,libelleCommuneEtrangerEtablissement,distributionSpecialeEtablissement,codeCommuneEtablissement,codeCedexEtablissement,libelleCedexEtablissement,codePaysEtrangerEtablissement,libellePaysEtrangerEtablissement,complementAdresse2Etablissement,numeroVoie2Etablissement,indiceRepetition2Etablissement,typeVoie2Etablissement,libelleVoie2Etablissement,codePostal2Etablissement,libelleCommune2Etablissement,libelleCommuneEtranger2Etablissement,distributionSpeciale2Etablissement,codeCommune2Etablissement,codeCedex2Etablissement,libelleCedex2Etablissement,codePaysEtranger2Etablissement,libellePaysEtranger2Etablissement,dateDebut,etatAdministratifEtablissement,enseigne1Etablissement,enseigne2Etablissement,enseigne3Etablissement,denominationUsuelleEtablissement,activitePrincipaleEtablissement,nomenclatureActivitePrincipaleEtablissement,caractereEmployeurEtablissement,longitude,latitude,geo_score,geo_type,geo_adresse,geo_id,geo_ligne,geo_l4,geo_l5
217100130,00012,21710013000012,O,1983-03-01,02,2020,,2022-08-29T09:08:37,true,3,,,,,,71270,AUTHUMES,,,71013,,,,,,,,,,,,,,,,,,,2008-01-01,A,MAIRIE,,,,84.11Z,NAFRev2,O,,,0,,,,,,
267100824,00015,26710082400015,O,1983-03-01,NN,,,2017-09-19T11:03:17,true,4,,,,,MAIRIE,71270,AUTHUMES,,,71013,,,,,,,,,,,,,,,,,,,2016-12-21,F,CCAS,,,,88.99B,NAFRev2,N,3.0709671,50.6304695,0.92,poi.townhall,Hôtel de Ville Lille,https://osm.org/way/40917078,G,,
297102659,00010,29710265900010,O,2004-01-01,,,,2008-01-04T19:07:54,true,3,,,,,MAIRIE,71270,AUTHUMES,,,71013,,,,,,,,,,,,,,,,,,,2008-01-01,A,,,,,42.99Z,NAFRev2,N,3.0709671,50.6304695,0.92,poi.townhall,Hôtel de Ville Lille,https://osm.org/way/40917078,G,,
314723727,00017,31472372700017,O,1979-01-01,NN,,,,true,4,,,,,,71270,AUTHUMES,,,71013,,,,,,,,,,,,,,,,,,,2000-10-15,F,,,,,01.1A,NAF1993,N,,,0,,,,,,
318417185,00044,31841718500044,O,2002-07-15,NN,,,2008-11-07T00:34:07,true,3,,15,,RUE,DES JUIFS,71270,AUTHUMES,,,71013,,,,,,,,,,,,,,,,,,,2004-08-31,F,,,,,60.2L,NAFRev1,N,5.292119,46.889906,0.94,housenumber,15 Rue des Juifs 71270 Authumes,71013_0110_00015,G,15 RUE DES JUIFS,
322803784,00014,32280378400014,O,1981-10-01,NN,,,2021-02-23T10:46:19,true,3,,13,,RUE,DES JUIFS,71270,AUTHUMES,,,71013,,,,,,,,,,,,,,,,,,,2008-01-01,A,,,,,01.11Z,NAFRev2,N,5.29557,46.891266,0.94,housenumber,13 Rue des Juifs 71270 Authumes,71013_0110_00013,G,13 RUE DES JUIFS,
328913777,00012,32891377700012,O,,,,,,true,1,,,,,,71270,AUTHUMES,,,71013,,,,,,,,,,,,,,,,,,,1985-12-25,F,,,,,62.11,NAP,N,,,0,,,,,,
330720459,00016,33072045900016,O,,NN,,,,true,1,,,,,,71270,AUTHUMES,,,71013,,,,,,,,,,,,,,,,,,,,F,,,,,67.01,NAP,N,,,0,,,,,,
333345312,00024,33334531200024,O,2018-06-27,,,,2021-02-23T10:52:49,true,1,,4,,RUE,DU GENET,71270,AUTHUMES,,,71013,,,,,,,,,,,,,,,,,,,2018-06-27,A,,,,,01.50Z,NAFRev2,N,5.30422,46.889972,0.94,housenumber,4 Rue du Genet 71270 Authumes,71013_0095_00004,G,4 RUE DU GENET,
340368620,00019,34036862000019,O,1987-01-01,NN,,,2013-08-19T14:45:33,true,5,,11,,RTE,DE FAY,71270,AUTHUMES,,,71013,,,,,,,,,,,,,,,,,,,2011-05-01,F,,,,,68.20B,NAFRev2,N,5.320873,46.880388,0.62,housenumber,11 Route du Fay 71270 Authumes,71013_0075_00011,G,11 ROUTE DU FAY,
350584439,00045,35058443900045,P,2019-09-01,,,,2022-01-13T09:21:39,false,2,[ND],[ND],[ND],[ND],[ND],[ND],AUTHUMES,,[ND],71013,[ND],[ND],,,[ND],[ND],[ND],[ND],[ND],[ND],,,[ND],,[ND],[ND],,,2022-02-01,F,[ND],[ND],[ND],[ND],85.59A,NAFRev2,N,,,0,,,,,,
350584439,00052,35058443900052,P,2022-02-01,,,,2022-02-05T13:37:04,true,1,[ND],[ND],[ND],[ND],[ND],[ND],AUTHUMES,,[ND],71013,[ND],[ND],,,[ND],[ND],[ND],[ND],[ND],[ND],,,[ND],,[ND],[ND],,,2022-02-01,A,[ND],[ND],[ND],[ND],85.59A,NAFRev2,N,,,0,,,,,,
390228567,00017,39022856700017,O,1992-07-01,NN,,,2020-04-03T07:52:36,false,3,,,,,,71270,AUTHUMES,,,71013,,,,,,,,,,,,,,,,,,,2008-01-01,A,,,,,68.20B,NAFRev2,N,,,0,,,,,,
390228567,00025,39022856700025,O,2019-12-17,,,,2020-04-03T07:52:36,true,1,,10,,RUE,DE LA GARE,71270,AUTHUMES,,,71013,,,,,,,,,,,,,,,,,,,2019-12-17,A,,,,,55.20Z,NAFRev2,N,5.299721,46.885699,0.94,housenumber,10 Rue de la Gare 71270 Authumes,71013_0090_00010,G,10 RUE DE LA GARE,
398203711,00039,39820371100039,O,1999-06-01,NN,,,2006-11-25T12:32:40,true,4,,1,,RTE,DE BELLEVESVRE,71270,AUTHUMES,,,71013,,,,,,,,,,,,,,,,,,,2005-06-30,F,,,,,51.8L,NAFRev1,N,5.304991,46.872686,0.86,housenumber,1 Route de Bellevesvre 71270 Authumes,71013_0020_00001,G,1 ROUTE DE BELLEVESVRE,
400135760,00017,40013576000017,O,1995-03-06,01,2020,,2022-08-29T09:21:13,true,3,,15,,RUE,DU BOURG,71270,AUTHUMES,,,71013,,,,,,,,,,,,,,,,,,,2008-01-01,A,,,,,81.30Z,NAFRev2,N,5.304813,46.886311,0.94,housenumber,15 Rue du Bourg 71270 Authumes,71013_0030_00015,G,15 RUE DU BOURG,
400518668,00019,40051866800019,O,1995-04-05,NN,,,2008-11-08T01:09:11,false,4,,,,,RAMOUILLE,71270,AUTHUMES,,,71013,,,,,,,,,,,,,,,,,,,1999-03-30,F,,,,,45.4F,NAF1993,N,5.311339,46.876114,0.92,street,Route de Ramouille 71270 Authumes,71013_0160,G,ROUTE DE RAMOUILLE,
400518668,00027,40051866800027,O,1999-03-30,NN,,,2008-11-08T01:09:11,false,3,,3,,RUE,DU FAUFOURG,71270,AUTHUMES,,,71013,,,,,,,,,,,,,,,,,,,2004-09-01,F,,,,,45.4F,NAFRev1,N,5.3047,46.892696,0.79,housenumber,3 Rue du Faubourg 71270 Authumes,71013_0070_00003,G,3 RUE DU FAUBOURG,
402661045,00011,40266104500011,O,1995-10-03,NN,,4520AB,2022-07-13T03:47:58,true,4,,,,,LE BOURG,71270,AUTHUMES,,,71013,,,,,,,,,,,,,,,,,,,2022-07-31,F,,,,,45.20A,NAFRev2,N,5.303888,46.888672,0.62,street,Rue du Bourg 71270 Authumes,71013_0030,G,RUE DU BOURG,
402922215,00015,40292221500015,O,,NN,,,,true,1,,,,,,71270,AUTHUMES,,,71013,,,,,,,,,,,,,,,,,,,1995-11-20,F,,,,,01.2A,NAF1993,N,,,0,,,,,,
403704885,00017,40370488500017,O,1973-01-01,NN,,,,true,1,,,,,,71270,AUTHUMES,,,71013,,,,,,,,,,,,,,,,,,,1999-12-31,F,,,,,01.3Z,NAF1993,N,,,0,,,,,,
403705353,00015,40370535300015,O,1973-01-01,NN,,,2006-10-28T03:16:47,true,3,,,,,,71270,AUTHUMES,,,71013,,,,,,,,,,,,,,,,,,,2004-04-30,F,,,,,70.2B,NAFRev1,N,,,0,,,,,,
405143843,00069,40514384300069,P,2019-03-15,,,,2022-05-31T11:21:20,false,2,[ND],[ND],[ND],[ND],[ND],[ND],AUTHUMES,,[ND],71013,[ND],[ND],,,[ND],[ND],[ND],[ND],[ND],[ND],,,[ND],,[ND],[ND],,,2019-03-17,F,[ND],[ND],[ND],[ND],49.41A,NAFRev2,N,,,0,,,,,,
409808870,00011,40980887000011,O,1987-12-31,NN,,,2012-07-28T13:59:41,true,4,,,,,,71270,AUTHUMES,,,71013,,,,,,,,,,,,,,,,,,,2009-12-25,F,,,,,01.50Z,NAFRev2,N,,,0,,,,,,
412286437,00014,41228643700014,O,1983-12-31,NN,,,2012-06-01T05:21:10,true,4,,,,,,71270,AUTHUMES,,,71013,,,,,,,,,,,,,,,,,,,2012-04-01,F,,,,,01.42Z,NAFRev2,N,,,0,,,,,,
414383174,00029,41438317400029,O,2011-05-02,,,9602AB,2015-11-06T04:07:26,false,2,,5,,RUE,DU PARADIS,71270,AUTHUMES,,,71013,,,,,,,,,,,,,,,,,,,2015-09-13,F,,,,,96.02A,NAFRev2,N,5.303386,46.885458,0.94,housenumber,5 Rue du Paradis 71270 Authumes,71013_0150_00005,G,5 RUE DU PARADIS,
420445793,00029,42044579300029,O,2006-01-04,,,4520AC,2020-06-17T03:36:44,false,3,,1,,RUE,DES JUIFS,71270,AUTHUMES,,,71013,,,,,,,,,,,,,,,,,,,2020-05-27,F,TOUCH IMPACT,,,,45.20A,NAFRev2,N,5.299774,46.890097,0.94,housenumber,1 Rue des Juifs 71270 Authumes,71013_0110_00001,G,1 RUE DES JUIFS,
422566596,00017,42256659600017,O,1999-04-14,NN,,,2021-03-11T03:35:42,true,4,,,,,LE BOURG,71270,AUTHUMES,,,71013,,,,,,,,,,,,,,,,,,,2020-11-30,F,,,,,01.11Z,NAFRev2,N,5.303888,46.888672,0.62,street,Rue du Bourg 71270 Authumes,71013_0030,G,RUE DU BOURG,
423233584,00022,42323358400022,O,2019-03-01,,,,2021-03-16T08:34:36,true,2,,2,A,RTE,DU FAY,71270,AUTHUMES,,,71013,,,,,,,,,,,,,,,,,,,2020-12-20,F,,,,,68.20A,NAFRev2,N,5.306713,46.891926,0.81,housenumber,2a Route du Fay 71270 Authumes,71013_0075_00002_a,G,2A ROUTE DU FAY,
427550538,00016,42755053800016,O,1969-01-01,NN,,,2008-01-05T01:17:21,true,3,,,,,,71270,AUTHUMES,,,71013,,,,,,,,,,,,,,,,,,,2008-01-01,A,,,,,01.42Z,NAFRev2,N,,,0,,,,,,
427550546,00019,42755054600019,O,1970-01-01,NN,,,2012-07-28T12:39:52,true,4,,,,,RAMOUILLE,71270,AUTHUMES,,,71013,,,,,,,,,,,,,,,,,,,2008-01-01,F,,,,,01.42Z,NAFRev2,N,5.311339,46.876114,0.92,street,Route de Ramouille 71270 Authumes,71013_0160,G,ROUTE DE RAMOUILLE,
431128198,00014,43112819800014,O,1969-01-01,NN,,,2012-07-28T16:23:01,true,4,,,,,,71270,AUTHUMES,,,71013,,,,,,,,,,,,,,,,,,,2008-12-25,F,,,,,01.42Z,NAFRev2,N,,,0,,,,,,
431611656,00049,43161165600049,O,2018-12-02,,,,2021-02-23T13:12:36,false,1,,5,,RTE,DE FRETTERANS,71270,AUTHUMES,,,71013,,,,,,,,,,,,,,,,,,,2018-12-02,A,,,,,02.40Z,NAFRev2,N,5.301849,46.892559,0.85,housenumber,5 Route de Fretterans 71270 Authumes,71013_0080_00005,G,5 ROUTE DE FRETTERANS,
432638559,00018,43263855900018,O,2000-08-24,NN,,,2008-01-05T20:56:09,true,3,CHEZ M. SAVOYE GUY,,,RUE,DE LA FORET,71270,AUTHUMES,,,71013,,,,,,,,,,,,,,,,,,,2008-01-01,A,,,,,68.20B,NAFRev2,N,5.328933,46.896151,0.93,street,Rue de la Foret 71270 Authumes,71013_nw2im1,G,RUE DE LA FORET,
440817567,00033,44081756700033,O,2011-07-01,,,,2011-10-25T03:46:22,true,1,,2,,RUE,DU PARADIS,71270,AUTHUMES,,,71013,,,,,,,,,,,,,,,,,,,2011-07-01,F,,,,,90.03B,NAFRev2,N,5.303617,46.88554,0.94,housenumber,2 Rue du Paradis 71270 Authumes,71013_0150_00002,G,2 RUE DU PARADIS,
443734132,00014,44373413200014,O,2002-11-04,NN,,4399CZ,2014-06-27T00:38:46,true,3,,4,,RUE,DU FAUBOURG,71270,AUTHUMES,,,71013,,,,,,,,,,,,,,,,,,,2008-01-01,A,,,,,81.30Z,NAFRev2,N,5.304514,46.892125,0.94,housenumber,4 Rue du Faubourg 71270 Authumes,71013_0070_00004,G,4 RUE DU FAUBOURG,
450075528,00023,45007552800023,O,2012-02-29,,,,2014-12-10T08:33:25,true,2,2A,2,,IMP,DU BOIS - RAMOUILLE,71270,AUTHUMES,,,71013,,,,,,,,,,,,,,,,,,,2014-10-31,F,,,,,68.20B,NAFRev2,N,5.307064,46.881301,0.46,housenumber,2 Route de Ramouille 71270 Authumes,71013_0160_00002,G,2 ROUTE DE RAMOUILLE,
453017790,00016,45301779000016,O,2004-04-05,01,2020,,2022-08-29T09:08:45,true,3,,11,,RTE,DE FAY,71270,AUTHUMES,,,71013,,,,,,,,,,,,,,,,,,,2008-01-01,A,,,,,01.50Z,NAFRev2,N,5.320873,46.880388,0.62,housenumber,11 Route du Fay 71270 Authumes,71013_0075_00011,G,11 ROUTE DU FAY,
453241762,00039,45324176200039,O,2016-09-30,01,2020,,2022-08-29T09:09:02,true,1,,20,,RTE,DU FAY,71270,AUTHUMES,,,71013,,,,,,,,,,,,,,,,,,,2016-09-30,A,LA MARSOTTIERE,,,,01.25Z,NAFRev2,N,5.314396,46.886869,0.81,housenumber,20 Route du Fay 71270 Authumes,71013_0075_00020,G,20 ROUTE DU FAY,
453241762,00047,45324176200047,O,2020-01-01,,,,2021-02-23T13:37:33,false,1,,20,,RTE,DU FAY,71270,AUTHUMES,,,71013,,,,,,,,,,,,,,,,,,,2020-01-01,A,,,,LA MARSOTTIERE,55.20Z,NAFRev2,N,5.314396,46.886869,0.81,housenumber,20 Route du Fay 71270 Authumes,71013_0075_00020,G,20 ROUTE DU FAY,
477559892,00013,47755989200013,O,2004-05-22,NN,,,2011-02-03T10:03:39,false,4,,6,,RUE,DE LA GARE,71270,AUTHUMES,,,71013,,,,,,,,,,,,,,,,,,,2010-10-23,F,,,,,68.20B,NAFRev2,N,5.301938,46.885524,0.94,housenumber,6 Rue de la Gare 71270 Authumes,71013_0090_00006,G,6 RUE DE LA GARE,
478924335,00035,47892433500035,O,2013-01-01,,,,2021-02-23T13:41:08,true,1,,7,,RTE,GRANDE RUE,71270,AUTHUMES,,,71013,,,,,,,,,,,,,,,,,,,2013-01-01,A,,,,,43.32A,NAFRev2,N,5.299693,46.885364,0.4,housenumber,7 Rue de la Gare 71270 Authumes,71013_0090_00007,G,7 RUE DE LA GARE,
484907647,00024,48490764700024,O,2007-04-01,,,4334ZC,2021-03-23T04:06:08,false,5,,2,,RTE,DE RAMOUILLE,71270,AUTHUMES,,,71013,,,,,,,,,,,,,,,,,,,2021-03-08,F,,,,ENTREPRISE ROYER,43.34Z,NAFRev2,N,5.307064,46.881301,0.85,housenumber,2 Route de Ramouille 71270 Authumes,71013_0160_00002,G,2 ROUTE DE RAMOUILLE,
485207039,00010,48520703900010,O,2005-11-25,,,,2008-01-05T21:56:26,true,2,,22,,RTE,DU FAY,71270,AUTHUMES,,,71013,,,,,,,,,,,,,,,,,,,2008-01-01,A,,,,,68.20B,NAFRev2,N,5.315636,46.88541,0.81,housenumber,22 Route du Fay 71270 Authumes,71013_0075_00022,G,22 ROUTE DU FAY,
488241316,00014,48824131600014,O,2006-02-01,,,,2008-01-05T02:30:37,false,2,,10,,RTE,DE RAMOUILLE,71270,AUTHUMES,,,71013,,,,,,,,,,,,,,,,,,,2006-12-31,F,,,,,74.1J,NAFRev1,N,5.31126,46.875713,0.85,housenumber,10 Route de Ramouille 71270 Authumes,71013_0160_00010,G,10 ROUTE DE RAMOUILLE,
488241316,00022,48824131600022,O,2006-12-01,,,,2014-09-16T04:20:21,true,6,,10,,RTE,DE RAMOUILLE,71270,AUTHUMES,,,71013,,,,,,,,,,,,,,,,,,,2014-10-14,F,,,,IMMO CHAPEAU,68.31Z,NAFRev2,N,5.31126,46.875713,0.85,housenumber,10 Route de Ramouille 71270 Authumes,71013_0160_00010,G,10 ROUTE DE RAMOUILLE,
493617419,00020,49361741900020,O,2008-02-01,01,2020,4399BZ,2022-08-29T09:26:49,true,2,,3,,IMP,ST PAUL,71270,AUTHUMES,,,71013,,,,,,,,,,,,,,,,,,,2010-06-23,A,,,,,43.32B,NAFRev2,O,5.321881,46.88675,0.68,housenumber,3 Impasse Saint Paul 71270 Authumes,71013_0170_00003,G,3 IMPASSE SAINT PAUL,
498270982,00016,49827098200016,O,2007-01-01,,,,2008-01-05T00:51:25,true,2,,11,,RUE,DES JUIFS,71270,AUTHUMES,,,71013,,,,,,,,,,,,,,,,,,,2008-01-01,A,,,,,01.11Z,NAFRev2,N,5.29665,46.891348,0.94,housenumber,11 Rue des Juifs 71270 Authumes,71013_0110_00011,G,11 RUE DES JUIFS,
503032724,00018,50303272400018,O,2008-03-05,02,2020,4329BB,2022-08-29T09:06:04,true,2,,8,,RUE,DE LA GARE,71270,AUTHUMES,,,71013,,,,,,,,,,,,,,,,,,,2008-04-01,A,,,,,81.30Z,NAFRev2,O,5.300687,46.885311,0.94,housenumber,8 Rue de la Gare 71270 Authumes,71013_0090_00008,G,8 RUE DE LA GARE,
508476447,00018,50847644700018,O,2008-10-01,,,,2015-01-14T14:40:36,false,2,,5,,RUE,DU PARADIS,71270,AUTHUMES,,,71013,,,,,,,,,,,,,,,,,,,2010-06-30,F,,,,,85.52Z,NAFRev2,N,5.303386,46.885458,0.94,housenumber,5 Rue du Paradis 71270 Authumes,71013_0150_00005,G,5 RUE DU PARADIS,
518897251,00014,51889725100014,O,2010-04-01,,,,2012-11-10T01:35:50,true,2,,15,,RUE,DU BOURG,71270,AUTHUMES,,,71013,,,,,,,,,,,,,,,,,,,2012-06-07,F,,,,,47.89Z,NAFRev2,N,5.304813,46.886311,0.94,housenumber,15 Rue du Bourg 71270 Authumes,71013_0030_00015,G,15 RUE DU BOURG,
519223739,00011,51922373900011,O,2010-01-04,,,,2014-09-16T08:23:33,true,3,,5,,RTE,DU FAY,71270,AUTHUMES,,,71013,,,,,,,,,,,,,,,,,,,2014-09-10,F,,,,,47.91A,NAFRev2,N,5.307317,46.890745,0.8,housenumber,5 Route du Fay 71270 Authumes,71013_0075_00005,G,5 ROUTE DU FAY,
520460684,00019,52046068400019,O,2010-03-01,,,,2012-11-10T01:49:26,true,1,,4,,RTE,DE PIERRE,71270,AUTHUMES,,,71013,,,,,,,,,,,,,,,,,,,2010-03-01,F,,,,,47.89Z,NAFRev2,N,5.300224,46.888324,0.83,housenumber,4 Route de Pierre 71270 Authumes,71013_0155_00004,G,4 ROUTE DE PIERRE,
523359750,00016,52335975000016,O,2010-07-01,,,,2019-05-15T07:23:21,false,2,,7,,RUE,DU BOURG,71270,AUTHUMES,,,71013,,,,,,,,,,,,,,,,,,,2011-09-12,F,,,,,47.82Z,NAFRev2,N,5.304259,46.88775,0.94,housenumber,7 Rue du Bourg 71270 Authumes,71013_0030_00007,G,7 RUE DU BOURG,
538016148,00016,53801614800016,O,2011-11-28,NN,,,2020-07-25T03:46:52,true,3,,5,,IMP,SAINT PAUL,71270,AUTHUMES,,,71013,,,,,,,,,,,,,,,,,,,2020-07-09,F,,,,,02.20Z,NAFRev2,N,5.322593,46.886492,0.83,housenumber,5 Impasse Saint Paul 71270 Authumes,71013_0170_00005,G,5 IMPASSE SAINT PAUL,
539048116,00013,53904811600013,O,2012-02-06,,,3311ZZ,2021-02-23T16:00:54,true,2,,5,,RUE,DU BOURG,71270,AUTHUMES,,,71013,,,,,,,,,,,,,,,,,,,2013-05-15,A,RB AFFUTAGE MOBILE,,,BRETIN RENE,33.11Z,NAFRev2,N,5.303854,46.888795,0.94,housenumber,5 Rue du Bourg 71270 Authumes,71013_0030_00005,G,5 RUE DU BOURG,
656640133,00012,65664013300012,O,,NN,,,,true,1,,,,,,71270,AUTHUMES,,,71013,,,,,,,,,,,,,,,,,,,1995-09-30,F,,,,,50.2Z,NAF1993,O,,,0,,,,,,
656740594,00014,65674059400014,O,,NN,,,,true,1,,,,,,71270,AUTHUMES,,,71013,,,,,,,,,,,,,,,,,,,1992-03-18,F,,,,,29.3C,NAF1993,N,,,0,,,,,,
657141271,00012,65714127100012,O,,NN,,,,true,1,,,,,,71270,AUTHUMES,,,71013,,,,,,,,,,,,,,,,,,,,F,,,,,55.73,NAP,N,,,0,,,,,,
657241048,00013,65724104800013,O,,,,,,true,1,,,,HAM,LES HAUTS ET BAS,71270,AUTHUMES,,,71013,,,,,,,,,,,,,,,,,,,1987-12-31,F,,,,,01.63,NAP,N,,,0,,,,,,
752181743,00010,75218174300010,O,2012-04-01,,,,2012-06-18T13:02:30,true,1,,3,,RUE,DU FAUBOURG,71270,AUTHUMES,,,71013,,,,,,,,,,,,,,,,,,,2012-04-01,A,,,,,35.11Z,NAFRev2,N,5.3047,46.892696,0.94,housenumber,3 Rue du Faubourg 71270 Authumes,71013_0070_00003,G,3 RUE DU FAUBOURG,
778546341,00018,77854634100018,O,,NN,,,,true,1,,,,LD,RAMOUILLE,71270,AUTHUMES,,,71013,,,,,,,,,,,,,,,,,,,1995-06-30,F,,,,,45.2V,NAF1993,N,5.311339,46.876114,0.92,street,Route de Ramouille 71270 Authumes,71013_0160,G,ROUTE DE RAMOUILLE,
778546358,00012,77854635800012,O,,NN,,,,true,1,,,,,,71270,AUTHUMES,,,71013,,,,,,,,,,,,,,,,,,,,F,,,,,55.71,NAP,N,,,0,,,,,,
778546366,00015,77854636600015,O,,,,,,true,1,,,,,,71270,AUTHUMES,,,71013,,,,,,,,,,,,,,,,,,,1984-12-25,F,,,,,36.10,NAP,N,,,0,,,,,,
778546390,00015,77854639000015,O,,,,,2006-11-25T22:10:24,true,1,,,,,,71270,AUTHUMES,,,71013,,,,,,,,,,,,,,,,,,,1984-12-25,F,,,,,55.10,NAP,N,,,0,,,,,,
789970068,00027,78997006800027,P,2023-08-15,,,,2023-07-24T09:44:36,true,1,[ND],[ND],[ND],[ND],[ND],[ND],AUTHUMES,,[ND],71013,[ND],[ND],,,[ND],[ND],[ND],[ND],[ND],[ND],,,[ND],,[ND],[ND],,,2023-08-15,A,[ND],[ND],[ND],[ND],22.29B,NAFRev2,N,,,0,,,,,,
807914437,00015,80791443700015,O,2015-01-20,,,,2016-04-06T08:29:48,true,3,,18,,RUE,FAUBOURG,71270,AUTHUMES,,,71013,,,,,,,,,,,,,,,,,,,2016-02-01,F,,,,,82.20Z,NAFRev2,N,5.31024,46.89315,0.88,housenumber,18 Rue du Faubourg 71270 Authumes,71013_0070_00018,G,18 RUE DU FAUBOURG,
810817510,00011,81081751000011,O,2015-04-14,,,,2016-04-05T04:31:28,true,2,,18,,RUE,DU FAUBOURG,71270,AUTHUMES,,,71013,,,,,,,,,,,,,,,,,,,2016-02-29,F,AU SNACK CHEZ GAEL,,,AU SNACK CHEZ GAEL,56.10C,NAFRev2,N,5.31024,46.89315,0.94,housenumber,18 Rue du Faubourg 71270 Authumes,71013_0070_00018,G,18 RUE DU FAUBOURG,
814161311,00034,81416131100034,O,2019-09-11,,,,2022-10-19T03:48:45,true,3,,9,,RTE,DE FRETTERANS,71270,AUTHUMES,,,71013,,,,,,,,,,,,,,,,,,,2022-10-01,A,,,,,01.43Z,NAFRev2,N,5.301775,46.89319,0.85,housenumber,9 Route de Fretterans 71270 Authumes,71013_0080_00009,G,9 ROUTE DE FRETTERANS,
814592861,00011,81459286100011,O,2015-11-11,,,,2023-04-07T08:47:02,true,3,,12,,RTE,12 ROUTE DE BELLEVESVRE,71270,AUTHUMES,,,71013,,,,,,,,,,,,,,,,,,,2023-04-06,A,,,,NATURMEDICAE,96.09Z,NAFRev2,N,5.312714,46.871248,0.85,housenumber,12 Route de Bellevesvre 71270 Authumes,71013_0020_00012,G,12 ROUTE DE BELLEVESVRE,
822841813,00014,82284181300014,O,2016-10-01,,,0162ZP,2020-02-07T20:00:26,true,1,,2,,RTE,DU FAY,71270,AUTHUMES,,,71013,,,,,,,,,,,,,,,,,,,2016-10-01,A,,,,PELISSON LAURENT,75.00Z,NAFRev2,N,5.30672,46.891845,0.8,housenumber,2 Route du Fay 71270 Authumes,71013_0075_00002,G,2 ROUTE DU FAY,
828105908,00010,82810590800010,O,2017-04-01,,,4399CZ,2018-05-16T13:53:17,false,2,,4,,RUE,DU PARADIS,71270,AUTHUMES,,,71013,,,,,,,,,,,,,,,,,,,2018-03-16,F,,,,SCHATZ FRANCKY,43.99C,NAFRev2,N,5.30304,46.8855,0.94,housenumber,4 Rue du Paradis 71270 Authumes,71013_0150_00004,G,4 RUE DU PARADIS,
828105908,00028,82810590800028,O,2018-03-16,,,8122ZZ,2021-02-23T17:47:08,true,2,,5,,RUE,DES JUIFS,71270,AUTHUMES,,,71013,,,,,,,,,,,,,,,,,,,2020-07-15,A,,,,SCHATZ FRANCKY,81.22Z,NAFRev2,N,5.298849,46.891054,0.94,housenumber,5 Rue des Juifs 71270 Authumes,71013_0110_00005,G,5 RUE DES JUIFS,
828497156,00012,82849715600012,O,2017-03-20,,,,2017-03-22T09:36:14,true,1,,12,A,RUE,DU FAUBOURG,71270,AUTHUMES,,,71013,,,,,,,,,,,,,,,,,,,2017-03-20,A,,,,CELINE GILLER ECRIVAIN,47.99B,NAFRev2,N,5.308156,46.892592,0.94,housenumber,12a Rue du Faubourg 71270 Authumes,71013_0070_00012_a,G,12A RUE DU FAUBOURG,
828960567,00018,82896056700018,O,2017-04-01,,,,2017-04-12T03:43:36,true,1,,3,,IMP,DES AULNES,71270,AUTHUMES,,,71013,,,,,,,,,,,,,,,,,,,2017-04-01,A,,,,,01.45Z,NAFRev2,N,5.307546,46.878494,0.82,housenumber,3 Impasse des Aulnes 71270 Authumes,71013_0010_00003,G,3 IMPASSE DES AULNES,
829302579,00018,82930257900018,P,2017-05-15,,,,2017-04-28T08:58:23,true,1,[ND],[ND],[ND],[ND],[ND],[ND],AUTHUMES,,[ND],71013,[ND],[ND],,,[ND],[ND],[ND],[ND],[ND],[ND],,,[ND],,[ND],[ND],,,2017-05-15,A,[ND],[ND],[ND],[ND],62.01Z,NAFRev2,N,,,0,,,,,,
832493233,00015,83249323300015,O,2017-09-06,,,,2017-10-09T15:50:53,true,1,,2,A,RTE,DU FAY,71270,AUTHUMES,,,71013,,,,,,,,,,,,,,,,,,,2017-09-06,A,,,,,94.99Z,NAFRev2,N,5.306713,46.891926,0.81,housenumber,2a Route du Fay 71270 Authumes,71013_0075_00002_a,G,2A ROUTE DU FAY,
839651841,00018,83965184100018,O,2018-04-26,,,,2018-05-18T11:43:03,true,1,,3,,IMP,SAINT PAUL,71270,AUTHUMES,,,71013,,,,,,,,,,,,,,,,,,,2018-04-26,A,,,,,68.20B,NAFRev2,N,5.321881,46.88675,0.83,housenumber,3 Impasse Saint Paul 71270 Authumes,71013_0170_00003,G,3 IMPASSE SAINT PAUL,
847879293,00011,84787929300011,O,2019-01-31,,,4332BB,2019-02-01T04:18:35,true,1,,2,,RTE,DE RAMOUILLE,71270,AUTHUMES,,,71013,,,,,,,,,,,,,,,,,,,2019-01-31,A,ENTREPRISE ROYER,,,,43.32B,NAFRev2,N,5.307064,46.881301,0.85,housenumber,2 Route de Ramouille 71270 Authumes,71013_0160_00002,G,2 ROUTE DE RAMOUILLE,
853855849,00016,85385584900016,O,2019-09-12,,,,2022-09-16T08:54:01,true,2,,18,,,RUE DU FAUBOURG,71270,AUTHUMES,,,71013,,,,,,,,,,,,,,,,,,,2021-12-31,F,,,,,47.91A,NAFRev2,N,5.31024,46.89315,0.94,housenumber,18 Rue du Faubourg 71270 Authumes,71013_0070_00018,G,18 RUE DU FAUBOURG,
877573972,00024,87757397200024,O,2019-12-21,,,,2021-02-23T18:11:52,true,1,,5,,RUE,DU PARADIS,71270,AUTHUMES,,,71013,,,,,,,,,,,,,,,,,,,2019-12-21,A,,,,,96.09Z,NAFRev2,N,5.303386,46.885458,0.94,housenumber,5 Rue du Paradis 71270 Authumes,71013_0150_00005,G,5 RUE DU PARADIS,
883695009,00018,88369500900018,O,2020-04-01,,,,2021-07-01T09:00:06,true,1,,11,,,RTE DU FAY,71270,AUTHUMES,,,71013,,,,,,,,,,,,,,,,,,,2020-04-01,A,,,,,70.10Z,NAFRev2,N,5.320873,46.880388,0.81,housenumber,11 Route du Fay 71270 Authumes,71013_0075_00011,G,11 ROUTE DU FAY,
899014088,00012,89901408800012,P,2021-05-03,,,,2021-05-05T14:06:09,true,1,[ND],[ND],[ND],[ND],[ND],[ND],AUTHUMES,,[ND],71013,[ND],[ND],,,[ND],[ND],[ND],[ND],[ND],[ND],,,[ND],,[ND],[ND],,,2021-05-03,A,[ND],[ND],[ND],[ND],96.09Z,NAFRev2,N,,,0,,,,,,
904104619,00013,90410461900013,O,2021-10-12,,,,2021-10-13T03:46:42,true,1,,2,A,RTE,DU FAY,71270,AUTHUMES,,,71013,,,,,,,,,,,,,,,,,,,2021-10-12,A,,,,,70.10Z,NAFRev2,N,5.306713,46.891926,0.81,housenumber,2a Route du Fay 71270 Authumes,71013_0075_00002_a,G,2A ROUTE DU FAY,
910781921,00010,91078192100010,O,2022-02-12,,,,2022-11-21T08:52:36,true,2,,1,B,RUE,DU FAUBOURG,71270,AUTHUMES,,,71013,,,,,,,,,,,,,,,,,,,2022-11-18,A,,,,,96.09Z,NAFRev2,N,5.304619,46.892246,0.85,housenumber,1bis Rue du Faubourg 71270 Authumes,71013_0070_00001_bis,G,1BIS RUE DU FAUBOURG,
913528154,00028,91352815400028,P,2022-10-10,,,,2022-11-14T08:35:32,true,2,[ND],[ND],[ND],[ND],[ND],[ND],AUTHUMES,,[ND],71013,[ND],[ND],,,[ND],[ND],[ND],[ND],[ND],[ND],,,[ND],,[ND],[ND],,,2022-11-10,F,[ND],[ND],[ND],[ND],96.09Z,NAFRev2,N,,,0,,,,,,
917674335,00018,91767433500018,P,2022-07-19,,,,2022-07-21T11:45:46,true,1,[ND],[ND],[ND],[ND],[ND],[ND],AUTHUMES,,[ND],71013,[ND],[ND],,,[ND],[ND],[ND],[ND],[ND],[ND],,,[ND],,[ND],[ND],,,2022-07-19,A,[ND],[ND],[ND],[ND],62.01Z,NAFRev2,N,,,0,,,,,,
919827212,00011,91982721200011,O,2022-10-01,,,,2022-09-30T08:52:01,true,1,6,6,,RUE,DU GENET,71270,AUTHUMES,,,71013,,,,,,,,,,,,,,,,,,,2022-10-01,A,,,,VYBRISS,62.01Z,NAFRev2,N,5.30621,46.890802,0.94,housenumber,6 Rue du Genet 71270 Authumes,71013_0095_00006,G,6 RUE DU GENET,
950281972,00014,95028197200014,O,1900-01-01,NN,,,2010-09-29T15:02:59,true,4,,,,,,71270,AUTHUMES,,,71013,,,,,,,,,,,,,,,,,,,2009-12-25,F,,,,,68.20B,NAFRev2,N,,,0,,,,,,
