siren,nic,siret,statutDiffusionEtablissement,dateCreationEtablissement,trancheEffectifsEtablissement,anneeEffectifsEtablissement,activitePrincipaleRegistreMetiersEtablissement,dateDernierTraitementEtablissement,etablissementSiege,nombrePeriodesEtablissement,complementAdresseEtablissement,numeroVoieEtablissement,indiceRepetitionEtablissement,typeVoieEtablissement,libelleVoieEtablissement,codePostalEtablissement,libelleCommuneEtablissement,libelleCommuneEtrangerEtablissement,distributionSpecialeEtablissement,codeCommuneEtablissement,codeCedexEtablissement,libelleCedexEtablissement,codePaysEtrangerEtablissement,libellePaysEtrangerEtablissement,complementAdresse2Etablissement,numeroVoie2Etablissement,indiceRepetition2Etablissement,typeVoie2Etablissement,libelleVoie2Etablissement,codePostal2Etablissement,libelleCommune2Etablissement,libelleCommuneEtranger2Etablissement,distributionSpeciale2Etablissement,codeCommune2Etablissement,codeCedex2Etablissement,libelleCedex2Etablissement,codePaysEtranger2Etablissement,libellePaysEtranger2Etablissement,dateDebut,etatAdministratifEtablissement,enseigne1Etablissement,enseigne2Etablissement,enseigne3Etablissement,denominationUsuelleEtablissement,activitePrincipaleEtablissement,nomenclatureActivitePrincipaleEtablissement,caractereEmployeurEtablissement,longitude,latitude,geo_score,geo_type,geo_adresse,geo_id,geo_ligne,geo_l4,geo_l5
200068849,00013,20006884900013,O,2017-01-01,03,2020,,2022-08-29T09:05:22,true,1,,,,PL,DE LA MAIRIE,77940,THOURY-FEROTTES,,,77465,,,,,,,,,,,,,,,,,,,2017-01-01,A,,,,,84.12Z,NAFRev2,O,2.942191,48.291443,0.82,locality,Place de la Mairie 77940 Thoury-Férottes,77465_0300,G,PLACE DE LA MAIRIE,
217704659,00010,21770465900010,O,1983-03-01,03,2020,,2022-08-29T09:08:59,true,4,,,,,,77940,THOURY-FEROTTES,,,77465,,,,,,,,,,,,,,,,,,,2008-01-01,A,MAIRIE,,,,84.11Z,NAFRev2,O,,,0,,,,,,
217704659,00028,21770465900028,O,1983-12-21,02,2020,,2022-08-29T09:08:59,false,3,,,,ALL,DE LA MAIRIE,77940,THOURY-FEROTTES,,,77465,,,,,,,,,,,,,,,,,,,2008-01-01,A,ECOLE ELEMENTAIRE PUBLIQUE,,,,85.20Z,NAFRev2,N,2.942504,48.291394,0.83,street,Allee de la Mairie 77940 Thoury-Férottes,77465_5vh3k6,G,ALLEE DE LA MAIRIE,
217704659,00036,21770465900036,O,1997-01-01,NN,,,2019-11-14T14:00:59,false,3,,,,PL,DE LA MAIRIE,77940,THOURY-FEROTTES,,,77465,,,,,,,,,,,,,,,,,,,2008-01-01,A,SERVICE EAU,,,,36.00Z,NAFRev2,N,2.942191,48.291443,0.82,locality,Place de la Mairie 77940 Thoury-Férottes,77465_0300,G,PLACE DE LA MAIRIE,
217704659,00044,21770465900044,O,1997-01-01,NN,,,2019-11-14T14:00:59,false,5,,,,PL,MAIRIE,77940,THOURY-FEROTTES,,,77465,,,,,,,,,,,,,,,,,,,2016-12-31,F,SERVICE ASSAINISSEMENT,,,,37.00Z,NAFRev2,O,2.942191,48.291443,0.74,locality,Place de la Mairie 77940 Thoury-Férottes,77465_0300,G,PLACE DE LA MAIRIE,
267702181,00012,26770218100012,O,1983-03-01,NN,,,2019-11-14T14:00:59,true,4,,,,,MAIRIE,77940,THOURY-FEROTTES,,,77465,,,,,,,,,,,,,,,,,,,2016-01-01,F,CCAS,,,,88.99B,NAFRev2,N,2.942504,48.291394,0.91,street,Allee de la Mairie 77940 Thoury-Férottes,77465_5vh3k6,G,ALLEE DE LA MAIRIE,
267706380,00016,26770638000016,O,1983-03-01,NN,,,2019-11-14T14:00:59,true,4,,,,,,77940,THOURY-FEROTTES,,,77465,,,,,,,,,,,,,,,,,,,2009-06-25,F,CDE,,,,88.99B,NAFRev2,N,,,0,,,,,,
297705675,00017,29770567500017,O,1995-12-25,,,,2021-09-14T16:08:52,true,2,,,,PL,MAIRIE,77940,THOURY-FEROTTES,,,77465,,,,,,,,,,,,,,,,,,,2020-09-19,F,,,,,42.99Z,NAFRev2,N,2.942191,48.291443,0.74,locality,Place de la Mairie 77940 Thoury-Férottes,77465_0300,G,PLACE DE LA MAIRIE,
301188173,00019,30118817300019,O,,,,,2019-11-14T14:00:59,true,1,,,,CHE,DES MEUNIERS,77940,THOURY-FEROTTES,,,77465,,,,,,,,,,,,,,,,,,,,F,,,,,58.04,NAP,N,2.949177,48.294054,0.83,street,Chemin des Meuniers 77940 Thoury-Férottes,77465_0421,G,CHEMIN DES MEUNIERS,
302456041,00045,30245604100045,O,,NN,,,2019-11-14T14:00:59,true,1,,2,,RUE,DE FLAGY,77940,THOURY-FEROTTES,,,77465,,,,,,,,,,,,,,,,,,,1987-10-31,F,,,,,47.02,NAP,N,2.939545,48.298863,0.95,housenumber,2 Rue de Flagy 77940 Thoury-Férottes,77465_0200_00002,G,2 RUE DE FLAGY,
309750669,00025,30975066900025,O,,NN,,,2019-11-14T14:00:59,true,1,,10,,RUE,PEPINIERE ROYALE,77940,THOURY-FEROTTES,,,77465,,,,,,,,,,,,,,,,,,,,F,,,,,00.10,NAP,N,,,0,,,,,,
311115299,00027,31111529900027,O,,,,,2019-11-14T14:00:59,true,1,,69,,RTE,DE FLAGY,77940,THOURY-FEROTTES,,,77465,,,,,,,,,,,,,,,,,,,1989-12-31,F,,,,,55.60,NAP,N,2.946975,48.287741,0.78,housenumber,69 Rue de Flagy 77940 Thoury-Férottes,77465_0200_00069,G,69 RUE DE FLAGY,
315205377,00015,31520537700015,O,,,,,2019-11-14T14:00:59,true,1,,32,,RUE,DE FLAGY,77940,THOURY-FEROTTES,,,77465,,,,,,,,,,,,,,,,,,,1984-12-25,F,,,,,38.40,NAP,N,2.942461,48.292952,0.95,housenumber,32 Rue de Flagy 77940 Thoury-Férottes,77465_0200_00032,G,32 RUE DE FLAGY,
315928291,00014,31592829100014,O,,,,,2019-11-14T14:00:59,true,1,,39,,RUE,DE FLAGY,77940,THOURY-FEROTTES,,,77465,,,,,,,,,,,,,,,,,,,1984-12-25,F,,,,,67.01,NAP,N,2.942637,48.292431,0.95,housenumber,39 Rue de Flagy 77940 Thoury-Férottes,77465_0200_00039,G,39 RUE DE FLAGY,
317207835,00024,31720783500024,O,,NN,,,2019-11-14T14:00:59,true,1,,14,,RUE,DE BICHEREAU,77940,THOURY-FEROTTES,,,77465,,,,,,,,,,,,,,,,,,,1987-07-30,F,,,,,82.05,NAP,N,2.943791,48.307853,0.95,housenumber,14 Rue de Bichereau 77940 Thoury-Férottes,77465_0040_00014,G,14 RUE DE BICHEREAU,
318209558,00028,31820955800028,O,1989-10-01,,,,2019-11-14T14:00:59,false,4,,3,,RUE,DE VERDUN,77940,THOURY-FEROTTES,,,77465,,,,,,,,,,,,,,,,,,,2007-01-01,F,,,,,60.2L,NAFRev1,O,2.943861,48.291777,0.95,housenumber,3 Rue de Verdun 77940 Thoury-Férottes,77465_0480_00003,G,3 RUE DE VERDUN,
322358540,00019,32235854000019,O,,,,,2019-11-14T14:00:59,true,1,,19,,RUE,DE VERDUN,77940,THOURY-FEROTTES,,,77465,,,,,,,,,,,,,,,,,,,1984-12-25,F,,,,,55.70,NAP,N,2.942388,48.290789,0.95,housenumber,19 Rue de Verdun 77940 Thoury-Férottes,77465_0480_00019,G,19 RUE DE VERDUN,
322766676,00033,32276667600033,O,2000-05-15,NN,,,2019-11-14T14:00:59,true,5,,1,,RUE,DE VERDUN,77940,THOURY-FEROTTES,,,77465,,,,,,,,,,,,,,,,,,,2011-12-31,F,,,,,43.32C,NAFRev2,O,2.944491,48.292047,0.95,housenumber,1 Rue de Verdun 77940 Thoury-Férottes,77465_0480_00001,G,1 RUE DE VERDUN,
324149301,00024,32414930100024,O,2013-02-25,,,,2021-02-23T10:47:15,true,1,,2,,RUE,DES MARAIS,77940,THOURY-FEROTTES,,,77465,,,,,,,,,,,,,,,,,,,2013-02-25,A,,,,,70.22Z,NAFRev2,N,2.945052,48.29866,0.95,housenumber,2 Rue des Marais 77940 Thoury-Férottes,77465_0320_00002,G,2 RUE DES MARAIS,
324197680,00030,32419768000030,O,1998-01-01,NN,,,2019-11-14T14:00:59,true,5,,33,,RUE,DE FLAGY,77940,THOURY-FEROTTES,,,77465,,,,,,,,,,,,,,,,,,,2008-01-01,A,,,,,68.31Z,NAFRev2,N,2.941621,48.293045,0.95,housenumber,33 Rue de Flagy 77940 Thoury-Férottes,77465_0200_00033,G,33 RUE DE FLAGY,
325272367,00013,32527236700013,O,1982-06-22,NN,,,2019-11-14T14:00:59,false,4,AU RELAIS DE LA TRUITE,39,,RUE,DE FLAGY,77940,THOURY-FEROTTES,,,77465,,,,,,,,,,,,,,,,,,,2003-02-28,F,,,,,55.3A,NAFRev1,N,2.942637,48.292431,0.95,housenumber,39 Rue de Flagy 77940 Thoury-Férottes,77465_0200_00039,G,39 RUE DE FLAGY,
330114281,00018,33011428100018,O,1900-01-01,,,,2019-11-14T14:00:59,true,3,,,,CHE,DES MEUNIERS,77940,THOURY-FEROTTES,,,77465,,,,,,,,,,,,,,,,,,,2010-07-05,A,,,,,96.09Z,NAFRev2,N,2.949177,48.294054,0.83,street,Chemin des Meuniers 77940 Thoury-Férottes,77465_0421,G,CHEMIN DES MEUNIERS,
330849969,00010,33084996900010,O,,NN,,,2019-11-14T14:00:59,true,1,,14,,RUE,DE VERDUN,77940,THOURY-FEROTTES,,,77465,,,,,,,,,,,,,,,,,,,1989-12-25,F,,,,,54.10,NAP,N,2.943043,48.291171,0.95,housenumber,14 Rue de Verdun 77940 Thoury-Férottes,77465_0480_00014,G,14 RUE DE VERDUN,
333949287,00028,33394928700028,O,,NN,,,2019-11-14T14:00:59,true,1,,1,R,,DES BRANDONS,77940,THOURY-FEROTTES,,,77465,,,,,,,,,,,,,,,,,,,1996-03-31,F,,,,,74.8F,NAF1993,N,2.941559,48.292254,0.93,street,Rue des Brandons 77940 Thoury-Férottes,77465_0060,G,RUE DES BRANDONS,
334332517,00013,33433251700013,O,,NN,,,2019-11-14T14:00:59,true,1,,15,,RUE,DE CHANTE MERLE,77940,THOURY-FEROTTES,,,77465,,,,,,,,,,,,,,,,,,,1988-04-26,F,,,,,87.06,NAP,N,3.9871243,44.4500833,0.78,poi.stream,Valat de Chalondres (Ruisseau) Pied-de-Borne,https://osm.org/relation/3985153,G,,
337940738,00012,33794073800012,O,,NN,,,2019-11-14T14:00:59,true,1,,31,,RUE,DE FLAGY,77940,THOURY-FEROTTES,,,77465,,,,,,,,,,,,,,,,,,,1987-10-01,F,,,,,67.08,NAP,N,2.941998,48.293126,0.95,housenumber,31 Rue de Flagy 77940 Thoury-Férottes,77465_0200_00031,G,31 RUE DE FLAGY,
339367088,00012,33936708800012,O,1986-09-20,NN,,,2019-11-14T14:00:59,true,4,,,,CHE,DE LA PLANCHE COLLAT,77940,THOURY-FEROTTES,,,77465,,,,,,,,,,,,,,,,,,,2016-06-22,F,,,,,68.20A,NAFRev2,N,2.942381,48.293369,0.74,street,Rue de la Planche Colo 77940 Thoury-Férottes,77465_0385,G,RUE DE LA PLANCHE COLO,
339894123,00019,33989412300019,O,1987-01-01,NN,,,2019-11-14T14:00:59,true,4,,29,,RUE,DE BICHEREAU,77940,THOURY-FEROTTES,,,77465,,,,,,,,,,,,,,,,,,,2003-06-30,F,,,,,01.1A,NAFRev1,N,2.94574,48.307912,0.95,housenumber,29 Rue de Bichereau 77940 Thoury-Férottes,77465_0040_00029,G,29 RUE DE BICHEREAU,
340035344,00019,34003534400019,O,,NN,,,2019-11-14T14:00:59,true,1,,31,,RUE,DE FLAGY,77940,THOURY-FEROTTES,,,77465,,,,,,,,,,,,,,,,,,,1990-03-31,F,,,,,67.01,NAP,N,2.941998,48.293126,0.95,housenumber,31 Rue de Flagy 77940 Thoury-Férottes,77465_0200_00031,G,31 RUE DE FLAGY,
340812346,00013,34081234600013,O,1987-02-20,03,2020,,2022-08-29T09:26:34,true,4,PRO SHOP,,,DOM,DOMAINE DE LA FORTERESSE,77940,THOURY-FEROTTES,,,77465,,,,,,,,,,,,,,,,,,,2008-01-01,A,,,,,93.11Z,NAFRev2,O,,,0,,,,,,
341271559,00013,34127155900013,O,1900-01-01,NN,,,2019-11-14T14:00:59,false,4,,,,,BOIS DE BELLEFONTAINE,77940,THOURY-FEROTTES,,,77465,,,,,,,,,,,,,,,,,,,1989-12-31,F,,,,,55.73,NAP,N,2.946196,48.295587,0.43,locality,La Fontaine de la Cave 77940 Thoury-Férottes,77465_B046,G,LA FONTAINE DE LA CAVE,
342644978,00021,34264497800021,O,1987-10-01,NN,,,2019-11-14T14:00:59,false,4,,,,,,77940,THOURY-FEROTTES,,,77465,,,,,,,,,,,,,,,,,,,1996-07-01,F,GOLF DE LA FORTERESSE,,,,92.6C,NAF1993,N,,,0,,,,,,
344753355,00017,34475335500017,O,,NN,,,2019-11-14T14:00:59,true,1,,1,,CHE,DU JEU DE BOULES,77940,THOURY-FEROTTES,,,77465,,,,,,,,,,,,,,,,,,,1988-11-08,F,,,,,58.12,NAP,N,2.941276,48.290538,0.81,housenumber,1 Chemin du Jeu de Boule 77940 Thoury-Férottes,77465_0251_00001,G,1 CHEMIN DU JEU DE BOULE,
347861718,00018,34786171800018,O,1988-09-01,02,2020,,2022-08-29T09:30:09,true,4,,,,,DOMAINE DE LA FORTERESSE,77940,THOURY-FEROTTES,,,77465,,,,,,,,,,,,,,,,,,,2008-01-01,A,,,,,56.10A,NAFRev2,O,2.953074,48.29916,0.69,locality,Ferme de la Forteresse 77940 Thoury-Férottes,77465_B039,G,FERME DE LA FORTERESSE,
348105743,00036,34810574300036,O,1991-07-01,NN,,,2020-08-25T10:43:12,true,5,,25,,RUE,DE FLAGY,77940,THOURY-FEROTTES,,,77465,,,,,,,,,,,,,,,,,,,2018-09-11,F,,,,,86.21Z,NAFRev2,O,2.941658,48.293581,0.95,housenumber,25 Rue de Flagy 77940 Thoury-Férottes,77465_0200_00025,G,25 RUE DE FLAGY,
349671230,00010,34967123000010,O,1989-01-17,,,,2019-11-14T14:00:59,true,4,,15,,RUE,DE BICHEREAU,77940,THOURY-FEROTTES,,,77465,,,,,,,,,,,,,,,,,,,2004-04-01,F,,,,,58.09,NAP,N,2.943403,48.307772,0.95,housenumber,15 Rue de Bichereau 77940 Thoury-Férottes,77465_0040_00015,G,15 RUE DE BICHEREAU,
350575460,00018,35057546000018,O,1989-04-01,NN,,,2019-11-14T14:00:59,true,3,,25,,RTE,FLAGY,77940,THOURY-FEROTTES,,,77465,,,,,,,,,,,,,,,,,,,1991-05-31,F,,,,,79.06,NAP,N,2.941658,48.293581,0.74,housenumber,25 Rue de Flagy 77940 Thoury-Férottes,77465_0200_00025,G,25 RUE DE FLAGY,
353323744,00030,35332374400030,O,1999-10-01,NN,,,2019-11-14T14:00:59,true,1,,,,RUE,DU GUE,77940,THOURY-FEROTTES,,,77465,,,,,,,,,,,,,,,,,,,2000-12-31,F,,,,,72.2Z,NAF1993,N,2.942516,48.299828,0.94,locality,Rue du Gue 77940 Thoury-Férottes,77465_0240,G,RUE DU GUE,
353325301,00011,35332530100011,O,,,,,2019-11-14T14:00:59,true,1,,7,,RUE,DE CHANTEMERLE,77940,THOURY-FEROTTES,,,77465,,,,,,,,,,,,,,,,,,,1990-07-25,F,,,,,55.60,NAP,N,2.943243,48.289463,0.95,housenumber,7 Rue de Chantemerle 77940 Thoury-Férottes,77465_0100_00007,G,7 RUE DE CHANTEMERLE,
353470826,00010,35347082600010,O,1990-01-13,NN,,,2019-11-14T14:00:59,true,1,,34,,RUE,DE FLAGY,77940,THOURY-FEROTTES,,,77465,,,,,,,,,,,,,,,,,,,1998-08-10,F,,,,,60.2L,NAF1993,O,2.942501,48.292739,0.95,housenumber,34 Rue de Flagy 77940 Thoury-Férottes,77465_0200_00034,G,34 RUE DE FLAGY,
353554751,00019,35355475100019,O,1990-01-15,NN,,,2021-06-19T11:45:44,true,3,,1,,RUE,DE THOURY,77940,THOURY-FEROTTES,,,77465,,,,,,,,,,,,,,,,,,,2008-01-01,A,,,,,01.11Z,NAFRev2,N,2.938996,48.299789,0.94,housenumber,1 Rue de Thoury 77940 Thoury-Férottes,77465_0440_00001,G,1 RUE DE THOURY,
356000117,06567,35600011706567,O,1991-01-01,NN,,,2019-11-14T14:00:59,false,3,,52,,RUE,FLAGY,77940,THOURY-FEROTTES,,,77465,,,,,,,,,,,,,,,,,,,2003-12-31,F,AGENCE POSTALE THOURY FEROTTES,,,,64.1A,NAFRev1,N,2.943416,48.291844,0.95,housenumber,52 Rue de Flagy 77940 Thoury-Férottes,77465_0200_00052,G,52 RUE DE FLAGY,
378242168,00011,37824216800011,O,1990-06-01,NN,,,2019-11-14T14:00:59,false,3,,56,,RUE,DE FLAGY,77940,THOURY-FEROTTES,,,77465,,,,,,,,,,,,,,,,,,,1996-10-01,F,,,,,60.2L,NAF1993,,2.94375,48.291494,0.95,housenumber,56 Rue de Flagy 77940 Thoury-Férottes,77465_0200_00056,G,56 RUE DE FLAGY,
379326929,00013,37932692900013,O,,NN,,,2019-11-14T14:00:59,true,1,,6,B,RUE,DE FLAGY,77940,THOURY-FEROTTES,,,77465,,,,,,,,,,,,,,,,,,,1992-05-07,F,,,,,60.2E,NAF1993,N,2.941486,48.294457,0.84,housenumber,6bis Rue de Flagy 77940 Thoury-Férottes,77465_0200_00006_bis,G,6BIS RUE DE FLAGY,
379651987,00016,37965198700016,O,1990-06-10,NN,,,2019-11-14T14:00:59,true,4,,31,,RUE,DE FLAGY,77940,THOURY-FEROTTES,,,77465,,,,,,,,,,,,,,,,,,,1995-12-25,F,,,,,55.1A,NAF1993,N,2.941998,48.293126,0.95,housenumber,31 Rue de Flagy 77940 Thoury-Férottes,77465_0200_00031,G,31 RUE DE FLAGY,
388208662,00048,38820866200048,O,1997-10-15,NN,,,2019-11-14T14:00:59,true,4,,,,RUE,DES MARAIS,77940,THOURY-FEROTTES,,,77465,,,,,,,,,,,,,,,,,,,2002-06-18,F,,,,,74.2C,NAF1993,N,2.945258,48.298784,0.95,street,Rue des Marais 77940 Thoury-Férottes,77465_0320,G,RUE DES MARAIS,
389655192,00018,38965519200018,O,1900-01-01,,,,2019-11-14T14:00:59,false,3,,1,R,,DES BRANDONS,77940,THOURY-FEROTTES,,,77465,,,,,,,,,,,,,,,,,,,1993-12-01,F,,,,,74.8F,NAF1993,N,2.941559,48.292254,0.93,street,Rue des Brandons 77940 Thoury-Férottes,77465_0060,G,RUE DES BRANDONS,
389721473,00012,38972147300012,O,1992-08-01,NN,,,2019-11-14T14:00:59,true,3,,,,,CHATEAU DE LA MOTTE,77940,THOURY-FEROTTES,,,77465,,,,,,,,,,,,,,,,,,,2008-01-01,A,,,,,75.00Z,NAFRev2,N,2.942945,48.300204,0.49,street,la Motte 77940 Thoury-Férottes,77465_himmoy,G,LA MOTTE,
390596765,00011,39059676500011,O,1993-01-01,NN,,,2019-11-14T14:00:59,true,3,,9,,RUE,DE BICHEREAU,77940,THOURY-FEROTTES,,,77465,,,,,,,,,,,,,,,,,,,2005-12-25,F,,,,,51.1T,NAFRev1,N,2.942761,48.307702,0.95,housenumber,9 Rue de Bichereau 77940 Thoury-Férottes,77465_0040_00009,G,9 RUE DE BICHEREAU,
391232352,00016,39123235200016,O,1993-05-01,NN,,4332AA,2019-11-14T14:00:59,false,7,,,,RUE,DE L ABATTOIR,77940,THOURY-FEROTTES,,,77465,,,,,,,,,,,,,,,,,,,2017-02-28,F,,,,,43.32A,NAFRev2,N,2.942279,48.292178,0.94,street,Rue de l'Abattoir 77940 Thoury-Férottes,77465_0020,G,RUE DE L ABATTOIR,
391338969,00028,39133896900028,O,1996-05-01,NN,,,2019-11-14T14:00:59,true,4,,,,RUE,DE LA GARE,77940,THOURY-FEROTTES,,,77465,,,,,,,,,,,,,,,,,,,1997-02-11,F,,,,,74.1G,NAF1993,O,2.944423,48.299757,0.95,street,Rue de la Gare 77940 Thoury-Férottes,77465_0220,G,RUE DE LA GARE,
393292610,00044,39329261000044,O,1999-12-31,NN,,,2019-11-14T14:00:59,false,5,,12,,RUE,DES MARAIS,77940,THOURY-FEROTTES,,,77465,,,,,,,,,,,,,,,,,,,2003-12-25,F,,,,,36.1K,NAFRev1,N,2.944996,48.298741,0.95,housenumber,12 Rue des Marais 77940 Thoury-Férottes,77465_0320_00012,G,12 RUE DES MARAIS,
393292610,00051,39329261000051,O,2007-09-01,,,8121ZZ,2023-01-09T11:01:39,true,4,,8,,RUE,DU MOULIN,77940,THOURY-FEROTTES,,,77465,,,,,,,,,,,,,,,,,,,2022-10-01,A,,,,,81.21Z,NAFRev2,N,2.944646,48.290939,0.94,housenumber,8 Rue du Moulin 77940 Thoury-Férottes,77465_0340_00008,G,8 RUE DU MOULIN,
394409163,00018,39440916300018,O,1994-03-01,,,,2019-11-14T14:00:59,true,4,,,,,LA FORTERESSE,77940,THOURY-FEROTTES,,,77465,,,,,,,,,,,,,,,,,,,2016-11-30,F,,,,,01.11Z,NAFRev2,N,2.952602,48.297994,0.92,street,Lieu Dit la Forteresse 77940 Thoury-Férottes,77465_kit27q,G,LIEU DIT LA FORTERESSE,
398574756,00043,39857475600043,O,2014-11-10,,,,2019-11-14T14:00:59,false,2,,4,,RUE,PETITE,77940,THOURY-FEROTTES,,,77465,,,,,,,,,,,,,,,,,,,2016-10-22,F,,,,,69.20Z,NAFRev2,N,2.942228,48.29038,0.95,housenumber,4 Rue Petite 77940 Thoury-Férottes,77465_0380_00004,G,4 RUE PETITE,
400384251,00015,40038425100015,O,1995-04-03,NN,,,2019-11-14T14:00:59,true,1,,7,,RUE,DE FLAGY,77940,THOURY-FEROTTES,,,77465,,,,,,,,,,,,,,,,,,,1998-03-10,F,,,,,74.8F,NAF1993,N,2.939901,48.297437,0.95,housenumber,7 Rue de Flagy 77940 Thoury-Férottes,77465_0200_00007,G,7 RUE DE FLAGY,
400526646,00015,40052664600015,O,1995-04-01,NN,,,2019-11-14T14:00:59,false,3,,15,,RUE,DE BICHEREAU,77940,THOURY-FEROTTES,,,77465,,,,,,,,,,,,,,,,,,,1996-06-20,F,ACAL,,,,51.1N,NAF1993,N,2.943403,48.307772,0.95,housenumber,15 Rue de Bichereau 77940 Thoury-Férottes,77465_0040_00015,G,15 RUE DE BICHEREAU,
403182389,00011,40318238900011,O,1995-10-01,NN,,,2019-11-14T14:00:59,false,3,,,,CHE,DES MARAIS,77940,THOURY-FEROTTES,,,77465,,,,,,,,,,,,,,,,,,,2007-03-31,F,,,,,70.3A,NAFRev1,N,2.944693,48.300314,0.81,street,Chemin des Marais 77940 Thoury-Férottes,77465_4ptgy0,G,CHEMIN DES MARAIS,
403182389,00029,40318238900029,O,2008-04-18,,,,2019-11-14T14:00:59,true,1,,5,,RUE,DE VERDUN,77940,THOURY-FEROTTES,,,77465,,,,,,,,,,,,,,,,,,,2008-04-18,A,,,,,46.19B,NAFRev2,N,2.943635,48.292032,0.95,housenumber,5 Rue de Verdun 77940 Thoury-Férottes,77465_0480_00005,G,5 RUE DE VERDUN,
405121211,00016,40512121100016,O,,NN,,,2019-11-14T14:00:59,true,1,,,,,LE MOULIN NEUF,77940,THOURY-FEROTTES,,,77465,,,,,,,,,,,,,,,,,,,1996-03-31,F,,,,,01.1A,NAF1993,N,2.947935,48.287774,0.75,locality,Ferme du Moulin Neuf 77940 Thoury-Férottes,77465_B040,G,FERME DU MOULIN NEUF,
405121229,00018,40512122900018,O,1971-01-01,NN,,,2019-11-14T14:00:59,true,1,,,,,BICHEREAU,77940,THOURY-FEROTTES,,,77465,,,,,,,,,,,,,,,,,,,2001-12-31,F,,,,,01.1A,NAF1993,N,2.943684,48.307792,0.93,street,Rue de Bichereau 77940 Thoury-Férottes,77465_0040,G,RUE DE BICHEREAU,
405121237,00011,40512123700011,O,1992-01-01,NN,,,2019-11-14T14:00:59,true,4,,8,,RUE,DE CHANTEMERLE,77940,THOURY-FEROTTES,,,77465,,,,,,,,,,,,,,,,,,,2012-12-31,A,,,,,01.11Z,NAFRev2,O,2.943214,48.289031,0.95,housenumber,8 Rue de Chantemerle 77940 Thoury-Férottes,77465_0100_00008,G,8 RUE DE CHANTEMERLE,
405121245,00014,40512124500014,O,,NN,,,2019-11-14T14:00:59,true,1,,7,,RUE,DE VERDUN,77940,THOURY-FEROTTES,,,77465,,,,,,,,,,,,,,,,,,,1996-12-31,F,,,,,01.1A,NAF1993,N,2.943274,48.291507,0.95,housenumber,7 Rue de Verdun 77940 Thoury-Férottes,77465_0480_00007,G,7 RUE DE VERDUN,
405121252,00010,40512125200010,O,1992-01-01,NN,,,2019-11-14T14:00:59,true,4,,8,,RUE,CHANTEMERLE,77940,THOURY-FEROTTES,,,77465,,,,,,,,,,,,,,,,,,,1999-12-31,F,,,,,01.1A,NAF1993,N,2.943214,48.289031,0.94,housenumber,8 Rue de Chantemerle 77940 Thoury-Férottes,77465_0100_00008,G,8 RUE DE CHANTEMERLE,
408468916,00056,40846891600056,O,2017-12-06,,,,2019-11-14T14:00:59,false,2,,17,,RUE,CHANTEMERLE,77940,THOURY-FEROTTES,,,77465,,,,,,,,,,,,,,,,,,,2018-04-24,F,,,,,68.31Z,NAFRev2,N,2.942728,48.289077,0.94,housenumber,17 Rue de Chantemerle 77940 Thoury-Férottes,77465_0100_00017,G,17 RUE DE CHANTEMERLE,
408697902,00018,40869790200018,O,,NN,,,2019-11-14T14:00:59,true,1,,,,,,77940,THOURY-FEROTTES,,,77465,,,,,,,,,,,,,,,,,,,1996-10-31,F,,,,,01.1F,NAF1993,N,,,0,,,,,,
410426209,00012,41042620900012,O,1996-11-15,NN,,,2023-05-05T20:31:31,true,4,,10,,RUE,DU MOULIN,77940,THOURY-FEROTTES,,,77465,,,,,,,,,,,,,,,,,,,2020-12-25,F,,,,,01.11Z,NAFRev2,N,2.944572,48.290818,0.94,housenumber,10 Rue du Moulin 77940 Thoury-Férottes,77465_0340_00010,G,10 RUE DU MOULIN,
412249021,00012,41224902100012,O,1996-04-01,NN,,,2019-11-14T14:00:59,true,4,CIDEX 14 BOITE 6,,,,LE MOULIN NEUF,77940,THOURY-FEROTTES,,,77465,,,,,,,,,,,,,,,,,,,2017-09-30,F,,,,,01.11Z,NAFRev2,N,2.947935,48.287774,0.75,locality,Ferme du Moulin Neuf 77940 Thoury-Férottes,77465_B040,G,FERME DU MOULIN NEUF,
418912853,00011,41891285300011,O,1998-05-05,NN,,,2019-11-14T14:00:59,false,3,,2,,RUE,CHANTEMERLE,77940,THOURY-FEROTTES,,,77465,,,,,,,,,,,,,,,,,,,2001-05-05,F,,,,,65.2E,NAF1993,,2.943433,48.289493,0.94,housenumber,2 Rue de Chantemerle 77940 Thoury-Férottes,77465_0100_00002,G,2 RUE DE CHANTEMERLE,
422625640,00012,42262564000012,O,1999-04-12,,,,2019-11-14T14:00:59,true,1,,1,,CHE,DES COURTILS,77940,THOURY-FEROTTES,,,77465,,,,,,,,,,,,,,,,,,,1999-09-30,F,,,,,18.2C,NAF1993,N,2.940824,48.307771,0.74,housenumber,1 Rue des Courtils 77940 Thoury-Férottes,77465_pn4pzw_00001,G,1 RUE DES COURTILS,
424107407,00019,42410740700019,O,1999-08-12,NN,,,2023-05-31T03:42:33,true,5,CHATEAU DE LA MOTTE,,,,CHATEAU DE LA MOTTE,77940,THOURY-FEROTTES,,,77465,,,,,,,,,,,,,,,,,,,2022-11-20,F,,,,,58.12Z,NAFRev2,N,2.942945,48.300204,0.49,street,la Motte 77940 Thoury-Férottes,77465_himmoy,G,LA MOTTE,
429272917,00015,42927291700015,O,1991-01-01,NN,,,2023-07-03T21:22:20,true,4,,,,,LES MARAIS,77940,THOURY-FEROTTES,,,77465,,,,,,,,,,,,,,,,,,,2019-12-25,F,,,,,90.01Z,NAFRev2,N,2.945258,48.298784,0.77,street,Rue des Marais 77940 Thoury-Férottes,77465_0320,G,RUE DES MARAIS,
430032425,00034,43003242500034,P,2022-01-16,,,,2023-03-10T08:47:59,true,2,[ND],[ND],[ND],[ND],[ND],[ND],THOURY-FEROTTES,,[ND],77465,[ND],[ND],,,[ND],[ND],[ND],[ND],[ND],[ND],,,[ND],,[ND],[ND],,,2023-02-01,A,[ND],[ND],[ND],[ND],56.30Z,NAFRev2,N,,,0,,,,,,
432521920,00012,43252192000012,O,2000-08-04,NN,,1814ZZ,2019-11-14T14:00:59,true,3,,19,B,RUE,DE FLAGY,77940,THOURY-FEROTTES,,,77465,,,,,,,,,,,,,,,,,,,2008-01-01,A,,,,,18.14Z,NAFRev2,N,2.940482,48.294842,0.95,housenumber,19b Rue de Flagy 77940 Thoury-Férottes,77465_0200_00019_b,G,19B RUE DE FLAGY,
435094750,00013,43509475000013,O,1987-03-02,NN,,,2019-11-14T14:00:59,true,3,,,,,DOMAINE DE LA FORTERESSE,77940,THOURY-FEROTTES,,,77465,,,,,,,,,,,,,,,,,,,2008-01-01,A,,,,,93.12Z,NAFRev2,N,2.953074,48.29916,0.69,locality,Ferme de la Forteresse 77940 Thoury-Férottes,77465_B039,G,FERME DE LA FORTERESSE,
440843068,00014,44084306800014,O,2002-01-01,,,,2019-11-14T14:00:59,true,3,,12,,RUE,DE BICHEREAU,77940,THOURY-FEROTTES,,,77465,,,,,,,,,,,,,,,,,,,2008-01-01,A,,,,,01.11Z,NAFRev2,O,2.943618,48.308347,0.95,housenumber,12 Rue de Bichereau 77940 Thoury-Férottes,77465_0040_00012,G,12 RUE DE BICHEREAU,
443651146,00013,44365114600013,O,2002-10-14,NN,,4329AZ,2019-11-14T14:00:59,true,4,,10,,IMP,DES MARAIS,77940,THOURY-FEROTTES,,,77465,,,,,,,,,,,,,,,,,,,2016-12-31,F,,,,,43.29A,NAFRev2,N,2.945136,48.298884,0.84,housenumber,10 Impasse des Marais 77940 Thoury-Férottes,77465_s7r0xt_00010,G,10 IMPASSE DES MARAIS,
445216955,00010,44521695500010,O,2003-02-06,NN,,,2019-11-14T14:00:59,true,4,,39,,RUE,DE FLAGY,77940,THOURY-FEROTTES,,,77465,,,,,,,,,,,,,,,,,,,2011-11-30,F,,,,,68.20B,NAFRev2,N,2.942637,48.292431,0.95,housenumber,39 Rue de Flagy 77940 Thoury-Férottes,77465_0200_00039,G,39 RUE DE FLAGY,
448360032,00016,44836003200016,O,2003-04-02,NN,,,2019-11-14T14:00:59,true,4,,39,,RUE,DE FLAGY,77940,THOURY-FEROTTES,,,77465,,,,,,,,,,,,,,,,,,,2011-11-30,F,,,,,56.10A,NAFRev2,N,2.942637,48.292431,0.95,housenumber,39 Rue de Flagy 77940 Thoury-Férottes,77465_0200_00039,G,39 RUE DE FLAGY,
448546788,00028,44854678800028,O,2014-06-01,,,,2021-01-20T18:06:43,false,2,,2,,RUE,TRAVERSIERE,77940,THOURY-FEROTTES,,,77465,,,,,,,,,,,,,,,,,,,2021-01-01,F,,,,,47.91A,NAFRev2,N,2.942902,48.290484,0.94,housenumber,2 Rue Traversiere 77940 Thoury-Férottes,77465_0460_00002,G,2 RUE TRAVERSIERE,
448546788,00036,44854678800036,O,2021-01-01,,,,2021-02-23T13:30:17,true,1,,67,,,RUE DE FLAGY,77940,THOURY-FEROTTES,,,77465,,,,,,,,,,,,,,,,,,,2021-01-01,A,,,,,47.91A,NAFRev2,N,2.946744,48.288072,0.95,housenumber,67 Rue de Flagy 77940 Thoury-Férottes,77465_0200_00067,G,67 RUE DE FLAGY,