siren,nic,siret,statutDiffusionEtablissement,dateCreationEtablissement,trancheEffectifsEtablissement,anneeEffectifsEtablissement,activitePrincipaleRegistreMetiersEtablissement,dateDernierTraitementEtablissement,etablissementSiege,nombrePeriodesEtablissement,complementAdresseEtablissement,numeroVoieEtablissement,indiceRepetitionEtablissement,typeVoieEtablissement,libelleVoieEtablissement,codePostalEtablissement,libelleCommuneEtablissement,libelleCommuneEtrangerEtablissement,distributionSpecialeEtablissement,codeCommuneEtablissement,codeCedexEtablissement,libelleCedexEtablissement,codePaysEtrangerEtablissement,libellePaysEtrangerEtablissement,complementAdresse2Etablissement,numeroVoie2Etablissement,indiceRepetition2Etablissement,typeVoie2Etablissement,libelleVoie2Etablissement,codePostal2Etablissement,libelleCommune2Etablissement,libelleCommuneEtranger2Etablissement,distributionSpeciale2Etablissement,codeCommune2Etablissement,codeCedex2Etablissement,libelleCedex2Etablissement,codePaysEtranger2Etablissement,libellePaysEtranger2Etablissement,dateDebut,etatAdministratifEtablissement,enseigne1Etablissement,enseigne2Etablissement,enseigne3Etablissement,denominationUsuelleEtablissement,activitePrincipaleEtablissement,nomenclatureActivitePrincipaleEtablissement,caractereEmployeurEtablissement,longitude,latitude,geo_score,geo_type,geo_adresse,geo_id,geo_ligne,geo_l4,geo_l5
085420172,00026,08542017200026,O,1900-01-01,NN,,,2008-04-26T08:11:15,false,4,,36,,,PROMENADE DES LICES,81800,RABASTENS,,,81220,,,,,,,,,,,,,,,,,,,2006-10-31,F,,,,,65.1D,NAFRev1,O,1.72496,43.822553,0.56,housenumber,36 Avenue des Lices 81800 Rabastens,81220_7stq90_00036,G,36 AVENUE DES LICES,
085810638,00016,08581063800016,O,,,,,,true,1,,,,,PL- ST-MICHEL,81800,RABASTENS,,,81220,,,,,,,,,,,,,,,,,,,1984-12-25,F,,,,,67.08,NAP,N,1.723906,43.822778,0.68,street,Place Saint-Michel 81800 Rabastens,81220_0332,G,PLACE SAINT MICHEL,
085812055,00011,08581205500011,O,,,,,,true,1,,,,ALL,GL-DE GAULLE,81800,RABASTENS,,,81220,,,,,,,,,,,,,,,,,,,1984-12-25,F,,,,,67.04,NAP,N,,,0,,,,,,
085910420,00018,08591042000018,O,1959-01-01,NN,,,2023-05-05T20:18:15,true,4,,4,,RUE,TOULOUSE LAUTREC,81800,RABASTENS,,,81220,,,,,,,,,,,,,,,,,,,2015-12-25,F,,,,,68.20B,NAFRev2,N,1.725246,43.820611,0.94,housenumber,4 Rue Raymond de Toulouse-Lautrec 81800 Rabastens,81220_0358_00004,G,4 RUE R DE TOULOUSE LAUTREC,
085913648,00011,08591364800011,O,1974-01-01,NN,,,2010-06-18T19:57:04,true,4,,9,,PL,DAUPHINE,81800,RABASTENS,,,81220,,,,,,,,,,,,,,,,,,,2008-09-30,F,,,,,47.54Z,NAFRev2,N,1.727323,43.823232,0.82,housenumber,9 Place Dauphine 81800 Rabastens,81220_0105_00009,G,9 PLACE DAUPHINE,
085914075,00016,08591407500016,O,,NN,,,,true,1,,,,,LD- BLANQUETS,81800,RABASTENS,,,81220,,,,,,,,,,,,,,,,,,,1988-12-31,F,,,,,64.49,NAP,N,1.777842,43.848281,0.73,street,Chemin des Blanquets 81800 Rabastens,81220_wp6w3h,G,CHEMIN DES BLANQUETS,
085914232,00013,08591423200013,O,,,,,,true,1,,,,,PROMENADES,81800,RABASTENS,,,81220,,,,,,,,,,,,,,,,,,,1984-12-25,F,,,,,81.21,NAP,N,1.727058,43.822842,0.76,street,Promenade du Pré Vert 81800 Rabastens,81220_0306,G,PROMENADE DU PRE VERT,
085918068,00017,08591806800017,O,,,,,,true,1,,,,,,81800,RABASTENS,,,81220,,,,,,,,,,,,,,,,,,,1984-12-25,F,,,,,00.97,NAP,N,,,0,,,,,,
086010162,00013,08601016200013,O,,NN,,,,true,1,,1,,,CORDELIERS,81800,RABASTENS,,,81220,,,,,,,,,,,,,,,,,,,1995-05-16,F,,,,,52.2C,NAF1993,N,1.723328,43.82127,0.87,housenumber,1 Rue des Cordeliers 81800 Rabastens,81220_0093_00001,G,1 RUE DES CORDELIERS,
086011517,00017,08601151700017,O,,,,,,true,1,,,,RUE,ESCOUSSIERES,81800,RABASTENS,,,81220,,,,,,,,,,,,,,,,,,,1994-01-01,F,,,,,52.2C,NAF1993,N,1.725205,43.822082,0.53,street,Quai des Escoucières 81800 Rabastens,81220_0130,G,QUAI DES ESCOUCIERES,
086011905,00014,08601190500014,O,,,,,,true,1,,6,,RUE,DES PRES,81800,RABASTENS,,,81220,,,,,,,,,,,,,,,,,,,1988-05-31,F,,,,,55.10,NAP,N,1.722283,43.824362,0.96,housenumber,6 Rue des Prés 81800 Rabastens,81220_0298_00006,G,6 RUE DES PRES,
086015740,00011,08601574000011,O,,NN,,,,true,1,,22,,,PROMENADE DES LICES,81800,RABASTENS,,,81220,,,,,,,,,,,,,,,,,,,1987-06-26,F,,,,,62.41,NAP,N,1.724254,43.821898,0.56,housenumber,22 Avenue des Lices 81800 Rabastens,81220_7stq90_00022,G,22 AVENUE DES LICES,
086016185,00018,08601618500018,O,,,,,,true,1,,1,,,ESCOUSSIERES,81800,RABASTENS,,,81220,,,,,,,,,,,,,,,,,,,1985-12-25,F,,,,,64.22,NAP,N,1.724359,43.821173,0.64,housenumber,1 Quai des Escoucières 81800 Rabastens,81220_0130_00001,G,1 QUAI DES ESCOUCIERES,
086016292,00012,08601629200012,O,,NN,,,,true,1,,,,,,81800,RABASTENS,,,81220,,,,,,,,,,,,,,,,,,,,F,,,,,66.03,NAP,N,,,0,,,,,,
086020062,00013,08602006200013,O,,,,,,true,1,,,,,,81800,RABASTENS,,,81220,,,,,,,,,,,,,,,,,,,1984-12-25,F,,,,,88.02,NAP,N,,,0,,,,,,
086111135,00025,08611113500025,O,,,,,,true,1,,3,,CHE,DES CLARISSES,81800,RABASTENS,,,81220,,,,,,,,,,,,,,,,,,,2000-07-03,F,,,,,64.14,NAP,N,1.727873,43.827824,0.86,housenumber,3 Chemin des Clarisses 81800 Rabastens,81220_0076_00003,G,3 CHEMIN DES CLARISSES,
086112497,00028,08611249700028,O,,NN,,,,true,1,,10,,RUE,DE PUYSEGUR,81800,RABASTENS,,,81220,,,,,,,,,,,,,,,,,,,1987-12-31,F,,,,,55.40,NAP,N,1.724637,43.823251,0.94,housenumber,10 Rue de Chastenet de Puysegur 81800 Rabastens,81220_0065_00010,G,10 RUE DE CHASTENET DE PUYSEGUR,
086113859,00010,08611385900010,O,,NN,,,,true,1,,17,,QUAI,DE LA LIBERATION,81800,RABASTENS,,,81220,,,,,,,,,,,,,,,,,,,1994-03-31,F,,,,,50.4Z,NAF1993,O,1.723554,43.820329,0.96,housenumber,17 Quai de la Libération 81800 Rabastens,81220_0210_00017,G,17 QUAI DE LA LIBERATION,
086113867,00013,08611386700013,O,,,,,,true,1,,,,RTE,DE TOULOUSE,81800,RABASTENS,,,81220,,,,,,,,,,,,,,,,,,,1985-12-25,F,,,,,81.21,NAP,N,1.699729,43.804568,0.79,street,Avenue de Toulouse 81800 Rabastens,81220_0355,G,AVENUE DE TOULOUSE,
086114956,00013,08611495600013,O,,,,,,true,1,,,,,,81800,RABASTENS,,,81220,,,,,,,,,,,,,,,,,,,1984-12-25,F,,,,,00.98,NAP,N,,,0,,,,,,
086120060,00016,08612006000016,O,1961-01-01,,,,,false,3,,5,,AV,DE TOULOUSE,81800,RABASTENS,,,81220,,,,,,,,,,,,,,,,,,,1997-01-17,F,,,,,74.1J,NAF1993,N,1.719431,43.819999,0.85,housenumber,5 Avenue de Toulouse 81800 Rabastens,81220_0355_00005,G,5 AVENUE DE TOULOUSE,
086210655,00014,08621065500014,O,,NN,,,,true,1,,,,,LD- ST-MARTIN,81800,RABASTENS,,,81220,,,,,,,,,,,,,,,,,,,1990-12-28,F,,,,,57.02,NAP,N,1.726246,43.859663,0.6,street,Route de Saint Martin 81800 Rabastens,81220_torwn6,G,ROUTE DE SAINT MARTIN,
086211901,00011,08621190100011,O,,NN,,,,true,1,,,,,LD- VERTUS,81800,RABASTENS,,,81220,,,,,,,,,,,,,,,,,,,1989-03-31,F,,,,,60.07,NAP,N,1.735112,43.867991,0.67,street,Route de Vertus 81800 Rabastens,81220_80syau,G,ROUTE DE VERTUS,
086211927,00024,08621192700024,O,1971-04-05,NN,,,2015-01-14T04:52:03,false,4,,1,,RUE,DES CORDELIERS,81800,RABASTENS,,,81220,,,,,,,,,,,,,,,,,,,2014-10-01,F,,,,,68.20B,NAFRev2,N,1.723328,43.82127,0.96,housenumber,1 Rue des Cordeliers 81800 Rabastens,81220_0093_00001,G,1 RUE DES CORDELIERS,
086213626,00012,08621362600012,O,,,,,,true,1,,,,,PL- ST-MICHEL,81800,RABASTENS,,,81220,,,,,,,,,,,,,,,,,,,1984-12-25,F,,,,,86.04,NAP,N,1.723906,43.822778,0.68,street,Place Saint-Michel 81800 Rabastens,81220_0332,G,PLACE SAINT MICHEL,
086220092,00018,08622009200018,O,,,,,,true,1,,,,,PL- DU PRES VERT,81800,RABASTENS,,,81220,,,,,,,,,,,,,,,,,,,1984-12-25,F,,,,,69.11,NAP,N,1.727058,43.822842,0.6,street,Promenade du Pré Vert 81800 Rabastens,81220_0306,G,PROMENADE DU PRE VERT,
086310927,00016,08631092700016,O,,,,,,true,1,,5,,,GRAND RUE,81800,RABASTENS,,,81220,,,,,,,,,,,,,,,,,,,1984-12-25,F,,,,,64.21,NAP,N,1.725671,43.82055,0.49,housenumber,5 Rue Raymond de Toulouse-Lautrec 81800 Rabastens,81220_0358_00005,G,5 RUE R DE TOULOUSE LAUTREC,
086310935,00035,08631093500035,O,,NN,,,,true,1,,,,,LA MAUROLE,81800,RABASTENS,,,81220,,,,,,,,,,,,,,,,,,,2001-06-30,F,,,,,36.1K,NAF1993,O,1.72137,43.82997,0.94,street,Chemin de la Maurole 81800 Rabastens,81220_0216,G,CHEMIN DE LA MAUROLE,
086311503,00014,08631150300014,O,,,,,,true,1,,,,PL,ST-MICHEL,81800,RABASTENS,,,81220,,,,,,,,,,,,,,,,,,,1993-09-13,F,,,,,52.4X,NAF1993,N,1.723906,43.822778,0.68,street,Place Saint-Michel 81800 Rabastens,81220_0332,G,PLACE SAINT MICHEL,
086313632,00019,08631363200019,O,,NN,,,,true,1,,13,,,R- PENIT-BLEUS,81800,RABASTENS,,,81220,,,,,,,,,,,,,,,,,,,1993-09-30,F,,,,,36.1A,NAF1993,N,1.723205,43.818607,0.74,housenumber,13 Rue des Pénitents Bleus 81800 Rabastens,81220_0252_00013,G,13 RUE DES PENITENTS BLEUS,
086313673,00013,08631367300013,O,,NN,,,,true,1,,4,,,R- PONT DEL PA,81800,RABASTENS,,,81220,,,,,,,,,,,,,,,,,,,,F,,,,,64.11,NAP,N,1.724397,43.820988,0.84,housenumber,4 Rue du Pont Del Pâ 81800 Rabastens,81220_0285_00004,G,4 RUE DU PONT DEL PA,
086313822,00016,08631382200016,O,1963-01-01,NN,,,2014-04-25T04:43:04,true,7,,,,LD,ST-CAPRAIS,81800,RABASTENS,,,81220,,,,,,,,,,,,,,,,,,,2014-03-31,F,,,,,68.20B,NAFRev2,O,1.6922083,43.8784691,0.8,poi.track,CR de Raust à Saint-Caprais (Chemin) Rabastens,https://osm.org/way/124318127,G,,
086313954,00017,08631395400017,O,,,,,,true,1,,12,,,R- CORDELIERS,81800,RABASTENS,,,81220,,,,,,,,,,,,,,,,,,,1984-12-25,F,,,,,64.46,NAP,N,1.722697,43.82151,0.84,housenumber,12 Rue des Cordeliers 81800 Rabastens,81220_0093_00012,G,12 RUE DES CORDELIERS,
086410495,00013,08641049500013,O,,NN,,,,true,1,,3,,PL,ST-MICHEL,81800,RABASTENS,,,81220,,,,,,,,,,,,,,,,,,,1991-10-19,F,,,,,62.43,NAP,N,1.724096,43.82213,0.72,housenumber,3 Place Saint-Michel 81800 Rabastens,81220_0332_00003,G,3 PLACE SAINT MICHEL,
086411469,00017,08641146900017,O,,NN,,,,true,1,,56,,RUE,DES LICES,81800,RABASTENS,,,81220,,,,,,,,,,,,,,,,,,,1988-12-30,F,,,,,81.21,NAP,N,1.725921,43.823465,0.78,housenumber,56 Avenue des Lices 81800 Rabastens,81220_7stq90_00056,G,56 AVENUE DES LICES,
086412392,00036,08641239200036,O,,NN,,,2006-11-25T09:06:09,true,1,,17,,QUAI,ESCOUSSIERES,81800,RABASTENS,,,81220,,,,,,,,,,,,,,,,,,,1997-01-31,F,,,,,52.4R,NAF1993,N,1.725368,43.822209,0.74,housenumber,17 Quai des Escoucières 81800 Rabastens,81220_0130_00017,G,17 QUAI DES ESCOUCIERES,
086413093,00021,08641309300021,O,,,,,,true,1,,30,,,PROMENADE DES LICES,81800,RABASTENS,,,81220,,,,,,,,,,,,,,,,,,,1997-01-13,F,,,,,52.7A,NAF1993,N,1.724783,43.822399,0.56,housenumber,30 Avenue des Lices 81800 Rabastens,81220_7stq90_00030,G,30 AVENUE DES LICES,
086413192,00013,08641319200013,O,,,,,,true,1,,,,,PL- ST-MICHEL,81800,RABASTENS,,,81220,,,,,,,,,,,,,,,,,,,1985-12-25,F,,,,,64.48,NAP,N,1.723906,43.822778,0.68,street,Place Saint-Michel 81800 Rabastens,81220_0332,G,PLACE SAINT MICHEL,
086413507,00020,08641350700020,O,,NN,,,,true,1,,,,LD,LAMONTEILLE,81800,RABASTENS,,,81220,,,,,,,,,,,,,,,,,,,,F,,,,,87.01,NAP,N,,,0,,,,,,
086413580,00019,08641358000019,O,,,,,,true,1,,,,LD,SAINT GERY,81800,RABASTENS,,,81220,,,,,,,,,,,,,,,,,,,1985-12-25,F,,,,,56.02,NAP,N,1.775639,43.833321,0.94,street,Route de Saint Géry 81800 Rabastens,81220_q7x8tw,G,ROUTE DE SAINT GERY,
086511938,00010,08651193800010,O,,,,,,true,1,,,,,,81800,RABASTENS,,,81220,,,,,,,,,,,,,,,,,,,1984-12-25,F,,,,,00.97,NAP,N,,,0,,,,,,
086512894,00014,08651289400014,O,,,,,,true,1,,20,,,R- DES PRES,81800,RABASTENS,,,81220,,,,,,,,,,,,,,,,,,,1989-12-31,F,,,,,64.42,NAP,N,1.721467,43.823981,0.82,housenumber,20 Rue des Prés 81800 Rabastens,81220_0298_00020,G,20 RUE DES PRES,
086520202,00010,08652020200010,O,,,,,,true,1,,,,,,81800,RABASTENS,,,81220,,,,,,,,,,,,,,,,,,,1984-12-25,F,,,,,00.97,NAP,N,,,0,,,,,,
086610805,00011,08661080500011,O,1966-01-01,NN,,,,true,4,,,,,GUILL-CUNH,81800,RABASTENS,,,81220,,,,,,,,,,,,,,,,,,,2000-12-15,F,,,,,70.2C,NAF1993,N,1.723394,43.820955,0.77,street,Place Guillaume de Cunh 81800 Rabastens,81220_0175,G,PLACE GUILLAUME DE CUNH,
086611647,00016,08661164700016,O,,NN,,,,true,1,,,,AV,L HERMITAGE,81800,RABASTENS,,,81220,,,,,,,,,,,,,,,,,,,1995-09-28,F,,,,,70.2C,NAF1993,N,1.731579,43.827232,0.83,street,Avenue de l'Hermitage 81800 Rabastens,81220_0185,G,AVENUE DE L HERMITAGE,
086620176,00064,08662017600064,O,2003-12-15,NN,,,2006-11-25T09:06:09,false,3,,1,,RUE,DE LHERM,81800,RABASTENS,,,81220,,,,,,,,,,,,,,,,,,,2004-09-23,F,CABINET ALARY AGENCE LAPEROUSE TISO,,,,70.3A,NAFRev1,N,1.725385,43.822069,0.77,housenumber,1 Rue des Frères Delherm 81800 Rabastens,81220_0110_00001,G,1 RUE DES FRERES DELHERM,
086710050,00013,08671005000013,O,,,,,,true,1,,,,,PL- A-GAILLARD,81800,RABASTENS,,,81220,,,,,,,,,,,,,,,,,,,1985-12-25,F,,,,,60.07,NAP,N,1.72347,43.820721,0.69,street,Place Auger Gaillard 81800 Rabastens,81220_0025,G,PLACE AUGER GAILLARD,
086710761,00023,08671076100023,O,,NN,,,,true,1,,,,RUE,DES DELHERM,81800,RABASTENS,,,81220,,,,,,,,,,,,,,,,,,,,F,,,,,64.47,NAP,N,1.725553,43.821996,0.94,street,Rue des Frères Delherm 81800 Rabastens,81220_0110,G,RUE DES FRERES DELHERM,
086712379,00022,08671237900022,O,1989-04-20,NN,,,,true,1,,19,,PL,SAINT MICHEL,81800,RABASTENS,,,81220,,,,,,,,,,,,,,,,,,,2001-04-20,F,,,,,52.3A,NAF1993,O,1.723726,43.822595,0.86,housenumber,19 Place Saint-Michel 81800 Rabastens,81220_0332_00019,G,19 PLACE SAINT MICHEL,
086712734,00010,08671273400010,O,1967-01-01,00,2020,,2022-08-29T09:03:11,true,9,,,,QUAI,ESCOUSSIERES,81800,RABASTENS,,,81220,,,,,,,,,,,,,,,,,,,2020-07-01,F,,,,,56.10C,NAFRev2,O,1.725205,43.822082,0.7,street,Quai des Escoucières 81800 Rabastens,81220_0130,G,QUAI DES ESCOUCIERES,
086810546,00019,08681054600019,O,,NN,,,,true,1,,,,,LD- LES CROUZETS,81800,RABASTENS,,,81220,,,,,,,,,,,,,,,,,,,1994-11-01,F,,,,,01.4A,NAF1993,N,1.701331,43.819987,0.65,street,Chemin des Crouzets 81800 Rabastens,81220_0103,G,CHEMIN DES CROUZETS,
086812138,00021,08681213800021,O,1988-11-01,NN,,,,true,1,,1,,,DE LA LIBERATION,81800,RABASTENS,,,81220,,,,,,,,,,,,,,,,,,,1999-05-15,F,,,,,15.1F,NAF1993,O,1.724197,43.820947,0.9,housenumber,1 Quai de la Libération 81800 Rabastens,81220_0210_00001,G,1 QUAI DE LA LIBERATION,
086910742,00013,08691074200013,O,,,,,,true,1,,,,,R- G-CLAUSSADE,81800,RABASTENS,,,81220,,,,,,,,,,,,,,,,,,,1985-12-25,F,,,,,38.40,NAP,N,,,0,,,,,,
086911138,00054,08691113800054,O,1989-04-24,NN,,,,true,1,,21,,RUE,PASTEL,81800,RABASTENS,,,81220,,,,,,,,,,,,,,,,,,,2001-07-31,F,,,,,45.2V,NAF1993,N,1.719214,43.815708,0.89,housenumber,21 Rue du Pastel 81800 Rabastens,81220_0235_00021,G,21 RUE DU PASTEL,
086911435,00021,08691143500021,O,,NN,,,,true,1,,,,RTE,D ALBI RN 88,81800,RABASTENS,,,81220,,,,,,,,,,,,,,,,,,,1996-06-16,F,,,,,50.2Z,NAF1993,N,1.737443,43.829123,0.58,street,Route d'Albi 81800 Rabastens,81220_0010,G,ROUTE D ALBI,
086911484,00011,08691148400011,O,,,,,,true,1,,5,,,R- CORDONNIERS,81800,RABASTENS,,,81220,,,,,,,,,,,,,,,,,,,1985-12-25,F,,,,,79.06,NAP,N,1.72498,43.823512,0.84,housenumber,5 Rue des Cordonniers 81800 Rabastens,81220_0096_00005,G,5 RUE DES CORDONNIERS,
086920378,00030,08692037800030,O,1982-03-30,NN,,,2008-01-04T18:11:07,false,3,,,,,SAINT GERY,81800,RABASTENS,,,81220,,,,,,,,,,,,,,,,,,,2008-01-01,A,,,,,68.20B,NAFRev2,N,1.775639,43.833321,0.94,street,Route de Saint Géry 81800 Rabastens,81220_q7x8tw,G,ROUTE DE SAINT GERY,
087011474,00027,08701147400027,O,,NN,,,,true,1,,,,PL,DU PLO,81800,RABASTENS,,,81220,,,,,,,,,,,,,,,,,,,1998-08-20,F,,,,,87.03,NAP,N,1.723656,43.819123,0.72,street,Rue du Plô 81800 Rabastens,81220_0280,G,RUE DU PLO,
087011664,00015,08701166400015,O,,NN,,,,true,1,,,,RTE,DE TOULOUSE,81800,RABASTENS,,,81220,,,,,,,,,,,,,,,,,,,,F,,,,,65.02,NAP,N,1.699729,43.804568,0.79,street,Avenue de Toulouse 81800 Rabastens,81220_0355,G,AVENUE DE TOULOUSE,
087020269,00012,08702026900012,O,,,,,,true,1,,,,,,81800,RABASTENS,,,81220,,,,,,,,,,,,,,,,,,,1984-12-25,F,,,,,00.97,NAP,N,,,0,,,,,,
087110128,00011,08711012800011,O,,,,,,true,1,,9,,CHE,DE CANABAL,81800,RABASTENS,,,81220,,,,,,,,,,,,,,,,,,,1984-12-25,F,,,,,57.11,NAP,N,1.722959,43.826211,0.85,housenumber,9 Chemin de Canabal 81800 Rabastens,81220_0055_00009,G,9 CHEMIN DE CANABAL,
087111811,00011,08711181100011,O,,,,,,true,1,,,,PL,SAINT MICHEL,81800,RABASTENS,,,81220,,,,,,,,,,,,,,,,,,,1984-12-25,F,,,,,67.08,NAP,N,1.723906,43.822778,0.84,street,Place Saint-Michel 81800 Rabastens,81220_0332,G,PLACE SAINT MICHEL,
087112223,00018,08711222300018,O,,,,,,true,1,,27,,,R- G-CLAUSSADE,81800,RABASTENS,,,81220,,,,,,,,,,,,,,,,,,,1985-12-25,F,,,,,81.21,NAP,N,1.728156,43.829574,0.33,housenumber,27 Route de Saurs 81800 Rabastens,81220_0340_00027,G,27 ROUTE DE SAURS,
087210183,00015,08721018300015,O,1972-01-01,NN,,,2008-01-04T18:11:10,true,3,,,,RTE,DE TOULOUSE,81800,RABASTENS,,,81220,,,,,,,,,,,,,,,,,,,2008-01-01,A,,,,,68.20B,NAFRev2,N,1.699729,43.804568,0.79,street,Avenue de Toulouse 81800 Rabastens,81220_0355,G,AVENUE DE TOULOUSE,
087211702,00029,08721170200029,O,,,,,,true,1,,,,RTE,DE GRAZAC LES PIGASSES,81800,RABASTENS,,,81220,,,,,,,,,,,,,,,,,,,1984-12-25,F,,,,,78.02,NAP,N,1.708086,43.821818,0.5,street,Route de Grazac 81800 Rabastens,81220_0165,G,ROUTE DE GRAZAC,
087212254,00038,08721225400038,O,,NN,,,,true,1,,,,LD,LA MOULINE,81800,RABASTENS,,,81220,,,,,,,,,,,,,,,,,,,1988-07-01,F,,,,,81.21,NAP,N,1.739754,43.83185,0.93,street,Chemin de la Mouline 81800 Rabastens,81220_sq8wly,G,CHEMIN DE LA MOULINE,
087220307,00018,08722030700018,O,,NN,,,,true,1,,67,,RUE,DE MUREL,81800,RABASTENS,,,81220,,,,,,,,,,,,,,,,,,,1991-02-25,F,,,,,06.01,NAP,N,1.715907,43.815887,0.78,housenumber,67 Rue du Pont du Murel 81800 Rabastens,81220_0291_00067,G,67 RUE DU PONT DU MUREL,
087311346,00016,08731134600016,O,1969-01-01,NN,,,2014-07-29T14:25:19,true,4,,10,B,RTE,DE SAURS,81800,RABASTENS,,,81220,,,,,,,,,,,,,,,,,,,2012-05-01,F,,,,,68.20B,NAFRev2,N,1.727237,43.827549,0.75,housenumber,10bis Route de Saurs 81800 Rabastens,81220_0340_00010_bis,G,10BIS ROUTE DE SAURS,
130012842,00212,13001284200212,O,2010-11-01,02,2020,,2022-08-29T09:03:36,false,2,,3,,QUAI,DES ESCOUSSIERES,81800,RABASTENS,,BP 42,81220,,,,,,,,,,,,,,,,,,,2022-01-01,F,TRESORERIE DE RABASTENS-SALVAGNAC,,,,84.11Z,NAFRev2,N,1.724504,43.82137,0.81,housenumber,3 Quai des Escoucières 81800 Rabastens,81220_0130_00003,G,3 QUAI DES ESCOUCIERES,
173102310,00500,17310231000500,O,1993-01-01,,,,,false,3,,13,,PL,GUILLAUME DE CUNH,81800,RABASTENS,,,81220,,,,,,,,,,,,,,,,,,,2002-12-31,F,RECETTE LOCALE,,,,75.1A,NAF1993,N,1.723338,43.820766,0.88,housenumber,13 Place Guillaume de Cunh 81800 Rabastens,81220_0175_00013,G,13 PLACE GUILLAUME DE CUNH,
178102117,00201,17810211700201,O,1983-09-19,,,,2013-04-29T22:36:47,false,4,,3,,QUAI,DES ESCOUSSIERES,81800,RABASTENS,,,81220,,,,,,,,,,,,,,,,,,,2010-11-01,F,TRESORERIE DE RABASTENS-SALVAGNAC,,,,84.11Z,NAFRev2,N,1.724504,43.82137,0.81,housenumber,3 Quai des Escoucières 81800 Rabastens,81220_0130_00003,G,3 QUAI DES ESCOUCIERES,
178102216,00029,17810221600029,O,1983-11-23,,,,,false,4,,13,,PL,GUILLAUME DE CUNH,81800,RABASTENS,,,81220,,,,,,,,,,,,,,,,,,,1993-02-01,F,RECETTE LOCALE  C.E.       RABASTENS,,,,75.1A,NAF1993,N,1.723338,43.820766,0.88,housenumber,13 Place Guillaume de Cunh 81800 Rabastens,81220_0175_00013,G,13 PLACE GUILLAUME DE CUNH,
198100372,00012,19810037200012,O,1983-03-01,21,2020,,2022-08-29T09:04:44,true,3,,2,,RUE,CARNADALE,81800,RABASTENS,,,81220,,,,,,,,,,,,,,,,,,,2008-01-01,A,,,,,85.31Z,NAFRev2,N,1.725415,43.826583,0.82,street,Rue de Carnadale 81800 Rabastens,81220_0058,G,RUE DE CARNADALE,
200034114,00013,20003411400013,O,2013-01-01,,,,2013-06-26T19:59:16,false,2,MAIRIE,3,,QUAI,ESCOUSSIERES,81800,RABASTENS,,,81220,,,,,,,,,,,,,,,,,,,2013-06-24,F,,,,,36.00Z,NAFRev2,O,1.724504,43.82137,0.73,housenumber,3 Quai des Escoucières 81800 Rabastens,81220_0130_00003,G,3 QUAI DES ESCOUCIERES,
200034114,00039,20003411400039,O,2013-07-01,,,,2018-12-27T03:56:12,false,2,,12,,AV,DE L'HERMITAGE,81800,RABASTENS,,,81220,,,,,,,,,,,,,,,,,,,2018-12-31,F,BUREAUX ADMINISTRATIFS,,,,84.11Z,NAFRev2,O,1.734168,43.828339,0.87,housenumber,12 Avenue de l'Hermitage 81800 Rabastens,81220_0185_00012,G,12 AVENUE DE L HERMITAGE,
200066124,00047,20006612400047,O,2017-01-01,12,2020,,2022-08-29T09:05:20,false,2,,8,,PL,GUILLAUME DE CUNH,81800,RABASTENS,,,81220,,,,,,,,,,,,,,,,,,,2018-02-18,A,DECHETS MENAGERS TEOM,,,,38.11Z,NAFRev2,O,1.72318,43.820932,0.87,housenumber,8 Place Guillaume de Cunh 81800 Rabastens,81220_0175_00008,G,8 PLACE GUILLAUME DE CUNH,
218102200,00019,21810220000019,O,1983-03-01,21,2020,,2022-08-29T09:09:11,true,4,,3,,QUAI,ESCOUSSIERES,81800,RABASTENS,,,81220,,,,,,,,,,,,,,,,,,,2008-01-01,A,MAIRIE,,,,84.11Z,NAFRev2,O,1.724504,43.82137,0.73,housenumber,3 Quai des Escoucières 81800 Rabastens,81220_0130_00003,G,3 QUAI DES ESCOUCIERES,
218102200,00027,21810220000027,O,1983-03-16,NN,,,2008-01-04T18:43:25,false,3,,,,LD,LES AUZERALS,81800,RABASTENS,,,81220,,,,,,,,,,,,,,,,,,,2008-01-01,A,CAMPING MUNICIPAL,,,,55.30Z,NAFRev2,N,1.687879,43.837276,0.8,street,Impasse des Auzerals 81800 Rabastens,81220_wf0dwn,G,IMPASSE DES AUZERALS,
218102200,00035,21810220000035,O,1983-12-21,12,2020,,2022-08-29T09:09:11,false,4,,2,,RUE,ELIE AYMERIC,81800,RABASTENS,,,81220,,,,,,,,,,,,,,,,,,,2022-08-09,A,ECOLE PRIMAIRE LAS PEYRAS,,,,85.20Z,NAFRev2,N,1.72472,43.824599,0.95,housenumber,2 Rue Elie Aymeric 81800 Rabastens,81220_0120_00002,G,2 RUE ELIE AYMERIC,
218102200,00043,21810220000043,O,1983-12-21,NN,,,2021-10-27T08:10:55,false,3,,,,RUE,CARNADALE,81800,RABASTENS,,,81220,,,,,,,,,,,,,,,,,,,2008-01-01,A,ECOLE MATERNELLE PUBLIQUE,,,,85.10Z,NAFRev2,N,1.725415,43.826583,0.95,street,Rue de Carnadale 81800 Rabastens,81220_0058,G,RUE DE CARNADALE,
218102200,00050,21810220000050,O,1996-06-06,NN,,,2013-10-05T12:10:34,false,4,MAIRIE,3,,QUAI,ESCOUSSIERES,81800,RABASTENS,,,81220,,,,,,,,,,,,,,,,,,,2012-12-25,F,CRECHE FAMILIALE,,,,88.91A,NAFRev2,N,1.724504,43.82137,0.73,housenumber,3 Quai des Escoucières 81800 Rabastens,81220_0130_00003,G,3 QUAI DES ESCOUCIERES,
218102200,00068,21810220000068,O,1995-12-25,NN,,,2020-06-24T15:40:00,false,3,MAIRIE,3,,QUAI,DES ESCOUSSIERES,81800,RABASTENS,,,81220,,,,,,,,,,,,,,,,,,,2019-12-31,F,SERVICE ASSAINISSEMENT,,,,37.00Z,NAFRev2,N,1.724504,43.82137,0.81,housenumber,3 Quai des Escoucières 81800 Rabastens,81220_0130_00003,G,3 QUAI DES ESCOUCIERES,
218102200,00076,21810220000076,O,1998-01-01,NN,,,2013-10-05T12:10:34,false,4,MAIRIE,,,,,81800,RABASTENS,,,81220,,,,,,,,,,,,,,,,,,,2012-12-25,F,SCES EXTERIEURS POMPES FUNEBRES,,,,96.03Z,NAFRev2,N,1.724706,43.821487,0.92,street,Impasse de la Mairie 81800 Rabastens,81220_0217,D,IMPASSE DE LA MAIRIE,
218102200,00084,21810220000084,O,2006-03-01,,,,2013-08-12T03:36:13,false,3,,,,,PROMENADE DES LICES,81800,RABASTENS,,,81220,,,,,,,,,,,,,,,,,,,2012-01-14,F,CINEMA LA HALLE,,,,59.14Z,NAFRev2,N,1.727058,43.822842,0.56,street,Promenade du Pré Vert 81800 Rabastens,81220_0306,G,PROMENADE DU PRE VERT,
228100012,00290,22810001200290,O,1904-04-04,NN,,,2021-10-27T08:11:40,false,5,,,,RUE,AYMERIC,81800,RABASTENS,,,81220,,,,,,,,,,,,,,,,,,,2008-01-01,A,POSTE ACTION SANITAIRE ET SOCIALE PASS,,,,88.99B,NAFRev2,O,1.724657,43.824429,0.94,street,Rue Elie Aymeric 81800 Rabastens,81220_0120,G,RUE ELIE AYMERIC,
248100109,00011,24810010900011,O,1983-03-01,NN,,,2018-09-29T12:07:32,true,4,MAIRIE,3,,QUAI,ESCOUSSIERES,81800,RABASTENS,,,81220,,,,,,,,,,,,,,,,,,,2016-12-31,F,,,,,84.11Z,NAFRev2,N,1.724504,43.82137,0.73,housenumber,3 Quai des Escoucières 81800 Rabastens,81220_0130_00003,G,3 QUAI DES ESCOUCIERES,
248100109,00029,24810010900029,O,2004-04-30,,,,2017-01-06T09:15:00,false,4,MAIRIE,3,,QUAI,ESCOUSSIERES,81800,RABASTENS,,,81220,,,,,,,,,,,,,,,,,,,2016-12-31,F,ORDURES MENAGERES,,,,37.00Z,NAFRev2,N,1.724504,43.82137,0.73,housenumber,3 Quai des Escoucières 81800 Rabastens,81220_0130_00003,G,3 QUAI DES ESCOUCIERES,
248100471,00015,24810047100015,O,1993-12-29,NN,,,2007-05-19T08:22:51,false,4,MAIRIE,3,,QUAI,ESCOUSSIERES,81800,RABASTENS,,,81220,,,,,,,,,,,,,,,,,,,2005-12-25,F,,,,,75.1A,NAFRev1,O,1.724504,43.82137,0.73,housenumber,3 Quai des Escoucières 81800 Rabastens,81220_0130_00003,G,3 QUAI DES ESCOUCIERES,
248100471,00023,24810047100023,O,1998-01-01,NN,,,2016-10-17T08:42:36,false,4,,8,,PL,GUILLAUME DE GUNH,81800,RABASTENS,,,81220,,,,,,,,,,,,,,,,,,,2017-01-01,F,PARC D'ACTIVITES LES  MASSIES,,,,42.99Z,NAFRev2,N,1.72318,43.820932,0.83,housenumber,8 Place Guillaume de Cunh 81800 Rabastens,81220_0175_00008,G,8 PLACE GUILLAUME DE CUNH,