siren,nic,siret,statutDiffusionEtablissement,dateCreationEtablissement,trancheEffectifsEtablissement,anneeEffectifsEtablissement,activitePrincipaleRegistreMetiersEtablissement,dateDernierTraitementEtablissement,etablissementSiege,nombrePeriodesEtablissement,complementAdresseEtablissement,numeroVoieEtablissement,indiceRepetitionEtablissement,typeVoieEtablissement,libelleVoieEtablissement,codePostalEtablissement,libelleCommuneEtablissement,libelleCommuneEtrangerEtablissement,distributionSpecialeEtablissement,codeCommuneEtablissement,codeCedexEtablissement,libelleCedexEtablissement,codePaysEtrangerEtablissement,libellePaysEtrangerEtablissement,complementAdresse2Etablissement,numeroVoie2Etablissement,indiceRepetition2Etablissement,typeVoie2Etablissement,libelleVoie2Etablissement,codePostal2Etablissement,libelleCommune2Etablissement,libelleCommuneEtranger2Etablissement,distributionSpeciale2Etablissement,codeCommune2Etablissement,codeCedex2Etablissement,libelleCedex2Etablissement,codePaysEtranger2Etablissement,libellePaysEtranger2Etablissement,dateDebut,etatAdministratifEtablissement,enseigne1Etablissement,enseigne2Etablissement,enseigne3Etablissement,denominationUsuelleEtablissement,activitePrincipaleEtablissement,nomenclatureActivitePrincipaleEtablissement,caractereEmployeurEtablissement,longitude,latitude,geo_score,geo_type,geo_adresse,geo_id,geo_ligne,geo_l4,geo_l5
218904332,00010,21890433200010,O,1983-03-01,02,2020,,2022-08-29T09:09:26,true,4,,8,,PL,ST GERMAIN,89200,VAULT-DE-LUGNY,,,89433,,,,,,,,,,,,,,,,,,,2008-01-01,A,MAIRIE,,,,84.11Z,NAFRev2,O,3.848242,47.498291,0.71,housenumber,8 Place Saint-germain 89200 Vault-de-Lugny,89433_0265_00008,G,8 PLACE SAINT GERMAIN,
218904332,00028,21890433200028,O,1983-12-21,NN,,,2019-11-14T14:01:04,false,3,,6,,,GDE RUE VERMOIRON,89200,VAULT-DE-LUGNY,,,89433,,,,,,,,,,,,,,,,,,,2008-01-01,A,ECOLE PRIMAIRE PUBLIQUE,,,,85.20Z,NAFRev2,N,3.842627,47.504813,0.85,housenumber,6 Grande Rue (vermoiron) 89200 Vault-de-Lugny,89433_0117_00006,G,6 GRANDE RUE,VERMOIRON
218904332,00036,21890433200036,O,1997-05-23,NN,,,2019-11-14T14:01:04,false,3,MAIRIE,8,,PL,ST GERMAIN,89200,VAULT-DE-LUGNY,,,89433,,,,,,,,,,,,,,,,,,,2008-01-01,A,SERVICE DES EAUX,,,,36.00Z,NAFRev2,N,3.848242,47.498291,0.71,housenumber,8 Place Saint-germain 89200 Vault-de-Lugny,89433_0265_00008,G,8 PLACE SAINT GERMAIN,
218904332,00044,21890433200044,O,2000-01-01,NN,,,2019-11-14T14:01:04,false,3,MAIRIE,,,,,89200,VAULT-DE-LUGNY,,,89433,,,,,,,,,,,,,,,,,,,2008-01-01,A,SERVICE ASSAINISSEMENT,,,,37.00Z,NAFRev2,N,3.852179,47.50093,0.38,street,Rue de la Papeterie 89200 Vault-de-Lugny,89433_0215,D,RUE DE LA PAPETERIE,
258902410,00012,25890241000012,O,1996-07-01,NN,,,2019-11-14T14:01:04,true,4,,,,,MAIRIE,89200,VAULT-DE-LUGNY,,,89433,,,,,,,,,,,,,,,,,,,2016-08-19,F,,,,,84.13Z,NAFRev2,N,3.852179,47.50093,0.38,street,Rue de la Papeterie 89200 Vault-de-Lugny,89433_0215,G,RUE DE LA PAPETERIE,
268904265,00017,26890426500017,O,1983-03-01,NN,,,2019-11-14T14:01:04,true,4,,,,,MAIRIE,89200,VAULT-DE-LUGNY,,,89433,,,,,,,,,,,,,,,,,,,2016-01-01,F,CCAS,,,,88.99B,NAFRev2,N,3.852179,47.50093,0.38,street,Rue de la Papeterie 89200 Vault-de-Lugny,89433_0215,G,RUE DE LA PAPETERIE,
268906484,00012,26890648400012,O,1986-01-01,NN,,,2019-11-14T14:01:04,true,3,,,,,MAIRIE,89200,VAULT-DE-LUGNY,,,89433,,,,,,,,,,,,,,,,,,,2008-01-01,A,CDE,,,,88.99B,NAFRev2,N,3.852179,47.50093,0.38,street,Rue de la Papeterie 89200 Vault-de-Lugny,89433_0215,G,RUE DE LA PAPETERIE,
278902267,00014,27890226700014,O,,,,,2019-11-14T14:01:04,true,1,,,,,,89200,VAULT-DE-LUGNY,,,89433,,,,,,,,,,,,,,,,,,,1995-12-25,F,,,,,41.0Z,NAF1993,N,,,0,,,,,,
298904335,00015,29890433500015,O,1983-08-10,NN,,,2019-11-14T14:01:04,true,4,,,,,MAIRIE,89200,VAULT-DE-LUGNY,,,89433,,,,,,,,,,,,,,,,,,,2016-11-23,F,,,,,42.99Z,NAFRev2,N,3.852179,47.50093,0.38,street,Rue de la Papeterie 89200 Vault-de-Lugny,89433_0215,G,RUE DE LA PAPETERIE,
300343530,00014,30034353000014,O,,,,,2019-11-14T14:01:04,true,1,,,,LD,VALLOUX,89200,VAULT-DE-LUGNY,,,89433,,,,,,,,,,,,,,,,,,,1987-11-27,F,,,,,81.21,NAP,N,3.846304,47.508802,0.94,street,Valloux 89200 Vault-de-Lugny,89433_mnwfoa,G,VALLOUX,
301479952,00014,30147995200014,O,,NN,,,2019-11-14T14:01:04,true,1,,,,,,89200,VAULT-DE-LUGNY,,,89433,,,,,,,,,,,,,,,,,,,1991-06-30,F,,,,,84.12,NAP,N,,,0,,,,,,
306891813,00041,30689181300041,O,,NN,,,2019-11-14T14:01:04,true,1,,,,,VERMOIRON,89200,VAULT-DE-LUGNY,,,89433,,,,,,,,,,,,,,,,,,,1985-03-15,F,,,,,55.71,NAP,N,3.840219,47.506296,0.92,street,Grande Rue (vermoiron) 89200 Vault-de-Lugny,89433_0117,G,GRANDE RUE,VERMOIRON
307696344,00034,30769634400034,O,1992-06-03,NN,,,2019-11-14T14:01:04,true,3,,,,HAM,VALLOUX,89200,VAULT-DE-LUGNY,,,89433,,,,,,,,,,,,,,,,,,,2004-12-31,F,,,,,01.2G,NAFRev1,N,3.846304,47.508802,0.94,street,Valloux 89200 Vault-de-Lugny,89433_mnwfoa,G,VALLOUX,
309043925,00010,30904392500010,O,1900-01-01,NN,,,2019-11-14T14:01:04,true,3,,,,,VALLOUX,89200,VAULT-DE-LUGNY,,,89433,,,,,,,,,,,,,,,,,,,2008-01-01,A,,,,,68.20B,NAFRev2,N,3.846304,47.508802,0.94,street,Valloux 89200 Vault-de-Lugny,89433_mnwfoa,G,VALLOUX,
309444115,00039,30944411500039,O,1996-04-01,NN,,,2019-11-14T14:01:04,false,3,VERMOIRON,5,,RUE,DES VIGNES,89200,VAULT-DE-LUGNY,,,89433,,,,,,,,,,,,,,,,,,,2004-01-01,F,KRISTIN,,,,92.3A,NAFRev1,N,3.83841,47.505971,0.94,housenumber,5 Rue des Vignes 89200 Vault-de-Lugny,89433_80k5vl_00005,G,5 RUE DES VIGNES,
309567246,00017,30956724600017,O,1977-01-01,NN,,,2019-11-14T14:01:04,true,4,VALLOUX,,,RTE,NATIONALE,89200,VAULT-DE-LUGNY,,,89433,,,,,,,,,,,,,,,,,,,2005-06-27,F,,,,,60.2M,NAFRev1,O,3.840733,47.511918,0.81,street,Route Nationale 6 89200 Vault-de-Lugny,89433_diwrqw,G,ROUTE NATIONALE 6,
311771984,00011,31177198400011,O,1977-01-01,NN,,,2019-11-14T14:01:04,true,6,,,,LD,VALLOUX,89200,VAULT-DE-LUGNY,,,89433,,,,,,,,,,,,,,,,,,,2013-01-31,F,,,,,45.20A,NAFRev2,N,3.846304,47.508802,0.94,street,Valloux 89200 Vault-de-Lugny,89433_mnwfoa,G,VALLOUX,
316483817,00011,31648381700011,O,,,,,2019-11-14T14:01:04,true,1,,,,,VERMOIRON,89200,VAULT-DE-LUGNY,,,89433,,,,,,,,,,,,,,,,,,,1984-12-25,F,,,,,55.60,NAP,N,3.840219,47.506296,0.92,street,Grande Rue (vermoiron) 89200 Vault-de-Lugny,89433_0117,G,GRANDE RUE,VERMOIRON
317080380,00015,31708038000015,O,1979-01-01,NN,,,2019-11-14T14:01:04,true,3,,,,,,89200,VAULT-DE-LUGNY,,,89433,,,,,,,,,,,,,,,,,,,2008-01-01,A,,,,,94.99Z,NAFRev2,N,,,0,,,,,,
318377637,00026,31837763700026,O,2020-02-01,,,,2020-12-24T08:36:44,true,1,VERMOIRON,15,,RUE,DES VIGNES,89200,VAULT-DE-LUGNY,,,89433,,,,,,,,,,,,,,,,,,,2020-02-01,A,,,,,55.20Z,NAFRev2,N,3.837149,47.506454,0.94,housenumber,15 Rue des Vignes 89200 Vault-de-Lugny,89433_80k5vl_00015,G,15 RUE DES VIGNES,
318422326,00039,31842232600039,O,2009-04-01,,,,2021-07-16T09:24:31,true,2,,48,,GR,VERMOIRON,89200,VAULT-DE-LUGNY,,,89433,,,,,,,,,,,,,,,,,,,2020-12-31,F,,,,,43.22A,NAFRev2,N,3.839494,47.507037,0.82,housenumber,48 Grande Rue (vermoiron) 89200 Vault-de-Lugny,89433_0117_00048,G,48 GRANDE RUE,VERMOIRON
320789126,00010,32078912600010,O,1980-10-21,NN,,,2021-08-12T03:41:13,true,6,,5,,RUE,DE LA CHAUME,89200,VAULT-DE-LUGNY,,,89433,,,,,,,,,,,,,,,,,,,2021-03-31,F,,,,,01.11Z,NAFRev2,O,3.85012,47.497723,0.94,housenumber,5 Rue de la Chaume 89200 Vault-de-Lugny,89433_0061_00005,G,5 RUE DE LA CHAUME,
323111393,00019,32311139300019,O,,NN,,,2019-11-14T14:01:04,true,1,,,,,,89200,VAULT-DE-LUGNY,,,89433,,,,,,,,,,,,,,,,,,,1994-07-28,F,,,,,01.1C,NAF1993,N,,,0,,,,,,
324694306,00014,32469430600014,O,1982-02-06,NN,,,2019-11-14T14:01:04,false,4,,,,,VALLOUX,89200,VAULT-DE-LUGNY,,,89433,,,,,,,,,,,,,,,,,,,1996-12-25,F,,,,,70.2C,NAF1993,N,3.846304,47.508802,0.94,street,Valloux 89200 Vault-de-Lugny,89433_mnwfoa,G,VALLOUX,
325382372,00010,32538237200010,O,1982-06-01,01,2020,,2022-08-29T09:18:50,true,5,,5,,RUE,DU CHALET,89200,VAULT-DE-LUGNY,,,89433,,,,,,,,,,,,,,,,,,,2008-01-01,A,,,,,01.41Z,NAFRev2,N,3.848246,47.502256,0.94,housenumber,5 Rue du Châlet 89200 Vault-de-Lugny,89433_0052_00005,G,5 RUE DU CHALET,
329161004,00018,32916100400018,O,1984-01-01,NN,,,2019-11-14T14:01:04,true,1,,1,,RUE,DU MOULIN RIOM,89200,VAULT-DE-LUGNY,,,89433,,,,,,,,,,,,,,,,,,,2002-11-12,F,,,,,70.2B,NAF1993,N,3.816236,47.514763,0.85,housenumber,1 Rue du Moulin Rion 89200 Vault-de-Lugny,89433_yj748f_00001,G,1 RUE DU MOULIN RION,
330363540,00031,33036354000031,O,1990-10-01,NN,,4399CZ,2022-09-30T03:38:43,true,6,VERMOIRON,,,CHE,DE LA PERRIERE,89200,VAULT-DE-LUGNY,,,89433,,,,,,,,,,,,,,,,,,,2022-06-30,F,,,,,43.99C,NAFRev2,N,3.834437,47.507087,0.84,street,Chemin de la Perriere 89200 Vault-de-Lugny,89433_t0iquo,G,CHEMIN DE LA PERRIERE,
334637477,00061,33463747700061,O,2006-07-01,NN,,,2019-11-14T14:01:04,false,7,,36,,,GRANDE RUE A VERMOIRON,89200,VAULT-DE-LUGNY,,,89433,,,,,,,,,,,,,,,,,,,2011-09-30,F,ALAIN NACELLE MULTISERVICES,,,,77.32Z,NAFRev2,N,3.840132,47.506513,0.84,housenumber,36 Grande Rue (vermoiron) 89200 Vault-de-Lugny,89433_0117_00036,G,36 GRANDE RUE,VERMOIRON
335177416,00039,33517741600039,O,1999-01-02,NN,,,2019-11-14T14:01:04,true,1,,11,,RUE,DU PONT,89200,VAULT-DE-LUGNY,,,89433,,,,,,,,,,,,,,,,,,,2001-12-31,F,,,,,29.2K,NAF1993,N,3.850462,47.498468,0.94,housenumber,11 Rue du Pont 89200 Vault-de-Lugny,89433_0230_00011,G,11 RUE DU PONT,
337746887,00013,33774688700013,O,1900-01-01,NN,,,2019-11-14T14:01:04,false,3,,,,HAM,VERMOIRON,89200,VAULT-DE-LUGNY,,,89433,,,,,,,,,,,,,,,,,,,1992-03-01,F,,,,,01.2A,NAF1993,N,3.840219,47.506296,0.92,street,Grande Rue (vermoiron) 89200 Vault-de-Lugny,89433_0117,G,GRANDE RUE,VERMOIRON
337746887,00021,33774688700021,O,2002-07-01,NN,,,2019-11-14T14:01:04,true,4,,,,,VERMOIRON,89200,VAULT-DE-LUGNY,,,89433,,,,,,,,,,,,,,,,,,,2012-12-31,F,,,,,68.20B,NAFRev2,N,3.840219,47.506296,0.92,street,Grande Rue (vermoiron) 89200 Vault-de-Lugny,89433_0117,G,GRANDE RUE,VERMOIRON
340151760,00014,34015176000014,O,,NN,,,2019-11-14T14:01:04,true,1,,,,,MOULIN DE VERMOIRON,89200,VAULT-DE-LUGNY,,,89433,,,,,,,,,,,,,,,,,,,1987-12-31,F,,,,,64.43,NAP,N,3.834787,47.507491,0.69,street,Chemin de la Perriere (vermoiron) 89200 Vault-de-Lugny,89433_0217,G,CHEMIN DE LA PERRIERE,VERMOIRON
342327772,00063,34232777200063,O,2018-01-01,,,,2022-01-13T03:55:05,true,2,,9,,,RUE DU PONT,89200,VAULT-DE-LUGNY,,,89433,,,,,,,,,,,,,,,,,,,2021-12-31,F,,,,,86.90E,NAFRev2,N,3.850355,47.498426,0.94,housenumber,9 Rue du Pont 89200 Vault-de-Lugny,89433_0230_00009,G,9 RUE DU PONT,
350699831,00029,35069983100029,O,1991-01-01,,,,2019-11-14T14:01:04,false,3,,,,HAM,DE VERMOIRON,89200,VAULT-DE-LUGNY,,,89433,,,,,,,,,,,,,,,,,,,1998-10-20,F,,,,,52.4L,NAF1993,N,3.840219,47.506296,0.92,street,Grande Rue (vermoiron) 89200 Vault-de-Lugny,89433_0117,G,GRANDE RUE,VERMOIRON
356000265,05574,35600026505574,O,1991-01-01,NN,,,2019-11-14T14:01:04,false,4,,8,,,GRANDE RUE,89200,VAULT-DE-LUGNY,,,89433,,,,,,,,,,,,,,,,,,,2009-03-18,F,BUREAU DE POSTE,,,,53.10Z,NAFRev2,O,3.842521,47.505016,0.95,housenumber,8 Grande Rue 89200 Vault-de-Lugny,89433_xhms4t_00008,G,8 GRANDE RUE,
379843899,00020,37984389900020,O,1993-04-15,NN,,,2019-11-14T14:01:04,true,5,VALLOUX,,,CHE,DE LA BROSSIERE,89200,VAULT-DE-LUGNY,,,89433,,,,,,,,,,,,,,,,,,,2012-02-20,F,,,,,45.32Z,NAFRev2,N,3.839044,47.512315,0.84,street,Chemin de la Brossiere 89200 Vault-de-Lugny,89433_nr74gc,G,CHEMIN DE LA BROSSIERE,
380936419,00015,38093641900015,O,1991-02-01,NN,,,2019-11-14T14:01:04,false,3,,,,HAM,VERMOIRON,89200,VAULT-DE-LUGNY,,,89433,,,,,,,,,,,,,,,,,,,1995-11-01,F,,,,,45.4C,NAF1993,N,3.840219,47.506296,0.92,street,Grande Rue (vermoiron) 89200 Vault-de-Lugny,89433_0117,G,GRANDE RUE,VERMOIRON
384856514,00011,38485651400011,O,1992-03-01,01,2020,,2022-08-29T09:11:50,true,4,VERMOIRON,58,,,GRANDE RUE,89200,VAULT-DE-LUGNY,,,89433,,,,,,,,,,,,,,,,,,,2012-12-31,A,,,,,01.42Z,NAFRev2,O,3.837937,47.508489,0.95,housenumber,58 Grande Rue 89200 Vault-de-Lugny,89433_xhms4t_00058,G,58 GRANDE RUE,
385120951,00020,38512095100020,O,2020-08-01,,,,2021-02-23T11:13:14,true,1,,7,,RUE,DU CHALET,89200,VAULT-DE-LUGNY,,,89433,,,,,,,,,,,,,,,,,,,2020-08-01,A,,,,JEAN-LUC BURE,47.91B,NAFRev2,N,3.84827,47.502019,0.94,housenumber,7 Rue du Châlet 89200 Vault-de-Lugny,89433_0052_00007,G,7 RUE DU CHALET,
393384201,00025,39338420100025,O,2013-04-17,,,,2021-02-23T11:19:07,true,1,,21,,RUE,DU PUITS VALLOUX,89200,VAULT-DE-LUGNY,,,89433,,,,,,,,,,,,,,,,,,,2013-04-17,A,,,,,68.20B,NAFRev2,N,3.843408,47.511799,0.94,housenumber,21 Rue du Puits (valloux) 89200 Vault-de-Lugny,89433_0235_00021,G,21 RUE DU PUITS,VALLOUX
398904433,00016,39890443300016,O,1994-07-29,,,,2019-11-14T14:01:04,true,4,,,,,,89200,VAULT-DE-LUGNY,,,89433,,,,,,,,,,,,,,,,,,,2018-12-31,F,GIORLA,,,,81.30Z,NAFRev2,O,,,0,,,,,,
400739082,00016,40073908200016,O,1994-01-01,NN,,,2019-11-14T14:01:04,true,3,,,,,,89200,VAULT-DE-LUGNY,,,89433,,,,,,,,,,,,,,,,,,,2008-01-01,A,,,,,01.50Z,NAFRev2,N,,,0,,,,,,
400999942,00040,40099994200040,O,2010-03-15,00,2020,4932ZA,2022-08-29T09:21:53,false,3,VALLOUX,7,,RUE,DU PUITS,89200,VAULT-DE-LUGNY,,,89433,,,,,,,,,,,,,,,,,,,2020-09-18,F,,,,,49.32Z,NAFRev2,O,3.842741,47.512227,0.94,housenumber,7 Rue du Puits 89200 Vault-de-Lugny,89433_x97rwk_00007,G,7 RUE DU PUITS,
402968614,00014,40296861400014,O,1995-08-02,NN,,,2019-11-14T14:01:04,true,3,,,,LD,LA FOIREE,89200,VAULT-DE-LUGNY,,,89433,,,,,,,,,,,,,,,,,,,2008-01-01,A,,,,,68.20B,NAFRev2,N,3.846741,47.503664,0.45,street,Chemin de la Prée 89200 Vault-de-Lugny,89433_0232,G,CHEMIN DE LA PREE,
405109455,00015,40510945500015,O,1996-03-18,NN,,,2019-11-14T14:01:04,true,3,,5,,RUE,DU CHALET,89200,VAULT-DE-LUGNY,,,89433,,,,,,,,,,,,,,,,,,,2008-01-01,A,,,,,82.99Z,NAFRev2,N,3.848246,47.502256,0.94,housenumber,5 Rue du Châlet 89200 Vault-de-Lugny,89433_0052_00005,G,5 RUE DU CHALET,
405252792,00016,40525279200016,O,1996-05-14,01,2020,5610CQ,2022-08-29T09:25:16,true,3,VALLOUX,,,,RN6,89200,VAULT-DE-LUGNY,,,89433,,,,,,,,,,,,,,,,,,,2008-01-01,A,,,,,56.10A,NAFRev2,O,3.841163,47.511876,0.7,street,Route Nationale 6 (valloux) 89200 Vault-de-Lugny,89433_0200,D,ROUTE NATIONALE 6,VALLOUX
408149078,00011,40814907800011,O,1980-12-31,NN,,,2019-11-14T14:01:04,true,4,,,,,,89200,VAULT-DE-LUGNY,,,89433,,,,,,,,,,,,,,,,,,,2012-05-31,F,,,,,01.46Z,NAFRev2,N,,,0,,,,,,
408149086,00014,40814908600014,O,,NN,,,2019-11-14T14:01:04,true,1,,,,,,89200,VAULT-DE-LUGNY,,,89433,,,,,,,,,,,,,,,,,,,1997-11-29,F,,,,,01.1C,NAF1993,N,,,0,,,,,,
408149094,00018,40814909400018,O,1989-12-31,NN,,,2019-11-14T14:01:04,true,4,,,,,CHATEAU,89200,VAULT-DE-LUGNY,,,89433,,,,,,,,,,,,,,,,,,,2002-12-31,F,,,,,01.3Z,NAF1993,N,3.852459,47.496383,0.91,street,Rue du Château 89200 Vault-de-Lugny,89433_0058,G,RUE DU CHATEAU,
410183594,00010,41018359400010,O,1980-12-31,NN,,,2019-11-14T14:01:04,true,4,,,,,VALLOUX,89200,VAULT-DE-LUGNY,,,89433,,,,,,,,,,,,,,,,,,,2010-11-13,F,,,,,68.20B,NAFRev2,N,3.846304,47.508802,0.94,street,Valloux 89200 Vault-de-Lugny,89433_mnwfoa,G,VALLOUX,
410183602,00011,41018360200011,O,1989-12-31,NN,,,2019-11-14T14:01:04,true,4,,,,,VERMOIRON,89200,VAULT-DE-LUGNY,,,89433,,,,,,,,,,,,,,,,,,,2000-06-29,F,,,,,01.1A,NAF1993,N,3.840219,47.506296,0.92,street,Grande Rue (vermoiron) 89200 Vault-de-Lugny,89433_0117,G,GRANDE RUE,VERMOIRON
417743705,00010,41774370500010,O,1998-01-01,,,,2019-11-14T14:01:04,true,1,,10,,PL,ST GERMAIN,89200,VAULT-DE-LUGNY,,,89433,,,,,,,,,,,,,,,,,,,1998-12-31,F,,,,,01.2C,NAF1993,N,3.848438,47.498575,0.73,housenumber,10 Place Saint-germain 89200 Vault-de-Lugny,89433_0265_00010,G,10 PLACE SAINT GERMAIN,
420323727,00016,42032372700016,O,1998-09-12,NN,,,2022-02-12T04:06:29,true,3,,18,,RUE,DE LA CHAUME,89200,VAULT-DE-LUGNY,,,89433,,,,,,,,,,,,,,,,,,,2008-01-01,A,,,,,68.20B,NAFRev2,N,3.85317,47.496899,0.94,housenumber,18 Rue de la Chaume 89200 Vault-de-Lugny,89433_0061_00018,G,18 RUE DE LA CHAUME,
422180612,00018,42218061200018,O,1999-01-23,NN,,,2022-09-06T03:48:19,true,4,,18,,RUE,DE LA CHAUME,89200,VAULT-DE-LUGNY,,,89433,,,,,,,,,,,,,,,,,,,2022-05-21,F,,,,,68.20B,NAFRev2,N,3.85317,47.496899,0.94,housenumber,18 Rue de la Chaume 89200 Vault-de-Lugny,89433_0061_00018,G,18 RUE DE LA CHAUME,
423246420,00016,42324642000016,O,1999-06-14,NN,,,2019-11-14T14:01:04,false,3,,12,,PL,SAINT GERMAIN,89200,VAULT-DE-LUGNY,,,89433,,,,,,,,,,,,,,,,,,,2007-04-08,F,,,,,01.4B,NAFRev1,N,3.848507,47.498754,0.84,housenumber,12 Place Saint-germain 89200 Vault-de-Lugny,89433_0265_00012,G,12 PLACE SAINT GERMAIN,
423801042,00015,42380104200015,O,1999-07-01,NN,,,2019-11-14T14:01:04,false,4,VALLOUX,17,,RUE,CLAUDE,89200,VAULT-DE-LUGNY,,,89433,,,,,,,,,,,,,,,,,,,2013-06-20,F,,,,,01.42Z,NAFRev2,N,3.840123,47.513612,0.94,housenumber,17 Rue Claude 89200 Vault-de-Lugny,89433_6l0hzz_00017,G,17 RUE CLAUDE,
423801042,00023,42380104200023,O,2013-06-20,,,,2021-02-23T11:45:52,true,1,VALLOUX,15,,RUE,CLAUDE,89200,VAULT-DE-LUGNY,,,89433,,,,,,,,,,,,,,,,,,,2013-06-20,A,,,,,01.42Z,NAFRev2,N,3.84031,47.513579,0.94,housenumber,15 Rue Claude 89200 Vault-de-Lugny,89433_6l0hzz_00015,G,15 RUE CLAUDE,
423801042,00031,42380104200031,O,2019-06-01,,,,2019-11-14T14:01:04,false,1,VALLOUX,,,RTE,DE LA GARE LD LE COUDRAY,89200,VAULT-DE-LUGNY,,,89433,,,,,,,,,,,,,,,,,,,2019-06-01,A,,,,,35.11Z,NAFRev2,N,3.841506,47.514719,0.47,street,Rue de la Gare 89200 Vault-de-Lugny,89433_ijoula,G,RUE DE LA GARE,
426711719,00010,42671171900010,O,1967-01-01,NN,,,2019-11-14T14:01:04,false,4,,,,HAM,DE VERMOIRON,89200,VAULT-DE-LUGNY,,,89433,,,,,,,,,,,,,,,,,,,1998-10-10,F,,,,,70.2C,NAF1993,N,3.840219,47.506296,0.92,street,Grande Rue (vermoiron) 89200 Vault-de-Lugny,89433_0117,G,GRANDE RUE,VERMOIRON
426711719,00028,42671171900028,O,2017-01-01,,,,2020-12-24T08:36:44,true,2,,15,,RUE,DES VIGNES,89200,VAULT-DE-LUGNY,,,89433,,,,,,,,,,,,,,,,,,,2020-01-20,F,,,,,68.20A,NAFRev2,N,3.837149,47.506454,0.94,housenumber,15 Rue des Vignes 89200 Vault-de-Lugny,89433_80k5vl_00015,G,15 RUE DES VIGNES,
426720256,00020,42672025600020,O,1997-10-15,NN,,,2019-11-14T14:01:04,true,8,VALLOUX,1,,RTE,NATIONALE 6,89200,VAULT-DE-LUGNY,,,89433,,,,,,,,,,,,,,,,,,,2014-12-10,F,,,,,49.41A,NAFRev2,O,3.840324,47.512178,0.84,housenumber,1 Route Nationale 6 89200 Vault-de-Lugny,89433_diwrqw_00001,G,1 ROUTE NATIONALE 6,
426720363,00016,42672036300016,O,1967-01-01,11,2020,,2022-09-06T03:39:40,true,4,,,,LD,CHATEAU,89200,VAULT-DE-LUGNY,,,89433,,,,,,,,,,,,,,,,,,,2008-01-01,A,,,,,55.10Z,NAFRev2,O,3.852459,47.496383,0.91,street,Rue du Château 89200 Vault-de-Lugny,89433_0058,G,RUE DU CHATEAU,
427210745,00019,42721074500019,O,1972-01-01,NN,,,2019-11-14T14:01:04,true,4,,,,HAM,VALLOUX,89200,VAULT-DE-LUGNY,,,89433,,,,,,,,,,,,,,,,,,,2008-06-30,F,,,,,43.21A,NAFRev2,N,3.846304,47.508802,0.94,street,Valloux 89200 Vault-de-Lugny,89433_mnwfoa,G,VALLOUX,
427220025,00030,42722002500030,O,2014-12-10,12,2020,,2022-08-29T09:06:40,false,1,,1,,RTE,NATIONALE 6,89200,VAULT-DE-LUGNY,,,89433,,,,,,,,,,,,,,,,,,,2014-12-10,A,,,,,49.41A,NAFRev2,O,3.840324,47.512178,0.84,housenumber,1 Route Nationale 6 89200 Vault-de-Lugny,89433_diwrqw_00001,G,1 ROUTE NATIONALE 6,
428536254,00017,42853625400017,O,1986-02-01,NN,,,2023-07-03T21:13:17,true,4,,,,,VALLOUX,89200,VAULT-DE-LUGNY,,,89433,,,,,,,,,,,,,,,,,,,2017-12-25,F,,,,,68.20B,NAFRev2,N,3.846304,47.508802,0.94,street,Valloux 89200 Vault-de-Lugny,89433_mnwfoa,G,VALLOUX,
429550015,00011,42955001500011,O,1987-01-01,NN,,,2023-07-03T20:48:10,true,4,,,,,VERMOIRON,89200,VAULT-DE-LUGNY,,,89433,,,,,,,,,,,,,,,,,,,2017-12-25,F,,,,,01.45Z,NAFRev2,N,3.840219,47.506296,0.92,street,Grande Rue (vermoiron) 89200 Vault-de-Lugny,89433_0117,G,GRANDE RUE,VERMOIRON
434042115,00023,43404211500023,O,2003-04-17,NN,,,2019-11-14T14:01:04,true,3,,11,,RUE,DU CHATEAU,89200,VAULT-DE-LUGNY,,,89433,,,,,,,,,,,,,,,,,,,2008-01-01,A,,,,,68.20A,NAFRev2,N,3.854204,47.495846,0.94,housenumber,11 Rue du Château 89200 Vault-de-Lugny,89433_0058_00011,G,11 RUE DU CHATEAU,
438054496,00015,43805449600015,O,2001-06-02,NN,,,2019-11-14T14:01:04,true,4,VALLOUX,2,,RUE,DU MOULIN RION,89200,VAULT-DE-LUGNY,,,89433,,,,,,,,,,,,,,,,,,,2009-04-30,F,,,,,01.61Z,NAFRev2,N,3.816303,47.513872,0.86,street,Rue du Moulin Rion 89200 Vault-de-Lugny,89433_yj748f,G,RUE DU MOULIN RION,
438710121,00015,43871012100015,O,1999-01-01,NN,,,2019-11-14T14:01:04,true,1,,10,,,GRANDE RUE,89200,VAULT-DE-LUGNY,,,89433,,,,,,,,,,,,,,,,,,,2000-11-21,F,,,,,70.2A,NAF1993,N,3.842198,47.505174,0.95,housenumber,10 Grande Rue 89200 Vault-de-Lugny,89433_xhms4t_00010,G,10 GRANDE RUE,
439336975,00016,43933697500016,O,2001-09-01,NN,,,2019-11-14T14:01:04,true,5,,9,,RUE,DU MOULIN DE VERMOIRON,89200,VAULT-DE-LUGNY,,,89433,,,,,,,,,,,,,,,,,,,2010-10-30,F,,,,,74.90B,NAFRev2,N,3.839046,47.505647,0.68,housenumber,9 Rue du Calvaire (vermoiron) 89200 Vault-de-Lugny,89433_0050_00009,G,9 RUE DU CALVAIRE,VERMOIRON
441702677,00010,44170267700010,O,2002-04-05,NN,,,2019-11-14T14:01:04,true,3,VALLOUX,1,,RUE,DU MOULIN RIOM,89200,VAULT-DE-LUGNY,,,89433,,,,,,,,,,,,,,,,,,,2008-01-01,A,,,,,01.11Z,NAFRev2,N,3.816236,47.514763,0.85,housenumber,1 Rue du Moulin Rion 89200 Vault-de-Lugny,89433_yj748f_00001,G,1 RUE DU MOULIN RION,
442103198,00010,44210319800010,O,2002-04-26,NN,,,2021-04-21T03:42:53,true,3,VERMOIRON,15,,RUE,DES VIGNES,89200,VAULT-DE-LUGNY,,,89433,,,,,,,,,,,,,,,,,,,2008-01-01,A,,,,,68.20B,NAFRev2,N,3.837149,47.506454,0.94,housenumber,15 Rue des Vignes 89200 Vault-de-Lugny,89433_80k5vl_00015,G,15 RUE DES VIGNES,
442659884,00013,44265988400013,O,2002-07-01,NN,,,2019-11-14T14:01:04,true,4,,,,,VERMOIRON,89200,VAULT-DE-LUGNY,,,89433,,,,,,,,,,,,,,,,,,,2012-12-31,F,,,,,68.20B,NAFRev2,N,3.840219,47.506296,0.92,street,Grande Rue (vermoiron) 89200 Vault-de-Lugny,89433_0117,G,GRANDE RUE,VERMOIRON
443146196,00011,44314619600011,O,2002-08-01,NN,,,2022-06-17T09:05:39,true,5,,3,,RUE,DE LA CHAUME,89200,VAULT-DE-LUGNY,,,89433,,,,,,,,,,,,,,,,,,,2019-12-13,F,,,,,82.99Z,NAFRev2,O,3.850187,47.497918,0.94,housenumber,3 Rue de la Chaume 89200 Vault-de-Lugny,89433_0061_00003,G,3 RUE DE LA CHAUME,
443536362,00025,44353636200025,O,2022-08-03,,,,2023-01-09T11:04:02,true,1,,17,,RUE,DU COLOMBIER,89200,VAULT-DE-LUGNY,,,89433,,,,,,,,,,,,,,,,,,,2022-08-03,A,,,,,02.10Z,NAFRev2,N,3.849879,47.500823,0.94,housenumber,17 Rue du Colombier 89200 Vault-de-Lugny,89433_0068_00017,G,17 RUE DU COLOMBIER,
445171770,00016,44517177000016,O,2003-01-02,NN,,,2019-11-14T14:01:04,true,1,,2,,CHE,DE BORLAND,89200,VAULT-DE-LUGNY,,,89433,,,,,,,,,,,,,,,,,,,2003-01-02,F,,,,,,,,3.847571,47.497768,0.83,housenumber,2 Chemin de Borland 89200 Vault-de-Lugny,89433_0024_00002,G,2 CHEMIN DE BORLAND,
449466523,00015,44946652300015,O,2003-06-26,NN,,,2019-11-14T14:01:04,true,3,MR ROBBA DANIEL,27,,,,89200,VAULT-DE-LUGNY,,,89433,,,,,,,,,,,,,,,,,,,2008-01-01,A,,,,,68.20B,NAFRev2,N,,,0,,,,,,
449640705,00033,44964070500033,O,2007-05-17,NN,,4321AB,2021-02-23T13:31:58,true,6,VALLOUX,24,,RUE,CLAUDE,89200,VAULT-DE-LUGNY,,,89433,,,,,,,,,,,,,,,,,,,2012-03-31,A,,,,,43.21A,NAFRev2,N,3.837942,47.51419,0.94,housenumber,24 Rue Claude 89200 Vault-de-Lugny,89433_6l0hzz_00024,G,24 RUE CLAUDE,
450801840,00015,45080184000015,O,2003-11-05,NN,,,2019-11-14T14:01:04,true,3,,,,HAM,DE VALLOUX,89200,VAULT-DE-LUGNY,,,89433,,,,,,,,,,,,,,,,,,,2008-01-01,A,,,,,68.20B,NAFRev2,N,3.840322,47.513605,0.91,street,Rue Claude (valloux) 89200 Vault-de-Lugny,89433_0065,G,RUE CLAUDE,VALLOUX
452669112,00016,45266911200016,O,2003-12-01,02,2020,4399CZ,2022-08-29T09:08:20,true,3,VALLOUX,27,,RUE,DU PUITS VALLOUX,89200,VAULT-DE-LUGNY,,,89433,,,,,,,,,,,,,,,,,,,2008-01-01,A,,,,,43.99C,NAFRev2,O,3.843801,47.511601,0.94,housenumber,27 Rue du Puits (valloux) 89200 Vault-de-Lugny,89433_0235_00027,G,27 RUE DU PUITS,VALLOUX
453079188,00026,45307918800026,O,2005-01-01,,,,2019-11-14T14:01:04,true,2,VERMOIRON,9,,RUE,DU MOULIN,89200,VAULT-DE-LUGNY,,,89433,,,,,,,,,,,,,,,,,,,2008-01-01,A,,,,,55.20Z,NAFRev2,N,3.840686,47.507872,0.94,housenumber,9 Rue du Moulin 89200 Vault-de-Lugny,89433_19p7xc_00009,G,9 RUE DU MOULIN,