siren,nic,siret,statutDiffusionEtablissement,dateCreationEtablissement,trancheEffectifsEtablissement,anneeEffectifsEtablissement,activitePrincipaleRegistreMetiersEtablissement,dateDernierTraitementEtablissement,etablissementSiege,nombrePeriodesEtablissement,complementAdresseEtablissement,numeroVoieEtablissement,indiceRepetitionEtablissement,typeVoieEtablissement,libelleVoieEtablissement,codePostalEtablissement,libelleCommuneEtablissement,libelleCommuneEtrangerEtablissement,distributionSpecialeEtablissement,codeCommuneEtablissement,codeCedexEtablissement,libelleCedexEtablissement,codePaysEtrangerEtablissement,libellePaysEtrangerEtablissement,complementAdresse2Etablissement,numeroVoie2Etablissement,indiceRepetition2Etablissement,typeVoie2Etablissement,libelleVoie2Etablissement,codePostal2Etablissement,libelleCommune2Etablissement,libelleCommuneEtranger2Etablissement,distributionSpeciale2Etablissement,codeCommune2Etablissement,codeCedex2Etablissement,libelleCedex2Etablissement,codePaysEtranger2Etablissement,libellePaysEtranger2Etablissement,dateDebut,etatAdministratifEtablissement,enseigne1Etablissement,enseigne2Etablissement,enseigne3Etablissement,denominationUsuelleEtablissement,activitePrincipaleEtablissement,nomenclatureActivitePrincipaleEtablissement,caractereEmployeurEtablissement,longitude,latitude,geo_score,geo_type,geo_adresse,geo_id,geo_ligne,geo_l4,geo_l5
210804373,00012,21080437300012,O,1983-03-01,03,2020,,2022-08-29T09:05:50,true,4,,6,,RUE,DE LA MAIRIE,08430,VILLERS-LE-TOURNEUR,,,08479,,,,,,,,,,,,,,,,,,,2015-01-11,A,MAIRIE,,,,84.11Z,NAFRev2,O,4.566089,49.626877,0.94,housenumber,6 Rue de la Mairie 08430 Villers-le-Tourneur,08479_0069_00006,G,6 RUE DE LA MAIRIE,
210804373,00038,21080437300038,O,1996-05-01,NN,,,2019-11-14T14:00:16,false,4,MAIRIE,6,,RUE,DE LA MAIRIE,08430,VILLERS-LE-TOURNEUR,,,08479,,,,,,,,,,,,,,,,,,,2012-12-25,F,SERVICE DES EAUX,,,,36.00Z,NAFRev2,N,4.566089,49.626877,0.94,housenumber,6 Rue de la Mairie 08430 Villers-le-Tourneur,08479_0069_00006,G,6 RUE DE LA MAIRIE,
250800695,00018,25080069500018,O,,NN,,,2019-11-14T14:00:16,true,1,,,,,,08430,VILLERS-LE-TOURNEUR,,,08479,,,,,,,,,,,,,,,,,,,1988-12-08,F,,,,,69.22,NAP,N,,,0,,,,,,
260804349,00017,26080434900017,O,1983-03-01,NN,,,2019-11-14T14:00:16,true,5,MAIRIE,6,,RUE,DE LA MAIRIE,08430,VILLERS-LE-TOURNEUR,,,08479,,,,,,,,,,,,,,,,,,,2016-01-01,F,,,,,88.99B,NAFRev2,N,4.566089,49.626877,0.94,housenumber,6 Rue de la Mairie 08430 Villers-le-Tourneur,08479_0069_00006,G,6 RUE DE LA MAIRIE,
270801046,00011,27080104600011,O,,,,,2019-11-14T14:00:16,true,1,,,,,,08430,VILLERS-LE-TOURNEUR,,,08479,,,,,,,,,,,,,,,,,,,1995-12-25,F,,,,,41.0Z,NAF1993,N,,,0,,,,,,
290802446,00010,29080244600010,O,1989-05-23,NN,,,2019-11-14T14:00:16,true,3,MAIRIE,6,,RUE,DE LA MAIRIE,08430,VILLERS-LE-TOURNEUR,,,08479,,,,,,,,,,,,,,,,,,,2008-01-01,A,,,,,42.99Z,NAFRev2,N,4.566089,49.626877,0.94,housenumber,6 Rue de la Mairie 08430 Villers-le-Tourneur,08479_0069_00006,G,6 RUE DE LA MAIRIE,
310821798,00025,31082179800025,O,,,,,2019-11-14T14:00:16,true,1,,,,,,08430,VILLERS-LE-TOURNEUR,,,08479,,,,,,,,,,,,,,,,,,,1984-12-25,F,,,,,67.04,NAP,N,,,0,,,,,,
314057688,00017,31405768800017,O,,NN,,,2019-11-14T14:00:16,true,1,,,,,,08430,VILLERS-LE-TOURNEUR,,,08479,,,,,,,,,,,,,,,,,,,1994-06-30,F,,,,,52.1B,NAF1993,N,,,0,,,,,,
322591595,00010,32259159500010,O,,NN,,,2019-11-14T14:00:16,true,1,,,,,,08430,VILLERS-LE-TOURNEUR,,,08479,,,,,,,,,,,,,,,,,,,1993-07-01,F,,,,,01.1A,NAF1993,N,,,0,,,,,,
326153939,00029,32615393900029,O,1985-12-05,NN,,,2019-11-14T14:00:16,false,4,,,,,GRAND RUE,08430,VILLERS-LE-TOURNEUR,,,08479,,,,,,,,,,,,,,,,,,,1995-06-29,F,,,,,45.4C,NAF1993,N,4.568391,49.625339,0.75,street,Grande Rue 08430 Villers-le-Tourneur,08479_0064,G,GRANDE RUE,
327742391,00011,32774239100011,O,1983-07-01,NN,,,2023-04-12T20:46:42,true,5,,2,,RUE,DU PONT,08430,VILLERS-LE-TOURNEUR,,,08479,,,,,,,,,,,,,,,,,,,2017-05-18,F,,,,,94.99Z,NAFRev2,N,4.57142,49.627974,0.6,housenumber,2 Rue du Cimetiere 08430 Villers-le-Tourneur,08479_0075_00002,G,2 RUE DU CIMETIERE,
341866275,00033,34186627500033,O,2015-01-05,,,4332AA,2021-07-08T08:57:31,true,2,,7,,IMP,DE LA PICHERAINE,08430,VILLERS-LE-TOURNEUR,,,08479,,,,,,,,,,,,,,,,,,,2020-12-31,F,,,,,43.32A,NAFRev2,N,4.565611,49.626582,0.85,housenumber,7 Impasse de la Picheraine 08430 Villers-le-Tourneur,08479_0071_00007,G,7 IMPASSE DE LA PICHERAINE,
378804553,00014,37880455300014,O,1990-07-01,NN,,,2020-07-29T13:50:31,true,4,,,,,,08430,VILLERS-LE-TOURNEUR,,,08479,,,,,,,,,,,,,,,,,,,2020-03-13,F,,,,,68.20B,NAFRev2,N,,,0,,,,,,
384157707,00017,38415770700017,O,1992-01-01,01,2020,,2022-08-29T09:11:10,true,5,LE CHATEAU,,,,CHEZ MR RICHER PIERRE,08430,VILLERS-LE-TOURNEUR,,,08479,,,,,,,,,,,,,,,,,,,2016-12-30,A,,,,,01.50Z,NAFRev2,O,,,0,,,,,,
391032406,00012,39103240600012,O,1993-01-01,,,,2019-11-14T14:00:16,false,3,,,,,,08430,VILLERS-LE-TOURNEUR,,,08479,,,,,,,,,,,,,,,,,,,1995-01-01,F,CE 08,,,,91.3E,NAF1993,N,,,0,,,,,,
391375920,00017,39137592000017,O,1993-07-05,NN,,,2019-11-14T14:00:16,false,4,,,,,,08430,VILLERS-LE-TOURNEUR,,,08479,,,,,,,,,,,,,,,,,,,2000-09-01,F,,,,,45.4J,NAF1993,N,,,0,,,,,,
391616307,00016,39161630700016,O,,NN,,,2019-11-14T14:00:16,true,1,,7,,RUE,DU PARADIS,08430,VILLERS-LE-TOURNEUR,,,08479,,,,,,,,,,,,,,,,,,,1993-12-31,F,,,,,52.6E,NAF1993,N,4.567881,49.628099,0.41,housenumber,7 Rue de la Tolette 08430 Villers-le-Tourneur,08479_0063_00007,G,7 RUE DE LA TOLETTE,
392464707,00018,39246470700018,O,1993-10-01,,,,2019-11-14T14:00:16,false,3,,,,,,08430,VILLERS-LE-TOURNEUR,,,08479,,,,,,,,,,,,,,,,,,,1995-04-25,F,,,,,45.2V,NAF1993,N,,,0,,,,,,
392676706,00014,39267670600014,O,,NN,,,2019-11-14T14:00:16,true,1,,,,,,08430,VILLERS-LE-TOURNEUR,,,08479,,,,,,,,,,,,,,,,,,,1994-01-31,F,,,,,01.3Z,NAF1993,N,,,0,,,,,,
393470323,00014,39347032300014,O,1972-01-01,NN,,,2019-11-14T14:00:16,true,1,,,,,,08430,VILLERS-LE-TOURNEUR,,,08479,,,,,,,,,,,,,,,,,,,1998-07-30,F,,,,,01.1A,NAF1993,N,,,0,,,,,,
394326540,00017,39432654000017,O,1993-01-01,NN,,,2019-11-14T14:00:16,true,3,,,,RTE,NATIONALE,08430,VILLERS-LE-TOURNEUR,,,08479,,,,,,,,,,,,,,,,,,,2007-07-14,F,,,,,01.1A,NAFRev1,N,1.2279812,49.230352,0.77,poi,Route Nationale (Pont) Saint-Pierre-du-Vauvray,https://osm.org/way/95838375,G,,
394460349,00027,39446034900027,O,1995-08-26,NN,,,2019-11-14T14:00:16,true,3,,,,,,08430,VILLERS-LE-TOURNEUR,,,08479,,,,,,,,,,,,,,,,,,,2008-01-01,A,,,,,43.34Z,NAFRev2,N,,,0,,,,,,
397685587,00016,39768558700016,O,,,,,2019-11-14T14:00:16,true,1,,,,,RN 51,08430,VILLERS-LE-TOURNEUR,,,08479,,,,,,,,,,,,,,,,,,,1997-12-31,F,,,,,55.4B,NAF1993,N,,,0,,,,,,
402305395,00012,40230539500012,O,1984-01-01,NN,,,2019-11-14T14:00:16,false,3,,,,,GRAND RUE,08430,VILLERS-LE-TOURNEUR,,,08479,,,,,,,,,,,,,,,,,,,2005-11-30,F,,,,,01.3Z,NAFRev1,N,4.568391,49.625339,0.75,street,Grande Rue 08430 Villers-le-Tourneur,08479_0064,G,GRANDE RUE,
402305395,00038,40230539500038,O,2005-12-01,,,,2021-02-23T11:26:27,true,2,,19,,RUE,PRINCIPALE,08430,VILLERS-LE-TOURNEUR,,,08479,,,,,,,,,,,,,,,,,,,2008-01-01,A,,,,,01.49Z,NAFRev2,N,4.568007,49.627309,0.94,housenumber,19 Rue Principale 08430 Villers-le-Tourneur,08479_0067_00019,G,19 RUE PRINCIPALE,
418847869,00017,41884786900017,O,1998-04-29,,,,2019-11-14T14:00:16,true,1,,,,RTE,N 51,08430,VILLERS-LE-TOURNEUR,,,08479,,,,,,,,,,,,,,,,,,,1999-05-31,F,,,,,92.3A,NAF1993,N,,,0,,,,,,
424776607,00014,42477660700014,O,1995-10-12,NN,,,2019-11-14T14:00:16,true,3,,,,,MAIRIE,08430,VILLERS-LE-TOURNEUR,,,08479,,,,,,,,,,,,,,,,,,,2008-01-01,A,,,,,94.99Z,NAFRev2,N,4.566129,49.626924,0.91,street,Rue de la Mairie 08430 Villers-le-Tourneur,08479_0069,G,RUE DE LA MAIRIE,
433369667,00012,43336966700012,O,2000-09-16,NN,,,2019-11-14T14:00:16,true,4,MAIRIE,,,,,08430,VILLERS-LE-TOURNEUR,,,08479,,,,,,,,,,,,,,,,,,,2008-01-01,A,,,,,94.99Z,NAFRev2,N,4.566129,49.626924,0.91,street,Rue de la Mairie 08430 Villers-le-Tourneur,08479_0069,D,RUE DE LA MAIRIE,
448543363,00015,44854336300015,O,2003-01-01,NN,,,2023-03-31T03:41:04,true,3,,,,,,08430,VILLERS-LE-TOURNEUR,,,08479,,,,,,,,,,,,,,,,,,,2008-01-01,A,,,,,01.42Z,NAFRev2,N,,,0,,,,,,
479697666,00044,47969766600044,O,2016-12-19,,,,2021-02-23T13:42:19,false,1,PLEMONT,,,,,08430,VILLERS-LE-TOURNEUR,,,08479,,,,,,,,,,,,,,,,,,,2016-12-19,A,,,,,35.11Z,NAFRev2,N,,,0,,,,,,
480328962,00018,48032896200018,O,2004-01-01,NN,,,2019-11-14T14:00:16,true,4,,,,LD,LE CHATEAU,08430,VILLERS-LE-TOURNEUR,,,08479,,,,,,,,,,,,,,,,,,,2008-12-31,F,,,,,02.20Z,NAFRev2,N,4.566378,49.623011,0.94,street,Le Chateau 08430 Villers-le-Tourneur,08479_a0ru6y,G,LE CHATEAU,
500179825,00020,50017982500020,O,2015-07-01,,,9602BB,2019-11-14T14:00:16,false,2,,8,,RUE,DE LA MAIRIE,08430,VILLERS-LE-TOURNEUR,,,08479,,,,,,,,,,,,,,,,,,,2016-08-01,F,,,,,96.09Z,NAFRev2,N,4.566103,49.62692,0.94,housenumber,8 Rue de la Mairie 08430 Villers-le-Tourneur,08479_0069_00008,G,8 RUE DE LA MAIRIE,
501144943,00013,50114494300013,O,2007-07-15,,,,2021-02-23T14:11:07,true,3,,16,,RUE,PRINCIPALE,08430,VILLERS-LE-TOURNEUR,,,08479,,,,,,,,,,,,,,,,,,,2012-01-01,A,,,,,01.45Z,NAFRev2,N,4.568579,49.627456,0.94,housenumber,16 Rue Principale 08430 Villers-le-Tourneur,08479_0067_00016,G,16 RUE PRINCIPALE,
510139058,00018,51013905800018,O,2009-01-27,,,,2019-11-14T14:00:16,true,2,,3,,RTE,NATIONALE,08430,VILLERS-LE-TOURNEUR,,,08479,,,,,,,,,,,,,,,,,,,2011-05-16,F,,,,,38.32Z,NAFRev2,N,4.570703,49.627619,0.32,housenumber,3 Rue Principale 08430 Villers-le-Tourneur,08479_0067_00003,G,3 RUE PRINCIPALE,
518606553,00015,51860655300015,O,2009-12-01,,,,2019-11-14T14:00:16,false,2,,18,,RUE,PRINCIPALE,08430,VILLERS-LE-TOURNEUR,,,08479,,,,,,,,,,,,,,,,,,,2015-01-29,F,,,,,43.21A,NAFRev2,N,4.56839,49.627434,0.94,housenumber,18 Rue Principale 08430 Villers-le-Tourneur,08479_0067_00018,G,18 RUE PRINCIPALE,
518606553,00023,51860655300023,O,2015-01-29,,,4321AB,2020-06-12T19:34:10,true,2,,8,,,IMPASSE DU CULOT,08430,VILLERS-LE-TOURNEUR,,,08479,,,,,,,,,,,,,,,,,,,2020-05-20,F,,,,,43.21A,NAFRev2,N,4.569789,49.624479,0.93,housenumber,8 Impasse du Culot 08430 Villers-le-Tourneur,08479_0074_00008,G,8 IMPASSE DU CULOT,
518838917,00038,51883891700038,O,2011-01-01,,,,2019-11-14T14:00:16,false,1,,51,,RTE,NATIONALE,08430,VILLERS-LE-TOURNEUR,,,08479,,,,,,,,,,,,,,,,,,,2011-01-01,A,,,,,49.32Z,NAFRev2,N,1.2279812,49.230352,0.77,poi,Route Nationale (Pont) Saint-Pierre-du-Vauvray,https://osm.org/way/95838375,G,,
519766869,00027,51976686900027,O,2014-01-02,,,,2019-11-14T14:00:16,false,2,,36,,,GRANDE RUE,08430,VILLERS-LE-TOURNEUR,,,08479,,,,,,,,,,,,,,,,,,,2016-12-31,F,,,,,47.78B,NAFRev2,N,4.568391,49.625339,0.94,street,Grande Rue 08430 Villers-le-Tourneur,08479_0064,G,GRANDE RUE,
530539378,00022,53053937800022,P,2015-07-26,,,,2022-01-25T11:22:44,true,3,[ND],[ND],[ND],[ND],[ND],[ND],VILLERS-LE-TOURNEUR,,[ND],08479,[ND],[ND],,,[ND],[ND],[ND],[ND],[ND],[ND],,,[ND],,[ND],[ND],,,2022-01-10,A,[ND],[ND],[ND],[ND],47.99A,NAFRev2,N,,,0,,,,,,
750954505,00012,75095450500012,O,2012-04-23,,,,2019-11-14T14:00:16,false,2,,2,,,IMPASSE DU PAQUIS,08430,VILLERS-LE-TOURNEUR,,,08479,,,,,,,,,,,,,,,,,,,2016-05-01,F,,,,EIRL PLAC'HOSTINGUE,43.31Z,NAFRev2,N,4.568818,49.626221,0.93,housenumber,2 Impasse du Paquis 08430 Villers-le-Tourneur,08479_0068_00002,G,2 IMPASSE DU PAQUIS,
752555029,00012,75255502900012,O,2012-08-01,,,,2019-11-14T14:00:16,false,2,,13,,RUE,DE LA PICHERAINE,08430,VILLERS-LE-TOURNEUR,,,08479,,,,,,,,,,,,,,,,,,,2013-12-01,F,,,,,47.89Z,NAFRev2,N,4.566731,49.625252,0.94,housenumber,13 Rue de la Picheraine 08430 Villers-le-Tourneur,08479_0062_00013,G,13 RUE DE LA PICHERAINE,
753341726,00010,75334172600010,O,2012-08-25,,,,2019-11-14T14:00:16,false,2,,13,,RUE,DE LA PICHERAINE,08430,VILLERS-LE-TOURNEUR,,,08479,,,,,,,,,,,,,,,,,,,2013-12-01,F,,,,,47.89Z,NAFRev2,N,4.566731,49.625252,0.94,housenumber,13 Rue de la Picheraine 08430 Villers-le-Tourneur,08479_0062_00013,G,13 RUE DE LA PICHERAINE,
780278701,00039,78027870100039,O,1981-02-01,NN,,,2019-11-14T14:00:16,true,2,,51,,RTE,NATIONALE 51,08430,VILLERS-LE-TOURNEUR,,,08479,,,,,,,,,,,,,,,,,,,1998-06-25,F,,,,,,,,,,0,,,,,,
780278701,00054,78027870100054,O,2003-05-01,NN,,,2019-11-14T14:00:16,false,4,,,,,,08430,VILLERS-LE-TOURNEUR,,,08479,,,,,,,,,,,,,,,,,,,2008-12-31,F,,,,,01.45Z,NAFRev2,N,,,0,,,,,,
780293338,00015,78029333800015,O,,,,,2019-11-14T14:00:16,true,1,,,,RUE,GRANDE,08430,VILLERS-LE-TOURNEUR,,,08479,,,,,,,,,,,,,,,,,,,1985-12-25,F,,,,,55.71,NAP,N,4.568391,49.625339,0.82,street,Grande Rue 08430 Villers-le-Tourneur,08479_0064,G,GRANDE RUE,
780678660,00025,78067866000025,O,,NN,,,2019-11-14T14:00:16,true,1,,,,,,08430,VILLERS-LE-TOURNEUR,,,08479,,,,,,,,,,,,,,,,,,,,F,,,,,77.01,NAP,N,,,0,,,,,,
786812040,00016,78681204000016,O,,NN,,,2019-11-14T14:00:16,true,1,,,,,,08430,VILLERS-LE-TOURNEUR,,,08479,,,,,,,,,,,,,,,,,,,,F,,,,,48.01,NAP,N,,,0,,,,,,
787210418,00028,78721041800028,O,1990-01-01,NN,,,2019-11-14T14:00:16,true,5,,,,,,08430,VILLERS-LE-TOURNEUR,,,08479,,,,,,,,,,,,,,,,,,,2018-12-31,F,,,,,01.42Z,NAFRev2,N,,,0,,,,,,
793866153,00018,79386615300018,O,2013-06-26,,,,2019-11-14T14:00:16,false,2,,13,,RUE,DE LA PICHERAINE,08430,VILLERS-LE-TOURNEUR,,,08479,,,,,,,,,,,,,,,,,,,2016-04-02,F,,,,,47.89Z,NAFRev2,N,4.566731,49.625252,0.94,housenumber,13 Rue de la Picheraine 08430 Villers-le-Tourneur,08479_0062_00013,G,13 RUE DE LA PICHERAINE,
803588771,00029,80358877100029,O,2020-10-01,,,,2023-02-09T03:41:54,false,2,,22,,RUE,DE LA TOLETTE,08430,VILLERS-LE-TOURNEUR,,,08479,,,,,,,,,,,,,,,,,,,2022-12-01,F,,,,,68.20B,NAFRev2,N,4.569899,49.630351,0.94,housenumber,22 Rue de la Tolette 08430 Villers-le-Tourneur,08479_0063_00022,G,22 RUE DE LA TOLETTE,
819431198,00012,81943119800012,O,2016-03-01,,,4332AA,2023-05-15T14:22:35,true,1,,15,,,GRAND RUE,08430,VILLERS-LE-TOURNEUR,,,08479,,,,,,,,,,,,,,,,,,,2016-03-01,A,BELLOY STEPHANE,,,,43.32A,NAFRev2,N,4.568503,49.625279,0.8,housenumber,15 Grande Rue 08430 Villers-le-Tourneur,08479_0064_00015,G,15 GRANDE RUE,
822985792,00016,82298579200016,O,2016-10-15,,,,2019-11-14T14:00:16,false,2,,9,,RUE,DE LA PICHERAINE,08430,VILLERS-LE-TOURNEUR,,,08479,,,,,,,,,,,,,,,,,,,2019-06-12,F,S.C.J. INVEST,,,S.C.J. INVEST,68.10Z,NAFRev2,N,4.566682,49.625524,0.94,housenumber,9 Rue de la Picheraine 08430 Villers-le-Tourneur,08479_0062_00009,G,9 RUE DE LA PICHERAINE,
833766207,00017,83376620700017,O,2017-12-01,,,,2019-11-14T14:00:16,true,2,,31,,RUE,DE LA TOLETTE,08430,VILLERS-LE-TOURNEUR,,,08479,,,,,,,,,,,,,,,,,,,2018-02-01,F,,,,,66.22Z,NAFRev2,N,4.569845,49.630283,0.94,housenumber,31 Rue de la Tolette 08430 Villers-le-Tourneur,08479_0063_00031,G,31 RUE DE LA TOLETTE,
844349548,00017,84434954800017,O,2019-01-01,,,,2019-11-14T14:00:16,true,1,,18,,RUE,DE LA PICHERAINE,08430,VILLERS-LE-TOURNEUR,,,08479,,,,,,,,,,,,,,,,,,,2019-01-01,A,,,,,01.42Z,NAFRev2,N,4.566672,49.624735,0.94,housenumber,18 Rue de la Picheraine 08430 Villers-le-Tourneur,08479_0062_00018,G,18 RUE DE LA PICHERAINE,
847967189,00014,84796718900014,O,2018-12-17,,,,2023-07-13T14:55:33,false,2,,4,,IMP,DU CULOT,08430,VILLERS-LE-TOURNEUR,,,08479,,,,,,,,,,,,,,,,,,,2023-04-17,F,,,,,68.20B,NAFRev2,N,4.568723,49.624649,0.81,housenumber,4 Impasse du Culot 08430 Villers-le-Tourneur,08479_0074_00004,G,4 IMPASSE DU CULOT,
849916861,00016,84991686100016,O,2019-04-05,,,,2019-11-14T14:00:16,true,1,,38,,RUE,PRINCIPALE,08430,VILLERS-LE-TOURNEUR,,,08479,,,,,,,,,,,,,,,,,,,2019-04-05,A,,,,,66.30Z,NAFRev2,N,4.565305,49.627094,0.94,housenumber,38 Rue Principale 08430 Villers-le-Tourneur,08479_0067_00038,G,38 RUE PRINCIPALE,
891708448,00016,89170844800016,O,2020-11-12,,,9511ZZ,2020-12-04T19:34:40,true,1,,20,,RTE,PRINCIPALE,08430,VILLERS-LE-TOURNEUR,,,08479,,,,,,,,,,,,,,,,,,,2020-11-12,A,,,,ALLO INFO,95.11Z,NAFRev2,N,4.568078,49.627399,0.79,housenumber,20 Rue Principale 08430 Villers-le-Tourneur,08479_0067_00020,G,20 RUE PRINCIPALE,
897549416,00013,89754941600013,O,2021-03-24,,,,2021-03-25T11:50:24,true,1,,11,,RUE,GRANDE RUE,08430,VILLERS-LE-TOURNEUR,,,08479,,,,,,,,,,,,,,,,,,,2021-03-24,A,,,,FANNYME,93.29Z,NAFRev2,N,4.568463,49.625514,0.83,housenumber,11 Grande Rue 08430 Villers-le-Tourneur,08479_0064_00011,G,11 GRANDE RUE,
907545651,00016,90754565100016,O,2021-11-23,,,,2021-11-25T08:39:56,true,1,,8,,RUE,DE LA MAIRIE,08430,VILLERS-LE-TOURNEUR,,,08479,,,,,,,,,,,,,,,,,,,2021-11-23,A,,,,,47.99A,NAFRev2,N,4.566103,49.62692,0.94,housenumber,8 Rue de la Mairie 08430 Villers-le-Tourneur,08479_0069_00008,G,8 RUE DE LA MAIRIE,
915028393,00014,91502839300014,O,2022-07-01,,,4321AB,2022-06-30T03:57:27,true,1,,17,,RUE,GRANDE RUE,08430,VILLERS-LE-TOURNEUR,,,08479,,,,,,,,,,,,,,,,,,,2022-07-01,A,,,,SEBASTIEN FERNANDES,43.21A,NAFRev2,N,4.56851,49.625233,0.83,housenumber,17 Grande Rue 08430 Villers-le-Tourneur,08479_0064_00017,G,17 GRANDE RUE,
923315329,00014,92331532900014,O,2023-05-01,,,,2023-03-31T07:24:55,true,1,,1,,R,DU CHATEAU D'EAU,08430,VILLERS-LE-TOURNEUR,,,08479,,,,,,,,,,,,,,,,,,,2023-05-01,A,,,,,01.42Z,NAFRev2,N,4.565723,49.627252,0.84,housenumber,1 Rue du Chateau d’Eau 08430 Villers-le-Tourneur,08479_0058_00001,G,1 RUE DU CHATEAU D EAU,
948809793,00011,94880979300011,O,2023-02-08,,,,2023-03-04T14:38:33,true,1,,11,,RUE,DE LA PICHERAINE,08430,VILLERS-LE-TOURNEUR,,,08479,,,,,,,,,,,,,,,,,,,2023-02-08,A,,,,JP MULTISERVICES,47.89Z,NAFRev2,N,4.566551,49.625384,0.94,housenumber,11 Rue de la Picheraine 08430 Villers-le-Tourneur,08479_0062_00011,G,11 RUE DE LA PICHERAINE,
