siren,nic,siret,statutDiffusionEtablissement,dateCreationEtablissement,trancheEffectifsEtablissement,anneeEffectifsEtablissement,activitePrincipaleRegistreMetiersEtablissement,dateDernierTraitementEtablissement,etablissementSiege,nombrePeriodesEtablissement,complementAdresseEtablissement,numeroVoieEtablissement,indiceRepetitionEtablissement,typeVoieEtablissement,libelleVoieEtablissement,codePostalEtablissement,libelleCommuneEtablissement,libelleCommuneEtrangerEtablissement,distributionSpecialeEtablissement,codeCommuneEtablissement,codeCedexEtablissement,libelleCedexEtablissement,codePaysEtrangerEtablissement,libellePaysEtrangerEtablissement,complementAdresse2Etablissement,numeroVoie2Etablissement,indiceRepetition2Etablissement,typeVoie2Etablissement,libelleVoie2Etablissement,codePostal2Etablissement,libelleCommune2Etablissement,libelleCommuneEtranger2Etablissement,distributionSpeciale2Etablissement,codeCommune2Etablissement,codeCedex2Etablissement,libelleCedex2Etablissement,codePaysEtranger2Etablissement,libellePaysEtranger2Etablissement,dateDebut,etatAdministratifEtablissement,enseigne1Etablissement,enseigne2Etablissement,enseigne3Etablissement,denominationUsuelleEtablissement,activitePrincipaleEtablissement,nomenclatureActivitePrincipaleEtablissement,caractereEmployeurEtablissement,longitude,latitude,geo_score,geo_type,geo_adresse,geo_id,geo_ligne,geo_l4,geo_l5
211406988,00017,21140698800017,O,1983-03-01,01,2020,,2022-08-29T09:06:03,true,4,,,,,LE BOURG,14940,TOUFFREVILLE,,,14698,,,,,,,,,,,,,,,,,,,2008-01-01,A,MAIRIE,,,,84.11Z,NAFRev2,O,-0.214922,49.204445,0.61,street,Route de Cabourg 14940 Touffréville,14698_0065,G,ROUTE DE CABOURG,
211406988,00025,21140698800025,O,2016-04-27,,,,2023-05-30T09:55:13,false,1,,,,,LE BOURG,14940,TOUFFREVILLE,,,14698,,,,,,,,,,,,,,,,,,,2016-04-27,A,LOTISSEMENT DU BOUT ROULANT,,,,42.99Z,NAFRev2,N,-0.214922,49.204445,0.61,street,Route de Cabourg 14940 Touffréville,14698_0065,G,ROUTE DE CABOURG,
211406988,00033,21140698800033,O,2016-05-24,,,,2023-05-30T09:56:18,false,1,,,,,LE BOURG,14940,TOUFFREVILLE,,,14698,,,,,,,,,,,,,,,,,,,2016-05-24,A,LOTISSEMENT DU BOIS,,,,42.99Z,NAFRev2,N,-0.214922,49.204445,0.61,street,Route de Cabourg 14940 Touffréville,14698_0065,G,ROUTE DE CABOURG,
261405880,00012,26140588000012,O,1995-12-25,,,,2020-10-01T10:59:24,true,3,MAIRIE,,,,LE BOURG,14940,TOUFFREVILLE,,,14698,,,,,,,,,,,,,,,,,,,2020-01-01,F,CCAS,,,,88.99B,NAFRev2,N,-0.214922,49.204445,0.61,street,Route de Cabourg 14940 Touffréville,14698_0065,G,ROUTE DE CABOURG,
305293789,00015,30529378900015,O,1976-01-01,NN,,,2008-11-07T00:21:03,true,3,,,,,LA GRANDE BRUYERE,14940,TOUFFREVILLE,,,14698,,,,,,,,,,,,,,,,,,,2007-02-13,F,,,,,50.1Z,NAFRev1,N,-0.215905,49.210531,0.93,locality,La Grande Bruyère 14940 Touffréville,14698_B021,G,LA GRANDE BRUYERE,
305293904,00010,30529390400010,O,1976-01-01,NN,,,2008-11-07T00:21:03,true,3,,,,,LA GRANDE BRUYERE,14940,TOUFFREVILLE,,,14698,,,,,,,,,,,,,,,,,,,2007-02-13,F,,,,,50.1Z,NAFRev1,N,-0.215905,49.210531,0.93,locality,La Grande Bruyère 14940 Touffréville,14698_B021,G,LA GRANDE BRUYERE,
309463057,00013,30946305700013,O,,,,,,true,1,,,,,,14940,TOUFFREVILLE,,,14698,,,,,,,,,,,,,,,,,,,1984-12-25,F,,,,,65.02,NAP,N,,,0,,,,,,
309544989,00010,30954498900010,O,,NN,,,,true,1,,,,,,14940,TOUFFREVILLE,,,14698,,,,,,,,,,,,,,,,,,,1988-06-30,F,,,,,64.21,NAP,N,,,0,,,,,,
309794170,00014,30979417000014,O,,NN,,,,true,1,,,,,LA GRANDE BRUYERE,14940,TOUFFREVILLE,,,14698,,,,,,,,,,,,,,,,,,,1994-03-31,F,,,,,71.3G,NAF1993,N,-0.215905,49.210531,0.93,locality,La Grande Bruyère 14940 Touffréville,14698_B021,G,LA GRANDE BRUYERE,
310346838,00025,31034683800025,O,,,,,,true,1,,,,RUE,DU CLOS HEBERT,14940,TOUFFREVILLE,,,14698,,,,,,,,,,,,,,,,,,,1991-06-06,F,,,,,28.6F,NAF1993,N,-0.22421,49.190649,0.44,street,Rue du Centre 14940 Touffréville,14698_0080,G,RUE DU CENTRE,
315135137,00018,31513513700018,O,,,,,,true,1,,,,,,14940,TOUFFREVILLE,,,14698,,,,,,,,,,,,,,,,,,,1985-12-25,F,,,,,55.40,NAP,N,,,0,,,,,,
319493912,00038,31949391200038,O,1994-11-01,NN,,,,false,3,,,,CHE,DU CLOS HEBERT,14940,TOUFFREVILLE,,,14698,,,,,,,,,,,,,,,,,,,1996-12-31,F,,,,,29.7A,NAF1993,O,,,0,,,,,,
321474090,00024,32147409000024,O,1982-09-25,NN,,,2008-11-07T00:37:43,false,4,,,,,LA GRANDE BRUYERE,14940,TOUFFREVILLE,,,14698,,,,,,,,,,,,,,,,,,,2000-04-14,F,,,,,52.4X,NAF1993,N,-0.215905,49.210531,0.93,locality,La Grande Bruyère 14940 Touffréville,14698_B021,G,LA GRANDE BRUYERE,
323719120,00020,32371912000020,O,,,,,,true,1,,,,,LE PRE BARON,14940,TOUFFREVILLE,,,14698,,,,,,,,,,,,,,,,,,,1989-06-29,F,,,,,55.72,NAP,N,-0.230899,49.20504,0.93,locality,Le Pré Baron 14940 Touffréville,14698_B037,G,LE PRE BARON,
324702182,00019,32470218200019,O,,,,,,true,1,,,,,,14940,TOUFFREVILLE,,,14698,,,,,,,,,,,,,,,,,,,1985-12-25,F,,,,,62.41,NAP,N,,,0,,,,,,
327853982,00012,32785398200012,O,1983-06-11,NN,,,2008-01-04T19:32:28,true,5,,2,,RUE,DE L EGLISE,14940,TOUFFREVILLE,,,14698,,,,,,,,,,,,,,,,,,,2008-01-01,A,,,,,68.20B,NAFRev2,N,-0.224806,49.188363,0.94,housenumber,2 Rue de l'Église 14940 Touffréville,14698_0160_00002,G,2 RUE DE L EGLISE,
327992608,00023,32799260800023,O,1985-07-01,NN,,,,true,4,,,,,,14940,TOUFFREVILLE,,,14698,,,,,,,,,,,,,,,,,,,2003-12-25,F,,,,,90.0B,NAFRev1,N,,,0,,,,,,
328324041,00065,32832404100065,O,2003-01-02,NN,,,2008-11-07T00:46:08,true,3,,,,,LE PRE BARON,14940,TOUFFREVILLE,,,14698,,,,,,,,,,,,,,,,,,,2004-12-07,F,,,,,45.4J,NAFRev1,N,-0.230899,49.20504,0.93,locality,Le Pré Baron 14940 Touffréville,14698_B037,G,LE PRE BARON,
329473334,00053,32947333400053,O,2012-07-28,,,4322BB,2021-11-09T08:46:09,true,4,,15,,RUE,DES ROSIERS,14940,TOUFFREVILLE,,,14698,,,,,,,,,,,,,,,,,,,2021-10-31,F,,,,,43.22B,NAFRev2,N,-0.226092,49.190077,0.94,housenumber,15 Rue des Rosiers 14940 Touffréville,14698_0295_00015,G,15 RUE DES ROSIERS,
329521322,00019,32952132200019,O,1984-01-01,NN,,,2007-01-18T09:18:53,true,4,,,,,,14940,TOUFFREVILLE,,,14698,,,,,,,,,,,,,,,,,,,1994-12-25,F,,,,,01.3Z,NAF1993,N,,,0,,,,,,
329890313,00011,32989031300011,O,1984-01-16,NN,,,2007-02-14T07:06:52,true,3,,,,,LA GRANDE BRUYERE,14940,TOUFFREVILLE,,,14698,,,,,,,,,,,,,,,,,,,2007-02-13,F,,,,,50.2Z,NAFRev1,N,-0.215905,49.210531,0.93,locality,La Grande Bruyère 14940 Touffréville,14698_B021,G,LA GRANDE BRUYERE,
330629742,00017,33062974200017,O,,NN,,,2006-11-25T10:14:25,true,1,,,,,,14940,TOUFFREVILLE,,,14698,,,,,,,,,,,,,,,,,,,1985-01-01,F,,,,,01.3Z,NAF1993,N,,,0,,,,,,
331841262,00032,33184126200032,O,1900-01-01,NN,,,2011-04-28T00:26:51,false,4,,,,RUE,DE L'EGLISE,14940,TOUFFREVILLE,,,14698,,,,,,,,,,,,,,,,,,,1992-09-30,F,,,,,74.8A,NAF1993,N,-0.22384,49.189172,0.94,street,Rue de l'Église 14940 Touffréville,14698_0160,G,RUE DE L EGLISE,
332388693,00027,33238869300027,O,2004-08-01,,,,2022-10-01T03:42:39,false,4,,,,CHE,SAULNIER,14940,TOUFFREVILLE,,,14698,,,,,,,,,,,,,,,,,,,2022-07-31,F,,,,,38.21Z,NAFRev2,O,-0.225764,49.191742,0.31,street,Chemin des Lauriers 14940 Touffréville,14698_md6mwk,G,CHEMIN DES LAURIERS,
333483766,00015,33348376600015,O,,,,,,true,1,,,,,LES GRANDES BRUYERES,14940,TOUFFREVILLE,,,14698,,,,,,,,,,,,,,,,,,,1989-09-30,F,,,,,69.12,NAP,N,-0.215905,49.210531,0.61,locality,La Grande Bruyère 14940 Touffréville,14698_B021,G,LA GRANDE BRUYERE,
333663102,00049,33366310200049,O,1998-10-01,NN,,4321AB,2022-04-27T08:32:48,true,6,,7,,RUE,DE L'EGLISE,14940,TOUFFREVILLE,,,14698,,,,,,,,,,,,,,,,,,,2022-03-28,A,,,,,43.21A,NAFRev2,O,-0.223613,49.189975,0.94,housenumber,7 Rue de l'Église 14940 Touffréville,14698_0160_00007,G,7 RUE DE L EGLISE,
334633252,00013,33463325200013,O,1986-01-01,NN,,,2008-01-04T20:52:52,true,3,,,,,,14940,TOUFFREVILLE,,,14698,,,,,,,,,,,,,,,,,,,2008-01-01,A,,,,,01.43Z,NAFRev2,N,,,0,,,,,,
334797420,00018,33479742000018,O,1986-02-10,NN,,,2016-10-07T11:52:46,true,4,,,,LD,LE VABARD,14940,TOUFFREVILLE,,,14698,,,,,,,,,,,,,,,,,,,2016-09-01,A,,,,,01.41Z,NAFRev2,O,-0.230899,49.20504,0.37,locality,Le Pré Baron 14940 Touffréville,14698_B037,G,LE PRE BARON,
334797420,00026,33479742000026,O,1999-03-12,NN,,,2017-05-04T04:52:15,false,4,,,,LD,LE VABARD,14940,TOUFFREVILLE,,,14698,,,,,,,,,,,,,,,,,,,2016-06-10,F,,,,,01.61Z,NAFRev2,N,-0.230899,49.20504,0.37,locality,Le Pré Baron 14940 Touffréville,14698_B037,G,LE PRE BARON,
334797420,00034,33479742000034,O,2016-06-10,NN,,,2021-10-27T08:30:50,false,2,,6,,RUE,DE L'EGLISE,14940,TOUFFREVILLE,,,14698,,,,,,,,,,,,,,,,,,,2019-12-31,F,,,,,01.61Z,NAFRev2,N,-0.22385,49.188689,0.94,housenumber,6 Rue de l'Église 14940 Touffréville,14698_0160_00006,G,6 RUE DE L EGLISE,
338257520,00043,33825752000043,O,2007-07-01,,,,2021-03-07T20:00:38,true,3,,6,,RUE,DU CENTRE,14940,TOUFFREVILLE,,,14698,,,,,,,,,,,,,,,,,,,2014-12-31,A,,,,,47.81Z,NAFRev2,N,-0.224444,49.190789,0.94,housenumber,6 Rue du Centre 14940 Touffréville,14698_0080_00006,G,6 RUE DU CENTRE,
338515893,00026,33851589300026,O,1988-09-01,NN,,,,true,3,,,,RUE,DE LA COUR CAILLOUX,14940,TOUFFREVILLE,,,14698,,,,,,,,,,,,,,,,,,,1994-12-25,F,,,,,51.3N,NAF1993,O,-0.22408,49.189774,0.79,street,Chemin de la Cour Cailloux 14940 Touffréville,14698_8q96wa,G,CHEMIN DE LA COUR CAILLOUX,
338569130,00010,33856913000010,O,,NN,,,,true,1,,,,RUE,DU CENTRE,14940,TOUFFREVILLE,,,14698,,,,,,,,,,,,,,,,,,,1987-03-31,F,,,,,55.3A,NAF1993,N,-0.22421,49.190649,0.94,street,Rue du Centre 14940 Touffréville,14698_0080,G,RUE DU CENTRE,
338980196,00012,33898019600012,O,1985-01-01,,,,2008-07-22T12:02:16,true,4,,,,,,14940,TOUFFREVILLE,,,14698,,,,,,,,,,,,,,,,,,,2008-01-01,A,,,,,01.41Z,NAFRev2,N,,,0,,,,,,
339246399,00028,33924639900028,O,1987-11-01,NN,,,,false,4,,,,RUE,DE L'EGLISE,14940,TOUFFREVILLE,,,14698,,,,,,,,,,,,,,,,,,,1999-08-31,F,,,,,45.4D,NAF1993,O,-0.22384,49.189172,0.94,street,Rue de l'Église 14940 Touffréville,14698_0160,G,RUE DE L EGLISE,
340032630,00014,34003263000014,O,,,,,,true,1,,,,,LE PRE BARON,14940,TOUFFREVILLE,,,14698,,,,,,,,,,,,,,,,,,,1988-11-09,F,,,,,55.71,NAP,N,-0.230899,49.20504,0.93,locality,Le Pré Baron 14940 Touffréville,14698_B037,G,LE PRE BARON,
341986941,00019,34198694100019,O,1987-07-16,NN,,,2008-01-05T19:34:01,true,3,,14,,RUE,DE L EGLISE,14940,TOUFFREVILLE,,,14698,,,,,,,,,,,,,,,,,,,2008-01-01,A,,,,,68.20B,NAFRev2,N,-0.22337,49.190009,0.94,housenumber,14 Rue de l'Église 14940 Touffréville,14698_0160_00014,G,14 RUE DE L EGLISE,
342981982,00016,34298198200016,O,,NN,,,2023-04-03T11:06:54,true,1,,,,,,14940,TOUFFREVILLE,,,14698,,,,,,,,,,,,,,,,,,,1990-07-14,F,,,,,67.01,NAP,N,,,0,,,,,,
343426235,00010,34342623500010,O,,,,,,true,1,,,,,LE PRE BARON,14940,TOUFFREVILLE,,,14698,,,,,,,,,,,,,,,,,,,1990-06-28,F,,,,,55.60,NAP,N,-0.230899,49.20504,0.93,locality,Le Pré Baron 14940 Touffréville,14698_B037,G,LE PRE BARON,
343585337,00011,34358533700011,O,,NN,,,2006-11-25T10:48:40,true,1,,,,,LE PRE BARON,14940,TOUFFREVILLE,,,14698,,,,,,,,,,,,,,,,,,,1994-08-22,F,,,,,45.2V,NAF1993,N,-0.230899,49.20504,0.93,locality,Le Pré Baron 14940 Touffréville,14698_B037,G,LE PRE BARON,
344410964,00011,34441096400011,O,1988-04-01,NN,,,2022-01-14T11:57:25,true,10,,,,,LA GRANDE BRUYERE,14940,TOUFFREVILLE,,,14698,,,,,,,,,,,,,,,,,,,2017-09-20,F,LA GRANDE BRUYERE,,,LA GRANDE BRUYERE,55.10Z,NAFRev2,N,-0.215905,49.210531,0.93,locality,La Grande Bruyère 14940 Touffréville,14698_B021,G,LA GRANDE BRUYERE,
345397715,00011,34539771500011,O,1900-01-01,NN,,,2011-04-28T00:37:57,false,3,,,,,LA GRANDE BRUYERE,14940,TOUFFREVILLE,,,14698,,,,,,,,,,,,,,,,,,,1993-10-31,F,,,,,93.0D,NAF1993,N,-0.215905,49.210531,0.93,locality,La Grande Bruyère 14940 Touffréville,14698_B021,G,LA GRANDE BRUYERE,
347561128,00062,34756112800062,O,2018-08-01,,,8121ZZ,2022-05-24T15:02:14,false,3,,11,B,RUE,DE LA BUTTE VERTE,14940,TOUFFREVILLE,,,14698,,,,,,,,,,,,,,,,,,,2022-02-26,F,,,,,81.21Z,NAFRev2,N,-0.224092,49.195893,0.77,housenumber,11bis Route de la Butte Verte 14940 Touffréville,14698_0040_00011_bis,G,11BIS ROUTE DE LA BUTTE VERTE,
347561128,00070,34756112800070,O,2022-06-01,,,4333ZZ,2022-06-04T12:51:32,true,1,,507,,RUE,DE LA BUTTE VERTE,14940,TOUFFREVILLE,,,14698,,,,,,,,,,,,,,,,,,,2022-06-01,A,,,,,43.33Z,NAFRev2,N,-0.22407,49.191949,0.7,street,Route de la Butte Verte 14940 Touffréville,14698_0040,G,ROUTE DE LA BUTTE VERTE,
348248535,00018,34824853500018,O,1988-10-01,NN,,,2008-01-04T22:49:45,true,3,LA GRANDE BRUYERE,,,,,14940,TOUFFREVILLE,,,14698,,,,,,,,,,,,,,,,,,,2008-01-01,A,,,,,68.20B,NAFRev2,N,-0.215905,49.210531,0.93,locality,La Grande Bruyère 14940 Touffréville,14698_B021,D,LA GRANDE BRUYERE,
350561031,00039,35056103100039,O,2000-07-01,,,,2006-12-15T00:36:20,false,3,,,,,LA BUTTE VERTE,14940,TOUFFREVILLE,,,14698,,,,,,,,,,,,,,,,,,,2001-11-03,F,,,,,51.2C,NAF1993,N,-0.22407,49.191949,0.93,street,Route de la Butte Verte 14940 Touffréville,14698_0040,G,ROUTE DE LA BUTTE VERTE,
351068788,00022,35106878800022,O,1995-10-02,NN,,,2014-07-08T00:55:06,true,6,,7,,RUE,DES JARDINS,14940,TOUFFREVILLE,,,14698,,,,,,,,,,,,,,,,,,,2010-09-06,F,,,,,81.30Z,NAFRev2,N,-0.224479,49.192033,0.94,housenumber,7 Rue des Jardins 14940 Touffréville,14698_0260_00007,G,7 RUE DES JARDINS,
351782875,00022,35178287500022,O,1997-12-01,NN,,,,true,1,,,,RUE,DE L'EGLISE,14940,TOUFFREVILLE,,,14698,,,,,,,,,,,,,,,,,,,2000-05-10,F,,,,,45.4M,NAF1993,O,-0.22384,49.189172,0.94,street,Rue de l'Église 14940 Touffréville,14698_0160,G,RUE DE L EGLISE,
351833884,00015,35183388400015,O,1989-10-02,NN,,,,true,1,,,,RUE,DU CENTRE,14940,TOUFFREVILLE,,,14698,,,,,,,,,,,,,,,,,,,2000-11-02,F,,,,,60.2L,NAF1993,O,-0.22421,49.190649,0.94,street,Rue du Centre 14940 Touffréville,14698_0080,G,RUE DU CENTRE,
352895593,00023,35289559300023,O,1997-10-01,NN,,,2015-01-21T05:11:49,true,6,,1,,RUE,DE L'EGLISE,14940,TOUFFREVILLE,,,14698,,,,,,,,,,,,,,,,,,,2014-12-31,F,,,,,25.99B,NAFRev2,N,-0.22384,49.189172,0.85,street,Rue de l'Église 14940 Touffréville,14698_0160,G,RUE DE L EGLISE,
379723703,00011,37972370300011,O,,NN,,,,true,1,,,,RTE,DE TROARN,14940,TOUFFREVILLE,,,14698,,,,,,,,,,,,,,,,,,,1992-03-17,F,,,,,28.3C,NAF1993,N,-0.20789,49.198554,0.81,street,Route de Troarn 14940 Touffréville,14698_0300,G,ROUTE DE TROARN,
379979941,00018,37997994100018,O,1987-02-07,NN,,,2023-05-05T20:46:37,true,4,,,,,LA BRUYERE,14940,TOUFFREVILLE,,,14698,,,,,,,,,,,,,,,,,,,2018-12-25,F,,,,,01.24Z,NAFRev2,N,-0.215905,49.210531,0.84,locality,La Grande Bruyère 14940 Touffréville,14698_B021,G,LA GRANDE BRUYERE,
380864439,00035,38086443900035,O,2000-03-01,NN,,,2013-10-09T19:32:37,true,4,LES GRANDES BRUYERES,,,CHE,DU BAS FONDS,14940,TOUFFREVILLE,,,14698,,,,,,,,,,,,,,,,,,,2002-04-01,F,,,,,74.1J,NAF1993,N,-0.208041,49.197669,0.72,street,Chemin du Bas Fond 14940 Touffréville,14698_0010,G,CHEMIN DU BAS FOND,
381024595,00039,38102459500039,O,1993-09-01,NN,,,2006-11-25T11:32:47,false,3,,,,,,14940,TOUFFREVILLE,,,14698,,,,,,,,,,,,,,,,,,,2005-02-07,F,,,,,45.2P,NAFRev1,N,,,0,,,,,,
381227586,00017,38122758600017,O,,NN,,,,true,1,,,,RUE,DES JARDINS,14940,TOUFFREVILLE,,,14698,,,,,,,,,,,,,,,,,,,1992-12-31,F,,,,,55.3A,NAF1993,N,-0.224685,49.191722,0.94,street,Rue des Jardins 14940 Touffréville,14698_0260,G,RUE DES JARDINS,
381325596,00017,38132559600017,O,,NN,,,,true,1,,,,CHE,SAULNIER,14940,TOUFFREVILLE,,,14698,,,,,,,,,,,,,,,,,,,1997-09-30,F,,,,,26.6A,NAF1993,O,-0.225764,49.191742,0.31,street,Chemin des Lauriers 14940 Touffréville,14698_md6mwk,G,CHEMIN DES LAURIERS,
382149052,00013,38214905200013,O,1991-01-01,NN,,,,true,4,,,,,LA BRUYERE,14940,TOUFFREVILLE,,,14698,,,,,,,,,,,,,,,,,,,1998-12-31,F,,,,,01.1D,NAF1993,N,-0.215905,49.210531,0.84,locality,La Grande Bruyère 14940 Touffréville,14698_B021,G,LA GRANDE BRUYERE,
382383230,00010,38238323000010,O,,NN,,,2006-11-25T11:37:34,true,1,,,,,LA GRANDE BRUYERE,14940,TOUFFREVILLE,,,14698,,,,,,,,,,,,,,,,,,,1995-04-04,F,,,,,55.1A,NAF1993,N,-0.215905,49.210531,0.93,locality,La Grande Bruyère 14940 Touffréville,14698_B021,G,LA GRANDE BRUYERE,
382608255,00016,38260825500016,O,1991-07-11,NN,,,2008-11-08T00:41:45,true,3,,,,CHE,DE LA COUR CAILLOUX,14940,TOUFFREVILLE,,,14698,,,,,,,,,,,,,,,,,,,2004-12-31,F,,,,,74.7Z,NAFRev1,N,-0.22408,49.189774,0.86,street,Chemin de la Cour Cailloux 14940 Touffréville,14698_8q96wa,G,CHEMIN DE LA COUR CAILLOUX,
383553773,00011,38355377300011,O,,,,,,true,1,,,,RUE,DU CLOS HEBERT,14940,TOUFFREVILLE,,,14698,,,,,,,,,,,,,,,,,,,1993-08-19,F,,,,,28.5D,NAF1993,N,-0.22421,49.190649,0.44,street,Rue du Centre 14940 Touffréville,14698_0080,G,RUE DU CENTRE,
384451183,00014,38445118300014,O,1992-02-01,NN,,,2009-01-27T08:50:04,true,3,,,,,,14940,TOUFFREVILLE,,,14698,,,,,,,,,,,,,,,,,,,2007-12-31,F,,,,,01.1A,NAFRev1,N,,,0,,,,,,
384675930,00026,38467593000026,O,2009-01-01,,,4334ZC,2016-04-08T03:36:25,false,2,,,,HAM,LE PRE BARON,14940,TOUFFREVILLE,,,14698,,,,,,,,,,,,,,,,,,,2016-03-21,F,,,,,43.34Z,NAFRev2,N,-0.230899,49.20504,0.93,locality,Le Pré Baron 14940 Touffréville,14698_B037,G,LE PRE BARON,
384947040,00026,38494704000026,O,1900-01-01,NN,,,2011-04-28T00:51:17,false,4,,,,RUE,DE L'EGLISE,14940,TOUFFREVILLE,,,14698,,,,,,,,,,,,,,,,,,,1997-03-13,F,,,,,45.4J,NAF1993,O,-0.22384,49.189172,0.94,street,Rue de l'Église 14940 Touffréville,14698_0160,G,RUE DE L EGLISE,
388194656,00046,38819465600046,O,2012-03-01,,,,2021-02-23T11:14:10,true,1,,,,,LA GRANDE BRUYERE,14940,TOUFFREVILLE,,,14698,,,,,,,,,,,,,,,,,,,2012-03-01,A,,,,L'ANNEXE AUX FROMAGES,47.81Z,NAFRev2,N,-0.215905,49.210531,0.93,locality,La Grande Bruyère 14940 Touffréville,14698_B021,G,LA GRANDE BRUYERE,
390632362,00013,39063236200013,O,1993-03-01,NN,,,2008-11-08T00:52:51,false,4,,,,RUE,DU CLOS HEBERT,14940,TOUFFREVILLE,,,14698,,,,,,,,,,,,,,,,,,,2005-01-15,F,,,,,28.3C,NAFRev1,O,-0.22421,49.190649,0.44,street,Rue du Centre 14940 Touffréville,14698_0080,G,RUE DU CENTRE,
393252317,00010,39325231700010,O,1993-07-22,01,2020,,2022-08-29T09:17:10,true,4,,,,LD,LE HARAS DU BOIS,14940,TOUFFREVILLE,,,14698,,,,,,,,,,,,,,,,,,,2010-12-31,A,,,,,01.43Z,NAFRev2,O,-0.208558,49.202488,0.49,locality,Manoir du Bois 14940 Touffréville,14698_34r3rh,G,MANOIR DU BOIS,
393263850,00017,39326385000017,O,1993-12-07,NN,,,2016-02-24T03:46:25,true,3,,,,,,14940,TOUFFREVILLE,,,14698,,,,,,,,,,,,,,,,,,,2008-01-01,A,,,,,68.20B,NAFRev2,N,,,0,,,,,,
394160121,00049,39416012100049,O,2004-01-01,NN,,,2008-04-26T12:43:15,false,3,,,,LD,LA FOSSE BONY,14940,TOUFFREVILLE,,,14698,,,,,,,,,,,,,,,,,,,2007-01-01,F,,,,,45.2T,NAFRev1,O,,,0,,,,,,
394221782,00037,39422178200037,P,2020-01-01,,,,2021-02-23T11:19:59,true,1,[ND],[ND],[ND],[ND],[ND],[ND],TOUFFREVILLE,,[ND],14698,[ND],[ND],,,[ND],[ND],[ND],[ND],[ND],[ND],,,[ND],,[ND],[ND],,,2020-01-01,A,[ND],[ND],[ND],[ND],01.11Z,NAFRev2,N,,,0,,,,,,
394466155,00030,39446615500030,O,2003-01-01,NN,,,2016-01-12T00:15:20,true,4,CHEZ M BASLIERE,,,,HARAS DU BOIS,14940,TOUFFREVILLE,,,14698,,,,,,,,,,,,,,,,,,,2008-01-01,A,,,,,85.51Z,NAFRev2,N,-0.208558,49.202488,0.53,locality,Manoir du Bois 14940 Touffréville,14698_34r3rh,G,MANOIR DU BOIS,
394597124,00020,39459712400020,O,1997-06-02,NN,,,2008-11-08T01:00:17,false,3,,11,,CHE,DU CLOS HEBERT,14940,TOUFFREVILLE,,,14698,,,,,,,,,,,,,,,,,,,2006-08-07,F,,,,,36.1G,NAFRev1,N,-0.207921,49.197489,0.37,housenumber,11 Chemin du Bas Fond 14940 Touffréville,14698_0010_00011,G,11 CHEMIN DU BAS FOND,
399152347,00015,39915234700015,O,1994-08-15,NN,,,2008-01-04T19:03:41,true,3,,,,,LE PRE BARON,14940,TOUFFREVILLE,,,14698,,,,,,,,,,,,,,,,,,,2008-01-01,A,,,,,68.20B,NAFRev2,N,-0.230899,49.20504,0.93,locality,Le Pré Baron 14940 Touffréville,14698_B037,G,LE PRE BARON,
400928073,00057,40092807300057,P,2018-07-01,,,,2022-11-14T09:52:08,false,4,[ND],[ND],[ND],[ND],[ND],[ND],TOUFFREVILLE,,[ND],14698,[ND],[ND],,,[ND],[ND],[ND],[ND],[ND],[ND],,,[ND],,[ND],[ND],,,2021-10-05,F,[ND],[ND],[ND],[ND],56.10C,NAFRev2,N,,,0,,,,,,
401542626,00049,40154262600049,O,2000-07-01,NN,,4332BB,2021-02-23T11:25:37,true,6,,12,B,RUE,DE L'EGLISE,14940,TOUFFREVILLE,,,14698,,,,,,,,,,,,,,,,,,,2016-02-24,A,,,,ABC DEPANNAGES - CAEN SERRURES,43.32B,NAFRev2,N,-0.223485,49.189748,0.85,housenumber,12bis Rue de l'Église 14940 Touffréville,14698_0160_00012_bis,G,12BIS RUE DE L EGLISE,
401597331,00032,40159733100032,O,1996-10-31,NN,,,2011-05-03T00:22:28,false,4,,,,RUE,DES JARDINS,14940,TOUFFREVILLE,,,14698,,,,,,,,,,,,,,,,,,,1999-02-10,F,,,,,55.3B,NAF1993,N,-0.224685,49.191722,0.94,street,Rue des Jardins 14940 Touffréville,14698_0260,G,RUE DES JARDINS,
402387336,00041,40238733600041,O,2012-01-05,,,4399CZ,2018-04-24T04:05:23,true,2,,4,,RUE,DES ROSIERS,14940,TOUFFREVILLE,,,14698,,,,,,,,,,,,,,,,,,,2018-04-30,F,,,,,43.99C,NAFRev2,N,-0.226249,49.190088,0.94,housenumber,4 Rue des Rosiers 14940 Touffréville,14698_0295_00004,G,4 RUE DES ROSIERS,
402725881,00013,40272588100013,O,1974-10-01,NN,,,2021-12-24T03:52:30,true,4,,,,,LE HAMET,14940,TOUFFREVILLE,,,14698,,,,,,,,,,,,,,,,,,,2021-12-31,F,,,,,01.11Z,NAFRev2,N,-0.228691,49.209438,0.93,locality,Le Hamet 14940 Touffréville,14698_0dlgec,G,LE HAMET,
402771901,00012,40277190100012,O,1995-10-16,NN,,,2008-01-04T20:09:52,true,3,,,,CHE,DU CLOS HEBERT,14940,TOUFFREVILLE,,,14698,,,,,,,,,,,,,,,,,,,2008-01-01,A,,,,,68.20B,NAFRev2,N,,,0,,,,,,
403783434,00018,40378343400018,O,1996-01-26,01,2020,,2022-08-29T09:24:19,true,4,,,,,,14940,TOUFFREVILLE,,,14698,,,,,,,,,,,,,,,,,,,2013-12-31,A,,,,,01.11Z,NAFRev2,O,,,0,,,,,,
404976417,00042,40497641700042,O,2021-04-01,,,,2022-02-11T04:30:08,true,2,,8,,RUE,DU 8EME PARA,14940,TOUFFREVILLE,,,14698,,,,,,,,,,,,,,,,,,,2022-02-01,F,,,,LEMONNIER ELISABETH,96.09Z,NAFRev2,N,-0.225327,49.188288,0.93,housenumber,8 Rue du 8ème Para BN 14940 Touffréville,14698_eoaatz_00008,G,8 RUE DU 8EME PARA BN,
408610632,00015,40861063200015,O,,NN,,,,true,1,,,,CHE,BAS FOND,14940,TOUFFREVILLE,,,14698,,,,,,,,,,,,,,,,,,,1997-06-30,F,,,,,51.1T,NAF1993,N,-0.208041,49.197669,0.79,street,Chemin du Bas Fond 14940 Touffréville,14698_0010,G,CHEMIN DU BAS FOND,
408856763,00011,40885676300011,O,,NN,,,,true,1,,,,RUE,DES JARDINS,14940,TOUFFREVILLE,,,14698,,,,,,,,,,,,,,,,,,,1996-10-31,F,,,,,55.3B,NAF1993,N,-0.224685,49.191722,0.94,street,Rue des Jardins 14940 Touffréville,14698_0260,G,RUE DES JARDINS,
409066750,00012,40906675000012,O,1996-10-01,NN,,,2014-07-08T01:40:45,true,4,,,,RUE,DU CENTRE,14940,TOUFFREVILLE,,,14698,,,,,,,,,,,,,,,,,,,2009-04-30,F,,,,,96.02A,NAFRev2,N,-0.22421,49.190649,0.94,street,Rue du Centre 14940 Touffréville,14698_0080,G,RUE DU CENTRE,
410175533,00026,41017553300026,O,1998-06-12,NN,,,2012-11-20T05:29:42,true,4,,,,CHE,DES BAS FONDS,14940,TOUFFREVILLE,,,14698,,,,,,,,,,,,,,,,,,,2012-10-19,F,,,,,68.20B,NAFRev2,N,-0.208041,49.197669,0.53,street,Chemin du Bas Fond 14940 Touffréville,14698_0010,G,CHEMIN DU BAS FOND,
410322242,00018,41032224200018,O,1997-01-02,,,,2006-10-28T03:47:18,true,3,,,,RTE,,14940,TOUFFREVILLE,,,14698,,,,,,,,,,,,,,,,,,,2004-01-28,F,,,,,60.2L,NAFRev1,N,-0.22407,49.191949,0.65,street,Route de la Butte Verte 14940 Touffréville,14698_0040,G,ROUTE DE LA BUTTE VERTE,
411479793,00027,41147979300027,O,1997-09-01,,,,,true,1,,,,RUE,DU CENTRE,14940,TOUFFREVILLE,,,14698,,,,,,,,,,,,,,,,,,,1999-09-30,F,,,,,52.6D,NAF1993,N,-0.22421,49.190649,0.94,street,Rue du Centre 14940 Touffréville,14698_0080,G,RUE DU CENTRE,
413366964,00018,41336696400018,O,1997-07-11,,,,,false,3,,,,RUE,CENTRE,14940,TOUFFREVILLE,,,14698,,,,,,,,,,,,,,,,,,,1999-03-08,F,,,,,70.2C,NAF1993,N,-0.22421,49.190649,0.85,street,Rue du Centre 14940 Touffréville,14698_0080,G,RUE DU CENTRE,
414656926,00014,41465692600014,O,1997-12-01,,,,2016-02-15T11:21:11,false,3,,8,,RUE,DU 8E PARA,14940,TOUFFREVILLE,,,14698,,,,,,,,,,,,,,,,,,,1998-07-15,F,,,,,60.2L,NAF1993,N,-0.225327,49.188288,0.88,housenumber,8 Rue du 8ème Para BN 14940 Touffréville,14698_eoaatz_00008,G,8 RUE DU 8EME PARA BN,
420114464,00035,42011446400035,O,2019-10-01,,,,2021-01-24T08:40:41,true,1,LE PRE VAUTIER,,,RTE,DE LA BUTTE,14940,TOUFFREVILLE,,,14698,,,,,,,,,,,,,,,,,,,2019-10-01,A,,,,,45.11Z,NAFRev2,N,-0.22407,49.191949,0.87,street,Route de la Butte Verte 14940 Touffréville,14698_0040,G,ROUTE DE LA BUTTE VERTE,