siren,nic,siret,statutDiffusionEtablissement,dateCreationEtablissement,trancheEffectifsEtablissement,anneeEffectifsEtablissement,activitePrincipaleRegistreMetiersEtablissement,dateDernierTraitementEtablissement,etablissementSiege,nombrePeriodesEtablissement,complementAdresseEtablissement,numeroVoieEtablissement,indiceRepetitionEtablissement,typeVoieEtablissement,libelleVoieEtablissement,codePostalEtablissement,libelleCommuneEtablissement,libelleCommuneEtrangerEtablissement,distributionSpecialeEtablissement,codeCommuneEtablissement,codeCedexEtablissement,libelleCedexEtablissement,codePaysEtrangerEtablissement,libellePaysEtrangerEtablissement,complementAdresse2Etablissement,numeroVoie2Etablissement,indiceRepetition2Etablissement,typeVoie2Etablissement,libelleVoie2Etablissement,codePostal2Etablissement,libelleCommune2Etablissement,libelleCommuneEtranger2Etablissement,distributionSpeciale2Etablissement,codeCommune2Etablissement,codeCedex2Etablissement,libelleCedex2Etablissement,codePaysEtranger2Etablissement,libellePaysEtranger2Etablissement,dateDebut,etatAdministratifEtablissement,enseigne1Etablissement,enseigne2Etablissement,enseigne3Etablissement,denominationUsuelleEtablissement,activitePrincipaleEtablissement,nomenclatureActivitePrincipaleEtablissement,caractereEmployeurEtablissement,longitude,latitude,geo_score,geo_type,geo_adresse,geo_id,geo_ligne,geo_l4,geo_l5
304385230,00012,30438523000012,O,,NN,,,,true,1,,,,,,14480,VILLIERS LE SEC,,,14757,,,,,,,,,,,,,,,,,,,,F,,,,,67.04,NAP,N,,,0,,,,,,
306065947,00013,30606594700013,O,,NN,,,,true,1,,,,,,14480,VILLIERS LE SEC,,,14757,,,,,,,,,,,,,,,,,,,1987-03-30,F,,,,,49.01,NAP,N,,,0,,,,,,
321725848,00014,32172584800014,O,,NN,,,,true,1,,,,RTE,DE COURSEULLES,14480,VILLIERS LE SEC,,,14757,,,,,,,,,,,,,,,,,,,,F,,,,,55.71,NAP,N,-0.561545,49.291169,0.53,street,Route de Courseulles 14480 Creully sur Seulles,14200_0142,G,ROUTE DE COURSEULLES,
324372804,00017,32437280400017,O,,NN,,,,true,1,,,,,,14480,VILLIERS LE SEC,,,14757,,,,,,,,,,,,,,,,,,,,F,,,,,55.73,NAP,N,,,0,,,,,,
345275325,00016,34527532500016,O,,NN,,,,true,1,,,,,,14480,VILLIERS LE SEC,,,14757,,,,,,,,,,,,,,,,,,,1994-06-30,F,,,,,92.6A,NAF1993,N,,,0,,,,,,
349795484,00014,34979548400014,O,,NN,,,,true,1,,,,RTE,DE COURSEULLES,14480,VILLIERS LE SEC,,,14757,,,,,,,,,,,,,,,,,,,1990-09-25,F,,,,,55.73,NAP,N,-0.561545,49.291169,0.53,street,Route de Courseulles 14480 Creully sur Seulles,14200_0142,G,ROUTE DE COURSEULLES,
349795807,00016,34979580700016,O,,,,,,true,1,,,,RTE,DE COURSEULLES,14480,VILLIERS LE SEC,,,14757,,,,,,,,,,,,,,,,,,,1990-09-25,F,,,,,45.4M,NAF1993,N,-0.561545,49.291169,0.53,street,Route de Courseulles 14480 Creully sur Seulles,14200_0142,G,ROUTE DE COURSEULLES,
383036738,00037,38303673800037,O,,NN,,,,true,1,,9,,RUE,BAYEUX,14480,VILLIERS LE SEC,,,14757,,,,,,,,,,,,,,,,,,,1994-08-13,F,,,,,85.1C,NAF1993,N,-0.56689,49.290581,0.95,housenumber,9 Rue de Bayeux (Villiers-le-Sec) 14480 Creully sur Seulles,14200_0140_00009,G,9 RUE DE BAYEUX,VILLIERS LE SEC
384019600,00012,38401960000012,O,1992-01-02,NN,,,,true,1,,35,,RUE,DE BAYEUX,14480,VILLIERS LE SEC,,,14757,,,,,,,,,,,,,,,,,,,1999-06-30,F,,,,,45.2V,NAF1993,N,-0.569995,49.290254,0.95,housenumber,35 Rue de Bayeux (Villiers-le-Sec) 14480 Creully sur Seulles,14200_0140_00035,G,35 RUE DE BAYEUX,VILLIERS LE SEC
388460289,00027,38846028900027,O,,NN,,,,true,1,,15,,RUE,DE COURSEULLES,14480,VILLIERS LE SEC,,,14757,,,,,,,,,,,,,,,,,,,1996-03-28,F,,,,,93.0D,NAF1993,N,-0.561924,49.291212,0.54,housenumber,15 Route de Courseulles 14480 Creully sur Seulles,14200_0142_00015,G,15 ROUTE DE COURSEULLES,
391493483,00013,39149348300013,O,1993-01-01,NN,,,,true,1,,,,,,14480,VILLIERS LE SEC,,,14757,,,,,,,,,,,,,,,,,,,1994-01-13,F,,,,,01.1A,NAF1993,N,,,0,,,,,,
419833090,00014,41983309000014,O,1998-07-02,,,,,true,1,,12,B,RUE,DE COURSEULLES,14480,VILLIERS LE SEC,,,14757,,,,,,,,,,,,,,,,,,,1999-10-31,F,,,,,85.1C,NAF1993,N,-0.562147,49.291167,0.51,housenumber,12bis Route de Courseulles 14480 Creully sur Seulles,14200_0142_00012_bis,G,12BIS ROUTE DE COURSEULLES,
506110691,00017,50611069100017,O,,,,,,true,1,,,,,,14480,VILLIERS LE SEC,,,14757,,,,,,,,,,,,,,,,,,,1984-12-25,F,,,,,62.43,NAP,N,,,0,,,,,,
