siren,nic,siret,statutDiffusionEtablissement,dateCreationEtablissement,trancheEffectifsEtablissement,anneeEffectifsEtablissement,activitePrincipaleRegistreMetiersEtablissement,dateDernierTraitementEtablissement,etablissementSiege,nombrePeriodesEtablissement,complementAdresseEtablissement,numeroVoieEtablissement,indiceRepetitionEtablissement,typeVoieEtablissement,libelleVoieEtablissement,codePostalEtablissement,libelleCommuneEtablissement,libelleCommuneEtrangerEtablissement,distributionSpecialeEtablissement,codeCommuneEtablissement,codeCedexEtablissement,libelleCedexEtablissement,codePaysEtrangerEtablissement,libellePaysEtrangerEtablissement,complementAdresse2Etablissement,numeroVoie2Etablissement,indiceRepetition2Etablissement,typeVoie2Etablissement,libelleVoie2Etablissement,codePostal2Etablissement,libelleCommune2Etablissement,libelleCommuneEtranger2Etablissement,distributionSpeciale2Etablissement,codeCommune2Etablissement,codeCedex2Etablissement,libelleCedex2Etablissement,codePaysEtranger2Etablissement,libellePaysEtranger2Etablissement,dateDebut,etatAdministratifEtablissement,enseigne1Etablissement,enseigne2Etablissement,enseigne3Etablissement,denominationUsuelleEtablissement,activitePrincipaleEtablissement,nomenclatureActivitePrincipaleEtablissement,caractereEmployeurEtablissement,longitude,latitude,geo_score,geo_type,geo_adresse,geo_id,geo_ligne,geo_l4,geo_l5
211917802,00012,21191780200012,O,1983-03-01,03,2020,,2022-08-29T09:06:12,true,4,,,,PL,DE LA MAIRIE,19270,SADROC,,,19178,,,,,,,,,,,,,,,,,,,2008-01-01,A,MAIRIE,,,,84.11Z,NAFRev2,O,1.549174,45.282983,0.83,street,Place De La Mairie 19270 Sadroc,19178_0060,G,PLACE DE LA MAIRIE,
211917802,00038,21191780200038,O,1983-12-21,02,2020,,2022-08-29T09:06:12,false,3,,,,,,19270,SADROC,,,19178,,,,,,,,,,,,,,,,,,,2008-01-01,A,ECOLE PRIMAIRE PUBLIQUE,,,,85.20Z,NAFRev2,N,,,0,,,,,,
211917802,00046,21191780200046,O,1997-01-01,NN,,,2014-11-18T17:31:48,false,4,MAIRIE,,,,,19270,SADROC,,,19178,,,,,,,,,,,,,,,,,,,2013-12-31,F,SERVICE ASSAINISSEMENT BUDGET ANNEXE,,,,37.00Z,NAFRev2,N,1.549174,45.282983,0.91,street,Place De La Mairie 19270 Sadroc,19178_0060,D,PLACE DE LA MAIRIE,
211917802,00053,21191780200053,O,1999-01-01,NN,,,2006-10-26T23:40:27,false,3,MAIRIE,,,,,19270,SADROC,,,19178,,,,,,,,,,,,,,,,,,,2004-12-25,F,LOTISSEMENT,,,,70.1C,NAFRev1,N,1.549174,45.282983,0.91,street,Place De La Mairie 19270 Sadroc,19178_0060,D,PLACE DE LA MAIRIE,
211917802,00061,21191780200061,O,2003-08-01,NN,,,2014-11-18T17:25:45,false,4,MAIRIE,,,PL,MAIRIE,19270,SADROC,,,19178,,,,,,,,,,,,,,,,,,,2013-12-31,F,SERVICE PUBLIC ASSAINIS NON COLLECTIF,,,,37.00Z,NAFRev2,N,1.549174,45.282983,0.74,street,Place De La Mairie 19270 Sadroc,19178_0060,G,PLACE DE LA MAIRIE,
261917801,00019,26191780100019,O,1983-08-10,NN,,,2022-10-10T14:57:36,true,5,HOTEL DE VILLE,,,,,19270,SADROC,,,19178,,,,,,,,,,,,,,,,,,,2022-09-09,F,CDE,,,,88.99B,NAFRev2,O,1.525806,45.27576,0.51,street,Chemin De Villeneuve 19270 Sadroc,19178_0326,D,CHEMIN DE VILLENEUVE,
261917819,00011,26191781900011,O,1983-08-10,NN,,,2016-07-23T12:04:21,true,4,HOTEL DE VILLE,,,,,19270,SADROC,,,19178,,,,,,,,,,,,,,,,,,,2016-01-01,F,CCAS,,,,88.99B,NAFRev2,N,1.525806,45.27576,0.51,street,Chemin De Villeneuve 19270 Sadroc,19178_0326,D,CHEMIN DE VILLENEUVE,
301481503,00037,30148150300037,P,1996-05-02,NN,,,,false,3,[ND],[ND],[ND],[ND],[ND],[ND],SADROC,,[ND],19178,[ND],[ND],,,[ND],[ND],[ND],[ND],[ND],[ND],,,[ND],,[ND],[ND],,,1997-06-23,F,[ND],[ND],[ND],[ND],52.6H,NAF1993,N,,,0,,,,,,
304521768,00057,30452176800057,O,2014-04-01,,,,2021-02-23T10:36:49,true,1,LA FONSALADE,,,,BOIS LACHAUX,19270,SADROC,,,19178,,,,,,,,,,,,,,,,,,,2014-04-01,A,,,,,43.34Z,NAFRev2,N,1.557226,45.269547,0.93,street,Chemin Du Bois Lachaux 19270 Sadroc,19178_0124,G,CHEMIN DU BOIS LACHAUX,
305071045,00010,30507104500010,O,,,,,,true,1,,,,,LA CROIX LONGE,19270,SADROC,,,19178,,,,,,,,,,,,,,,,,,,1984-12-25,F,,,,,59.07,NAP,N,1.547846,45.286698,0.57,street,Route De La Croix 19270 Sadroc,19178_0148,G,ROUTE DE LA CROIX,
306174301,00029,30617430100029,O,,NN,,,,true,1,,,,,LE BOURG,19270,SADROC,,,19178,,,,,,,,,,,,,,,,,,,1995-09-30,F,,,,,45.4C,NAF1993,O,1.563478,45.283904,0.32,street,Route De Bois Labrousse 19270 Sadroc,19178_0122,G,ROUTE DE BOIS LABROUSSE,
306989260,00014,30698926000014,O,1976-01-01,NN,,,2018-09-29T12:11:49,false,5,,,,,,19270,SADROC,,,19178,,,,,,,,,,,,,,,,,,,2016-12-31,F,,,,,49.41B,NAFRev2,O,,,0,,,,,,
311455224,00015,31145522400015,O,,NN,,,,true,1,,,,,,19270,SADROC,,,19178,,,,,,,,,,,,,,,,,,,1993-12-04,F,,,,,67.2Z,NAF1993,N,,,0,,,,,,
311455281,00015,31145528100015,O,,,,,,true,1,,,,LD,LA CROIX DE MALAYRIE,19270,SADROC,,,19178,,,,,,,,,,,,,,,,,,,1984-12-25,F,,,,,00.10,NAP,N,1.560516,45.301216,0.59,street,Impasse De La Croix De Mons 19270 Sadroc,19178_0152,G,IMPASSE DE LA CROIX DE MONS,
311455364,00019,31145536400019,O,,,,,,true,1,,,,LD,LA CROIX DE MALAYRIE,19270,SADROC,,,19178,,,,,,,,,,,,,,,,,,,1984-12-25,F,,,,,00.10,NAP,N,1.560516,45.301216,0.59,street,Impasse De La Croix De Mons 19270 Sadroc,19178_0152,G,IMPASSE DE LA CROIX DE MONS,
311464440,00032,31146444000032,O,2012-01-01,,,,2021-02-23T10:39:10,true,1,,,,,LA VIDALIE,19270,SADROC,,,19178,,,,,,,,,,,,,,,,,,,2012-01-01,A,,,,,01.11Z,NAFRev2,N,1.572114,45.271368,0.92,street,Chemin De La Vidalie 19270 Sadroc,19178_0324,G,CHEMIN DE LA VIDALIE,
313462913,00010,31346291300010,O,1978-01-01,NN,,,2008-01-04T20:22:09,true,3,,,,,LA CROIX DE MONS,19270,SADROC,,,19178,,,,,,,,,,,,,,,,,,,2008-01-01,A,,,,,86.90D,NAFRev2,N,1.560516,45.301216,0.92,street,Impasse De La Croix De Mons 19270 Sadroc,19178_0152,G,IMPASSE DE LA CROIX DE MONS,
314874108,00017,31487410800017,O,,NN,,,,true,1,,,,LD,AU PEUCH,19270,SADROC,,,19178,,,,,,,,,,,,,,,,,,,1987-02-28,F,,,,,55.40,NAP,N,1.561954,45.261526,0.73,street,Route Du Peuch 19270 Sadroc,19178_0254,G,ROUTE DU PEUCH,
315876987,00019,31587698700019,O,1979-01-01,NN,,,2008-11-07T00:31:24,false,3,RN20,,,LD,LE GAULIAT,19270,SADROC,,,19178,,,,,,,,,,,,,,,,,,,1997-10-01,F,,,,,50.1Z,NAF1993,,,,0,,,,,,
317030385,00015,31703038500015,O,1979-01-01,NN,,,2023-06-06T03:39:17,true,3,,,,,LA MARTINERIE,19270,SADROC,,,19178,,,,,,,,,,,,,,,,,,,2008-01-01,A,,,,,01.41Z,NAFRev2,N,1.543651,45.276825,0.92,street,Route De La Martinerie 19270 Sadroc,19178_0234,G,ROUTE DE LA MARTINERIE,
317758431,00041,31775843100041,O,2013-02-01,,,,2017-09-10T03:25:18,true,2,,,,,LE BREUIL,19270,SADROC,,,19178,,,,,,,,,,,,,,,,,,,2017-08-31,F,,,,,43.34Z,NAFRev2,N,1.563458,45.265422,0.66,street,Route Du Breuil 19270 Sadroc,19178_0138,G,ROUTE DU BREUIL,
318749140,00014,31874914000014,O,,NN,,,,true,1,,,,,LA CROIX DE MONS,19270,SADROC,,,19178,,,,,,,,,,,,,,,,,,,,F,,,,,62.46,NAP,N,1.560516,45.301216,0.92,street,Impasse De La Croix De Mons 19270 Sadroc,19178_0152,G,IMPASSE DE LA CROIX DE MONS,
319734018,00017,31973401800017,O,1978-01-01,NN,,,2009-01-09T08:48:11,false,4,,,,LD,LA BESSE,19270,SADROC,,,19178,,,,,,,,,,,,,,,,,,,2008-10-01,F,,,,,55.20Z,NAFRev2,N,1.523377,45.272951,0.92,street,Route De La Besse 19270 Sadroc,19178_0118,G,ROUTE DE LA BESSE,
319734018,00025,31973401800025,O,1998-12-31,NN,,,2009-01-09T08:48:11,true,4,,,,,LA BESSE,19270,SADROC,,,19178,,,,,,,,,,,,,,,,,,,2008-10-01,F,,,,,01.11Z,NAFRev2,N,1.523377,45.272951,0.92,street,Route De La Besse 19270 Sadroc,19178_0118,G,ROUTE DE LA BESSE,
322369505,00019,32236950500019,O,,NN,,,,true,1,,,,,,19270,SADROC,,,19178,,,,,,,,,,,,,,,,,,,1994-12-31,F,,,,,55.4B,NAF1993,N,,,0,,,,,,
324447820,00014,32444782000014,O,,NN,,,,true,1,,,,,CHANTEGRIL,19270,SADROC,,,19178,,,,,,,,,,,,,,,,,,,,F,,,,,62.46,NAP,N,1.550128,45.269092,0.93,street,Route De Chantegril 19270 Sadroc,19178_0142,G,ROUTE DE CHANTEGRIL,
325896983,00013,32589698300013,O,,NN,,,,true,1,,,,,,19270,SADROC,,,19178,,,,,,,,,,,,,,,,,,,1987-12-31,F,,,,,78.02,NAP,N,,,0,,,,,,
326900123,00042,32690012300042,O,2009-02-02,,,,2013-01-08T11:13:43,false,2,,8,,RTE,DES ARDOISIERS,19270,SADROC,,,19178,,,,,,,,,,,,,,,,,,,2011-09-14,F,,,,,96.02B,NAFRev2,N,1.547224,45.282228,0.86,housenumber,8 Route Des Ardoisiers 19270 Sadroc,19178_0005_00008,G,8 ROUTE DES ARDOISIERS,
326922432,00017,32692243200017,O,1983-04-01,NN,,,2008-11-07T00:44:22,true,3,,,,,LA CROIX DE LA MALEYRIE,19270,SADROC,,,19178,,,,,,,,,,,,,,,,,,,2003-06-30,F,,,,,,,N,1.553472,45.258078,0.66,street,Route De La Maleyrie 19270 Sadroc,19178_0230,G,ROUTE DE LA MALEYRIE,
326997723,00019,32699772300019,O,1983-04-03,NN,,5610CQ,2019-01-05T04:11:47,true,2,,,,LD,CHANTEGRIL,19270,SADROC,,,19178,,,,,,,,,,,,,,,,,,,1993-08-31,F,,,,,,,,1.550128,45.269092,0.93,street,Route De Chantegril 19270 Sadroc,19178_0142,G,ROUTE DE CHANTEGRIL,
327735031,00020,32773503100020,O,1900-01-01,NN,,,2014-03-25T13:52:04,true,4,,,,,LE BOIS LABROUSSE,19270,SADROC,,,19178,,,,,,,,,,,,,,,,,,,2014-03-15,A,,,,,90.03A,NAFRev2,N,1.563478,45.283904,0.84,street,Route De Bois Labrousse 19270 Sadroc,19178_0122,G,ROUTE DE BOIS LABROUSSE,
328324512,00016,32832451200016,O,1983-04-05,,,,,false,3,,,,LD,LAFONSALADE,19270,SADROC,,,19178,,,,,,,,,,,,,,,,,,,1997-08-01,F,,,,,85.1G,NAF1993,N,,,0,,,,,,
328335112,00012,32833511200012,O,1983-09-01,NN,,,2016-01-12T00:11:45,true,4,,,,LD,LES GARENNES,19270,SADROC,,,19178,,,,,,,,,,,,,,,,,,,2008-01-01,A,,,,,68.20B,NAFRev2,N,1.564459,45.293798,0.78,street,Chemin Des Garennes 19270 Sadroc,19178_0190,G,CHEMIN DES GARENNES,
328877865,00019,32887786500019,O,1984-01-01,NN,,,2008-01-04T19:43:27,true,3,,,,,LES PLATS,19270,SADROC,,,19178,,,,,,,,,,,,,,,,,,,2008-01-01,A,,,,,68.20B,NAFRev2,N,1.540988,45.280566,0.74,street,Chemin Des Plats 19270 Sadroc,19178_0256,G,CHEMIN DES PLATS,
329190755,00010,32919075500010,O,,,,,,true,1,,,,,,19270,SADROC,,,19178,,,,,,,,,,,,,,,,,,,1997-06-30,F,,,,,01.2A,NAF1993,N,,,0,,,,,,
332304286,00013,33230428600013,O,,,,,,true,1,,,,RTE,DU PEUCH,19270,SADROC,,,19178,,,,,,,,,,,,,,,,,,,1987-12-31,F,,,,,64.11,NAP,N,1.561954,45.261526,0.81,street,Route Du Peuch 19270 Sadroc,19178_0254,G,ROUTE DU PEUCH,
332424530,00027,33242453000027,O,1999-03-01,NN,,,2008-04-25T00:17:30,false,3,,,,,LE BREUIL,19270,SADROC,,,19178,,,,,,,,,,,,,,,,,,,2003-01-24,F,,,,,74.1J,NAFRev1,N,1.563458,45.265422,0.66,street,Route Du Breuil 19270 Sadroc,19178_0138,G,ROUTE DU BREUIL,
333051662,00018,33305166200018,O,,NN,,,,true,1,,,,LD,BERGEAL,19270,SADROC,,,19178,,,,,,,,,,,,,,,,,,,1990-06-29,F,,,,,69.12,NAP,N,1.547214,45.267536,0.92,street,Route De Bergeal 19270 Sadroc,19178_0110,G,ROUTE DE BERGEAL,
333471084,00017,33347108400017,O,1985-04-02,NN,,,2016-08-30T03:55:08,true,4,,,,LD,A PEPY,19270,SADROC,,,19178,,,,,,,,,,,,,,,,,,,2013-12-31,F,,,,,68.20B,NAFRev2,N,1.539345,45.272031,0.65,street,Chemin De Pepy 19270 Sadroc,19178_0252,G,CHEMIN DE PEPY,
333619856,00029,33361985600029,O,2013-07-01,,,4334ZC,2015-09-22T09:23:34,false,2,,7,,RTE,DES ARDOISIERS,19270,SADROC,,,19178,,,,,,,,,,,,,,,,,,,2015-09-01,F,DECOR'HOME,,,,43.34Z,NAFRev2,N,1.548147,45.281989,0.86,housenumber,7 Route Des Ardoisiers 19270 Sadroc,19178_0005_00007,G,7 ROUTE DES ARDOISIERS,
334520947,00014,33452094700014,O,1986-01-01,NN,,,,false,4,,,,LD,LE LAC,19270,SADROC,,,19178,,,,,,,,,,,,,,,,,,,2000-01-01,F,,,,,01.2A,NAF1993,N,1.531442,45.279348,0.52,street,Route Du Lac 19270 Sadroc,19178_0216,G,ROUTE DU LAC,
335311908,00016,33531190800016,O,1973-01-01,NN,,,2018-09-20T15:20:25,true,4,,,,LD,LAFOUSOLADE,19270,SADROC,,,19178,,,,,,,,,,,,,,,,,,,2015-12-31,A,,,,,01.19Z,NAFRev2,N,,,0,,,,,,
337596506,00010,33759650600010,O,1986-03-01,NN,,,2008-01-04T21:11:43,true,3,,,,,LAGUILLAUMIE,19270,SADROC,,,19178,,,,,,,,,,,,,,,,,,,2008-01-01,A,,,,,68.20B,NAFRev2,N,1.539781,45.282974,0.79,street,Route De La Guillaumie 19270 Sadroc,19178_wf905h,G,ROUTE DE LA GUILLAUMIE,
338911399,00016,33891139900016,O,1986-01-01,NN,,,,true,4,,,,LD,LAFONSALADE,19270,SADROC,,,19178,,,,,,,,,,,,,,,,,,,2002-10-31,F,,,,,67.2Z,NAF1993,N,,,0,,,,,,
340101005,00015,34010100500015,O,1987-01-23,NN,,,2021-02-23T10:56:12,true,3,,,,LD,LA BESSE,19270,SADROC,,,19178,,,,,,,,,,,,,,,,,,,2008-01-01,A,,,,,01.42Z,NAFRev2,N,1.523377,45.272951,0.92,street,Route De La Besse 19270 Sadroc,19178_0118,G,ROUTE DE LA BESSE,
340155605,00017,34015560500017,P,1987-03-19,NN,,,2020-09-17T09:53:32,false,3,[ND],[ND],[ND],[ND],[ND],[ND],SADROC,,[ND],19178,[ND],[ND],,,[ND],[ND],[ND],[ND],[ND],[ND],,,[ND],,[ND],[ND],,,2002-03-31,F,[ND],[ND],[ND],[ND],70.2C,NAF1993,N,,,0,,,,,,
340272640,00012,34027264000012,O,1987-01-01,NN,,,2019-03-29T10:12:27,true,4,,,,,LAFONSALAGE,19270,SADROC,,,19178,,,,,,,,,,,,,,,,,,,2019-03-01,A,,,,,68.20B,NAFRev2,N,,,0,,,,,,
342062262,00023,34206226200023,O,2008-09-01,,,,2014-07-08T00:46:42,true,2,,,,,LE BOIS DU MAS,19270,SADROC,,,19178,,,,,,,,,,,,,,,,,,,2009-08-31,F,CHRISTINE COUTURE,,,,14.13Z,NAFRev2,N,1.557884,45.277901,0.76,street,Route Du Bois Du Mas 19270 Sadroc,19178_0128,G,ROUTE DU BOIS DU MAS,
343438669,00016,34343866900016,O,1988-01-01,NN,,,2021-02-23T10:58:41,true,5,,,,,LA BORIE,19270,SADROC,,,19178,,,,,,,,,,,,,,,,,,,2016-10-20,A,,,,,68.20B,NAFRev2,N,1.548546,45.289628,0.92,street,Route De La Borie 19270 Sadroc,19178_0132,G,ROUTE DE LA BORIE,
343716122,00019,34371612200019,O,1988-01-01,NN,,,2019-11-22T03:49:55,true,4,,,,,AU POUGE,19270,SADROC,,,19178,,,,,,,,,,,,,,,,,,,2019-12-31,F,,,,,01.41Z,NAFRev2,N,1.559389,45.265695,0.52,street,Route Des Pouges 19270 Sadroc,19178_0268,G,ROUTE DES POUGES,
344604343,00014,34460434300014,O,,NN,,,,true,1,,,,,TILLOT,19270,SADROC,,,19178,,,,,,,,,,,,,,,,,,,1996-12-31,F,,,,,51.1C,NAF1993,N,1.561083,45.266187,0.92,street,Chemin De Tillot 19270 Sadroc,19178_0302,G,CHEMIN DE TILLOT,
348071689,00031,34807168900031,O,2004-04-13,NN,,,2006-11-25T10:56:45,false,3,,,,,BERGEAL,19270,SADROC,,,19178,,,,,,,,,,,,,,,,,,,2006-02-01,F,,,,,70.2C,NAFRev1,N,1.547214,45.267536,0.92,street,Route De Bergeal 19270 Sadroc,19178_0110,G,ROUTE DE BERGEAL,
348214842,00018,34821484200018,O,1988-10-15,NN,,,,true,4,,,,LD,LA CROIX DE LA MALEYRIE,19270,SADROC,,,19178,,,,,,,,,,,,,,,,,,,1991-12-25,F,,,,,02.20,NAP,N,1.553472,45.258078,0.66,street,Route De La Maleyrie 19270 Sadroc,19178_0230,G,ROUTE DE LA MALEYRIE,
350269940,00028,35026994000028,O,2016-07-27,,,,2021-02-23T11:03:02,true,1,,,,LD,LA BORIE,19270,SADROC,,,19178,,,,,,,,,,,,,,,,,,,2016-07-27,A,,,,,74.10Z,NAFRev2,N,1.548546,45.289628,0.92,street,Route De La Borie 19270 Sadroc,19178_0132,G,ROUTE DE LA BORIE,
350817631,00038,35081763100038,O,2007-06-14,,,,2009-05-19T05:47:20,true,2,,3,,LOT,LES FAURES,19270,SADROC,,,19178,,,,,,,,,,,,,,,,,,,2009-02-20,F,,,,,80.10Z,NAFRev2,N,1.552928,45.28248,0.88,housenumber,3 Lotissement Les Faures 19270 Sadroc,19178_a005_00003,G,3 LOTISSEMENT LES FAURES,
351462585,00016,35146258500016,O,1989-07-02,NN,,,,true,3,,,,,LE BOURG,19270,SADROC,,,19178,,,,,,,,,,,,,,,,,,,1995-12-25,F,,,,,51.4N,NAF1993,N,1.563478,45.283904,0.32,street,Route De Bois Labrousse 19270 Sadroc,19178_0122,G,ROUTE DE BOIS LABROUSSE,
351834817,00014,35183481700014,O,1900-01-01,NN,,,2011-04-28T00:41:57,false,3,,,,,LE BOURG,19270,SADROC,,,19178,,,,,,,,,,,,,,,,,,,1990-07-18,F,,,,,,,N,1.563478,45.283904,0.32,street,Route De Bois Labrousse 19270 Sadroc,19178_0122,G,ROUTE DE BOIS LABROUSSE,
353510316,00014,35351031600014,O,1990-01-01,01,2020,,2022-08-29T09:03:58,true,3,,,,LD,LA RUE,19270,SADROC,,,19178,,,,,,,,,,,,,,,,,,,2008-01-01,A,,,,,01.42Z,NAFRev2,N,1.538228,45.266242,0.92,street,Route De La Rue 19270 Sadroc,19178_0284,G,ROUTE DE LA RUE,
353510829,00016,35351082900016,O,1990-01-01,NN,,,2023-07-03T20:35:31,true,5,LA BORIE,,,LD,LA BORIE,19270,SADROC,,,19178,,,,,,,,,,,,,,,,,,,2020-12-25,F,,,,,01.42Z,NAFRev2,N,1.548546,45.289628,0.92,street,Route De La Borie 19270 Sadroc,19178_0132,G,ROUTE DE LA BORIE,
353834245,00014,35383424500014,O,1990-04-01,NN,,,2019-06-24T13:07:26,true,6,,,,LD,BARIAL,19270,SADROC,,,19178,,,,,,,,,,,,,,,,,,,2018-06-28,F,,,,,68.20B,NAFRev2,N,4.9346237,44.9162623,0.74,poi.car_repair,Barrial Pneus (Garage de réparation automobile) Valence,https://osm.org/way/97488691,G,,
377714324,00011,37771432400011,O,1990-04-05,NN,,,2008-01-05T19:46:55,true,3,,,,LD,LE BOURG,19270,SADROC,,,19178,,,,,,,,,,,,,,,,,,,2008-01-01,A,,,,,68.20B,NAFRev2,N,1.563478,45.283904,0.32,street,Route De Bois Labrousse 19270 Sadroc,19178_0122,G,ROUTE DE BOIS LABROUSSE,
378378954,00028,37837895400028,O,2019-12-01,,,,2021-02-23T11:07:06,true,1,,,,,LA GANE,19270,SADROC,,,19178,,,,,,,,,,,,,,,,,,,2019-12-01,A,,,,,68.20B,NAFRev2,N,1.54977,45.282206,0.92,street,Route De La Gane 19270 Sadroc,19178_0050,G,ROUTE DE LA GANE,
378416184,00018,37841618400018,O,1990-05-01,NN,,,2008-01-04T21:16:25,true,3,,,,,LA VIDALIE,19270,SADROC,,,19178,,,,,,,,,,,,,,,,,,,2008-01-01,A,,,,,68.20B,NAFRev2,N,1.572114,45.271368,0.92,street,Chemin De La Vidalie 19270 Sadroc,19178_0324,G,CHEMIN DE LA VIDALIE,
378493209,00035,37849320900035,O,1991-06-01,NN,,,,false,3,,,,,LA CROIX DE MONS,19270,SADROC,,,19178,,,,,,,,,,,,,,,,,,,1992-05-04,F,,,,,85.1G,NAF1993,N,1.560516,45.301216,0.92,street,Impasse De La Croix De Mons 19270 Sadroc,19178_0152,G,IMPASSE DE LA CROIX DE MONS,
379722770,00029,37972277000029,O,2004-04-13,NN,,,2006-11-25T11:27:39,false,3,,,,,BERGEAL,19270,SADROC,,,19178,,,,,,,,,,,,,,,,,,,2006-02-01,F,,,,,70.3C,NAFRev1,N,1.547214,45.267536,0.92,street,Route De Bergeal 19270 Sadroc,19178_0110,G,ROUTE DE BERGEAL,
380221747,00013,38022174700013,O,1990-10-01,NN,,,2008-01-04T21:39:47,true,3,,,,,PEPY,19270,SADROC,,,19178,,,,,,,,,,,,,,,,,,,2008-01-01,A,,,,,01.42Z,NAFRev2,N,1.539345,45.272031,0.91,street,Chemin De Pepy 19270 Sadroc,19178_0252,G,CHEMIN DE PEPY,
380471706,00016,38047170600016,O,1990-12-30,NN,,,2022-02-01T03:58:44,true,4,,,,,GARDE,19270,SADROC,,,19178,,,,,,,,,,,,,,,,,,,2019-12-31,F,,,,,01.24Z,NAFRev2,N,1.568759,45.275363,0.92,street,Chemin De Garde 19270 Sadroc,19178_0192,G,CHEMIN DE GARDE,
380623017,00015,38062301700015,O,,NN,,,,true,1,,,,LD,LE GAULIAT,19270,SADROC,,,19178,,,,,,,,,,,,,,,,,,,1997-07-06,F,,,,,85.1J,NAF1993,O,,,0,,,,,,
380802579,00017,38080257900017,O,1991-01-01,,,,2008-01-04T21:47:48,true,4,,,,LD,GARDE,19270,SADROC,,,19178,,,,,,,,,,,,,,,,,,,2008-01-01,A,,,,,68.20B,NAFRev2,N,1.568759,45.275363,0.92,street,Chemin De Garde 19270 Sadroc,19178_0192,G,CHEMIN DE GARDE,
381186303,00016,38118630300016,O,1991-01-01,NN,,,2008-11-08T00:38:52,true,4,,,,LD,LA FONSALADE,19270,SADROC,,,19178,,,,,,,,,,,,,,,,,,,2002-01-31,F,,,,,55.1A,NAF1993,O,1.564993,45.266353,0.79,street,Chemin De La Fontsalade 19270 Sadroc,19178_5uqyn5,G,CHEMIN DE LA FONTSALADE,
383168937,00043,38316893700043,O,2017-09-19,,,,2022-04-20T07:48:18,false,2,,,,,BOIS LACHAUD,19270,SADROC,,,19178,,,,,,,,,,,,,,,,,,,2022-02-28,F,,,,,47.89Z,NAFRev2,N,1.557226,45.269547,0.79,street,Chemin Du Bois Lachaux 19270 Sadroc,19178_0124,G,CHEMIN DU BOIS LACHAUX,
383507027,00019,38350702700019,O,1991-09-30,NN,,,2008-01-04T22:25:32,true,3,,,,,,19270,SADROC,,,19178,,,,,,,,,,,,,,,,,,,2008-01-01,A,,,,,01.50Z,NAFRev2,N,,,0,,,,,,
383804481,00026,38380448100026,O,1997-07-07,,,8690AZ,2022-03-16T04:04:06,false,4,,,,LD,LE GAULIAT,19270,SADROC,,,19178,,,,,,,,,,,,,,,,,,,2015-12-31,F,,,,,86.90A,NAFRev2,N,,,0,,,,,,
383864907,00027,38386490700027,O,1994-01-23,NN,,,2008-01-05T19:55:35,true,3,,,,,LE PEUCH,19270,SADROC,,,19178,,,,,,,,,,,,,,,,,,,2008-01-01,A,,,,,68.20B,NAFRev2,N,1.561954,45.261526,0.63,street,Route Du Peuch 19270 Sadroc,19178_0254,G,ROUTE DU PEUCH,
384061412,00035,38406141200035,O,2000-11-17,NN,,,2021-07-08T08:54:43,true,6,,8,,RTE,DES ARDOISIERS,19270,SADROC,,,19178,,,,,,,,,,,,,,,,,,,2020-12-31,F,,,,,82.99Z,NAFRev2,N,1.547224,45.282228,0.86,housenumber,8 Route Des Ardoisiers 19270 Sadroc,19178_0005_00008,G,8 ROUTE DES ARDOISIERS,
384165528,00017,38416552800017,O,1992-01-01,NN,,,,true,1,,,,,LA RUE,19270,SADROC,,,19178,,,,,,,,,,,,,,,,,,,2001-06-30,F,,,,,01.3Z,NAF1993,N,1.538228,45.266242,0.92,street,Route De La Rue 19270 Sadroc,19178_0284,G,ROUTE DE LA RUE,
384299889,00020,38429988900020,P,1998-03-02,NN,,,2010-11-23T15:40:30,false,4,[ND],[ND],[ND],[ND],[ND],[ND],SADROC,,[ND],19178,[ND],[ND],,,[ND],[ND],[ND],[ND],[ND],[ND],,,[ND],,[ND],[ND],,,2005-08-31,F,[ND],[ND],[ND],[ND],52.1B,NAFRev1,O,,,0,,,,,,
384299889,00038,38429988900038,P,2010-06-22,,,,2021-05-10T12:00:10,false,4,[ND],[ND],[ND],[ND],[ND],[ND],SADROC,,[ND],19178,[ND],[ND],,,[ND],[ND],[ND],[ND],[ND],[ND],,,[ND],,[ND],[ND],,,2020-12-31,F,[ND],[ND],[ND],[ND],01.42Z,NAFRev2,N,,,0,,,,,,
384299889,00046,38429988900046,P,2018-01-11,,,,2021-02-23T11:12:28,false,1,[ND],[ND],[ND],[ND],[ND],[ND],SADROC,,[ND],19178,[ND],[ND],,,[ND],[ND],[ND],[ND],[ND],[ND],,,[ND],,[ND],[ND],,,2018-01-11,A,[ND],[ND],[ND],[ND],47.99A,NAFRev2,N,,,0,,,,,,
384299889,00053,38429988900053,P,2019-12-16,,,,2021-05-10T12:03:02,true,1,[ND],[ND],[ND],[ND],[ND],[ND],SADROC,,[ND],19178,[ND],[ND],,,[ND],[ND],[ND],[ND],[ND],[ND],,,[ND],,[ND],[ND],,,2019-12-16,A,[ND],[ND],[ND],[ND],56.21Z,NAFRev2,N,,,0,,,,,,
384567525,00017,38456752500017,O,1992-01-01,NN,,,2008-11-08T00:45:24,true,4,,,,,CROIX DE LA MALEYRIE,19270,SADROC,,,19178,,,,,,,,,,,,,,,,,,,2002-06-17,F,,,,,55.1A,NAF1993,O,1.553472,45.258078,0.69,street,Route De La Maleyrie 19270 Sadroc,19178_0230,G,ROUTE DE LA MALEYRIE,
384634184,00020,38463418400020,O,,NN,,,,true,1,,,,,LE BREUIL,19270,SADROC,,,19178,,,,,,,,,,,,,,,,,,,1997-03-31,F,,,,,51.3T,NAF1993,O,1.563458,45.265422,0.66,street,Route Du Breuil 19270 Sadroc,19178_0138,G,ROUTE DU BREUIL,
387882772,00016,38788277200016,O,1992-06-01,NN,,,2008-01-04T23:00:41,true,3,,,,LD,LA RUE,19270,SADROC,,,19178,,,,,,,,,,,,,,,,,,,2008-01-01,A,,,,,01.42Z,NAFRev2,N,1.538228,45.266242,0.92,street,Route De La Rue 19270 Sadroc,19178_0284,G,ROUTE DE LA RUE,
388554289,00016,38855428900016,O,1992-08-04,,,,2017-05-23T19:30:08,true,4,,,,,LE BREUIL,19270,SADROC,,,19178,,,,,,,,,,,,,,,,,,,2017-04-30,F,,,,,01.42Z,NAFRev2,N,1.563458,45.265422,0.66,street,Route Du Breuil 19270 Sadroc,19178_0138,G,ROUTE DU BREUIL,
388664401,00014,38866440100014,O,1992-09-01,NN,,,2019-11-19T04:01:42,true,4,CHEZ MR GARDE GILBERT,,,,GARDE,19270,SADROC,,,19178,,,,,,,,,,,,,,,,,,,2016-09-13,F,,,,,01.24Z,NAFRev2,N,1.568759,45.275363,0.92,street,Chemin De Garde 19270 Sadroc,19178_0192,G,CHEMIN DE GARDE,
389274770,00012,38927477000012,O,1981-11-01,,,,2007-04-11T04:04:36,true,3,,,,LD,LE LAC,19270,SADROC,,,19178,,,,,,,,,,,,,,,,,,,2006-12-31,F,,,,,01.2A,NAFRev1,N,1.531442,45.279348,0.52,street,Route Du Lac 19270 Sadroc,19178_0216,G,ROUTE DU LAC,
389456302,00014,38945630200014,O,1976-01-01,,,,,true,1,,,,LD,VILLENEUVE,19270,SADROC,,,19178,,,,,,,,,,,,,,,,,,,2000-12-31,F,,,,,01.1A,NAF1993,N,1.525806,45.27576,0.92,street,Chemin De Villeneuve 19270 Sadroc,19178_0326,G,CHEMIN DE VILLENEUVE,
389456344,00016,38945634400016,O,1980-01-01,,,,,true,1,,,,LD,LACHAUD,19270,SADROC,,,19178,,,,,,,,,,,,,,,,,,,2000-12-31,F,,,,,01.2A,NAF1993,N,1.55943,45.271864,0.69,street,Impasse De Lachaux 19270 Sadroc,19178_0220,G,IMPASSE DE LACHAUX,
389896671,00036,38989667100036,O,2018-06-28,,,,2018-07-11T19:34:37,false,1,,,,,LES GARENNES DU BREUIL,19270,SADROC,,,19178,,,,,,,,,,,,,,,,,,,2018-06-28,A,,,,,35.11Z,NAFRev2,N,1.563458,45.265422,0.47,street,Route Du Breuil 19270 Sadroc,19178_0138,G,ROUTE DU BREUIL,
391369519,00015,39136951900015,O,1992-01-01,NN,,,2012-02-22T09:11:36,true,4,,,,,LA VIDALIE,19270,SADROC,,,19178,,,,,,,,,,,,,,,,,,,2011-12-31,F,,,,,01.42Z,NAFRev2,N,1.572114,45.271368,0.92,street,Chemin De La Vidalie 19270 Sadroc,19178_0324,G,CHEMIN DE LA VIDALIE,
392024063,00019,39202406300019,O,1993-07-19,NN,,,2020-03-13T03:58:58,true,3,,,,LD,LOUVADOUR,19270,SADROC,,,19178,,,,,,,,,,,,,,,,,,,2008-01-01,A,,,,,68.20B,NAFRev2,N,1.574603,45.274677,0.92,street,Route De Louvadour 19270 Sadroc,19178_0226,G,ROUTE DE LOUVADOUR,
392119897,00016,39211989700016,O,1993-06-15,NN,,,2006-11-25T12:10:28,true,5,,,,,LE PEUCH,19270,SADROC,,,19178,,,,,,,,,,,,,,,,,,,2003-07-08,F,,,,,74.1J,NAFRev1,N,1.561954,45.261526,0.63,street,Route Du Peuch 19270 Sadroc,19178_0254,G,ROUTE DU PEUCH,