siren,nic,siret,statutDiffusionEtablissement,dateCreationEtablissement,trancheEffectifsEtablissement,anneeEffectifsEtablissement,activitePrincipaleRegistreMetiersEtablissement,dateDernierTraitementEtablissement,etablissementSiege,nombrePeriodesEtablissement,complementAdresseEtablissement,numeroVoieEtablissement,indiceRepetitionEtablissement,typeVoieEtablissement,libelleVoieEtablissement,codePostalEtablissement,libelleCommuneEtablissement,libelleCommuneEtrangerEtablissement,distributionSpecialeEtablissement,codeCommuneEtablissement,codeCedexEtablissement,libelleCedexEtablissement,codePaysEtrangerEtablissement,libellePaysEtrangerEtablissement,complementAdresse2Etablissement,numeroVoie2Etablissement,indiceRepetition2Etablissement,typeVoie2Etablissement,libelleVoie2Etablissement,codePostal2Etablissement,libelleCommune2Etablissement,libelleCommuneEtranger2Etablissement,distributionSpeciale2Etablissement,codeCommune2Etablissement,codeCedex2Etablissement,libelleCedex2Etablissement,codePaysEtranger2Etablissement,libellePaysEtranger2Etablissement,dateDebut,etatAdministratifEtablissement,enseigne1Etablissement,enseigne2Etablissement,enseigne3Etablissement,denominationUsuelleEtablissement,activitePrincipaleEtablissement,nomenclatureActivitePrincipaleEtablissement,caractereEmployeurEtablissement,longitude,latitude,geo_score,geo_type,geo_adresse,geo_id,geo_ligne,geo_l4,geo_l5
214000259,00017,21400025900017,O,1983-03-01,03,2020,,2022-08-29T09:07:09,true,4,,76,,RUE,DU DOCTEUR DUPOUY,40090,BASCONS,,,40025,,,,,,,,,,,,,,,,,,,2008-01-01,A,MAIRIE,,,,84.11Z,NAFRev2,O,-0.418427,43.821471,0.95,housenumber,76 Rue du Docteur Dupouy 40090 Bascons,40025_0145_00076,G,76 RUE DU DOCTEUR DUPOUY,
214000259,00025,21400025900025,O,1983-12-21,02,2020,,2022-08-29T09:07:09,false,3,,28,,RUE,DU DOCTEUR DUPOUY,40090,BASCONS,,,40025,,,,,,,,,,,,,,,,,,,2008-01-01,A,ECOLE PRIMAIRE PUBLIQUE,,,,85.10Z,NAFRev2,N,-0.418423,43.821826,0.95,housenumber,28 Rue du Docteur Dupouy 40090 Bascons,40025_0145_00028,G,28 RUE DU DOCTEUR DUPOUY,
214000259,00041,21400025900041,O,2022-04-01,,,,2023-06-06T16:10:43,false,1,MAIRIE,76,,RUE,DU DOCTEUR DUPOUY,40090,BASCONS,,,40025,,,,,,,,,,,,,,,,,,,2022-04-01,A,LOTISSEMENT SARREMPIN,,,,42.99Z,NAFRev2,N,-0.418427,43.821471,0.95,housenumber,76 Rue du Docteur Dupouy 40090 Bascons,40025_0145_00076,G,76 RUE DU DOCTEUR DUPOUY,
264003583,00012,26400358300012,O,1983-03-01,NN,,,2022-04-01T14:30:48,true,4,,,,,,40090,BASCONS,,,40025,,,,,,,,,,,,,,,,,,,2020-09-30,F,CCAS,,,,88.99B,NAFRev2,N,,,0,,,,,,
264003583,00020,26400358300020,O,1985-03-14,NN,,,2022-04-01T14:30:48,false,4,,,,,MAIRIE,40090,BASCONS,,,40025,,,,,,,,,,,,,,,,,,,2020-09-30,F,SER AIDE A DOMI PERS AGEES,,,,88.10A,NAFRev2,N,-0.419037,43.821989,0.51,street,Rue Marie Mallet 40090 Bascons,40025_0230,G,RUE MARIE MALLET,
294001136,00018,29400113600018,O,1995-12-25,NN,,,2008-01-04T19:06:41,true,2,,,,,MAIRIE,40090,BASCONS,,,40025,,,,,,,,,,,,,,,,,,,2008-01-01,A,,,,,42.99Z,NAFRev2,N,-0.419037,43.821989,0.51,street,Rue Marie Mallet 40090 Bascons,40025_0230,G,RUE MARIE MALLET,
301241402,00017,30124140200017,O,,,,,,true,1,,,,RTE,DE MAURIN,40090,BASCONS,,,40025,,,,,,,,,,,,,,,,,,,1984-12-25,F,,,,,21.08,NAP,N,-0.439198,43.826585,0.43,street,Chemin de Lahaurie 40090 Bascons,40025_0210,G,CHEMIN DE LAHAURIE,
302192588,00010,30219258800010,O,,,,,,true,1,,,,,,40090,BASCONS,,,40025,,,,,,,,,,,,,,,,,,,1984-12-25,F,,,,,02.20,NAP,N,,,0,,,,,,
306679218,00017,30667921800017,O,,NN,,,,true,1,,,,,L ESTANQUET,40090,BASCONS,,,40025,,,,,,,,,,,,,,,,,,,2001-12-12,F,,,,,70.2C,NAF1993,N,-0.9130364,43.4749675,0.9,poi.bar,L'estanquet (Bar) Salies-de-Béarn,https://osm.org/way/218140356,G,,
308946649,00016,30894664900016,O,,NN,,,,true,1,,,,,BOURG,40090,BASCONS,,,40025,,,,,,,,,,,,,,,,,,,1987-11-30,F,,,,,62.11,NAP,N,-0.415082,43.849467,0.6,street,Chemin de Bourboure 40090 Bascons,40025_0095,G,CHEMIN DE BOURBOURE,
309042190,00020,30904219000020,O,1990-10-01,NN,,,2008-01-04T19:52:44,true,3,,,,,JOUANMAOU,40090,BASCONS,,,40025,,,,,,,,,,,,,,,,,,,2008-01-01,A,,,,,68.20B,NAFRev2,N,-0.42076,43.824378,0.92,street,Chemin de Jouanmaou 40090 Bascons,40025_0190,G,CHEMIN DE JOUANMAOU,
312049455,00016,31204945500016,O,,NN,,,,true,1,,,,,AU BOURG,40090,BASCONS,,,40025,,,,,,,,,,,,,,,,,,,1992-02-06,F,,,,,45.4J,NAF1993,N,-0.415082,43.849467,0.41,street,Chemin de Bourboure 40090 Bascons,40025_0095,G,CHEMIN DE BOURBOURE,
312556400,00017,31255640000017,O,,,,,,true,1,,,,RTE,DE MAURRIN,40090,BASCONS,,,40025,,,,,,,,,,,,,,,,,,,1985-12-25,F,,,,,65.06,NAP,N,-0.416632,43.826911,0.35,street,Route de la Haute-lande 40090 Bascons,40025_0170,G,ROUTE DE LA HAUTE LANDE,
316349273,00037,31634927300037,O,,,,,,true,1,,,,,AU BOURG,40090,BASCONS,,,40025,,,,,,,,,,,,,,,,,,,1992-03-27,F,,,,,55.1A,NAF1993,N,-0.415082,43.849467,0.41,street,Chemin de Bourboure 40090 Bascons,40025_0095,G,CHEMIN DE BOURBOURE,
316821933,00017,31682193300017,O,,,,,,true,1,,,,,AU PATAN,40090,BASCONS,,,40025,,,,,,,,,,,,,,,,,,,1985-12-25,F,,,,,55.60,NAP,N,-0.419974,43.8435,0.41,street,Chemin du Patge 40090 Bascons,40025_0245,G,CHEMIN DU PATGE,
317697993,00010,31769799300010,O,,,,,,true,1,,,,,QU DE BOSTENS,40090,BASCONS,,,40025,,,,,,,,,,,,,,,,,,,1984-12-25,F,,,,,55.40,NAP,N,-0.3599896,43.972169,0.77,poi.place_of_worship,(Lieu de culte) Bostens,https://osm.org/way/329826975,G,,
319392825,00026,31939282500026,O,,NN,,,,true,1,,,,,,40090,BASCONS,,,40025,,,,,,,,,,,,,,,,,,,,F,,,,,67.09,NAP,N,,,0,,,,,,
319677290,00011,31967729000011,O,,NN,,,,true,1,,,,,QUARTIER PILLES,40090,BASCONS,,,40025,,,,,,,,,,,,,,,,,,,1992-04-30,F,,,,,51.3C,NAF1993,N,-0.394843,43.816546,0.42,street,Chemin de Pillés 40090 Bascons,40025_0260,G,CHEMIN DE PILLES,
321344442,00017,32134444200017,O,1981-04-02,NN,,,2008-11-07T00:37:33,true,4,,,,,,40090,BASCONS,,,40025,,,,,,,,,,,,,,,,,,,2006-12-31,F,,,,,93.0D,NAFRev1,N,,,0,,,,,,
322263617,00084,32226361700084,O,2010-01-01,,,,2016-01-12T00:11:23,false,1,,,,,LE BOURG,40090,BASCONS,,,40025,,,,,,,,,,,,,,,,,,,2010-01-01,A,,,,,02.20Z,NAFRev2,N,-0.415082,43.849467,0.52,street,Chemin de Bourboure 40090 Bascons,40025_0095,G,CHEMIN DE BOURBOURE,
323061028,00094,32306102800094,O,2009-01-05,,,,2010-08-05T07:25:49,false,2,,584,,CHE,DU PRINCE,40090,BASCONS,,,40025,,,,,,,,,,,,,,,,,,,2010-08-02,F,,,,,43.21A,NAFRev2,N,-0.423478,43.827972,0.7,housenumber,584 Chemin de Prince 40090 Bascons,40025_0270_00584,G,584 CHEMIN DE PRINCE,
324159300,00015,32415930000015,O,,,,,,true,1,,,,,LATOUQUE,40090,BASCONS,,,40025,,,,,,,,,,,,,,,,,,,1993-12-31,F,,,,,50.1Z,NAF1993,N,,,0,,,,,,
325270775,00019,32527077500019,O,1982-08-23,NN,,,2008-11-07T00:42:26,true,4,,355,,CHE,DE LAHAURIE,40090,BASCONS,,,40025,,,,,,,,,,,,,,,,,,,2005-12-31,F,,,,,45.2A,NAFRev1,N,-0.43853,43.827164,0.86,housenumber,355 Chemin de Lahaurie 40090 Bascons,40025_0210_00355,G,355 CHEMIN DE LAHAURIE,
325725711,00064,32572571100064,O,2014-01-01,,,,2021-02-23T10:48:05,true,1,,360,,CHE,DU PRINCE,40090,BASCONS,,,40025,,,,,,,,,,,,,,,,,,,2014-01-01,A,,,,,43.33Z,NAFRev2,N,-0.421615,43.829242,0.7,housenumber,360 Chemin de Prince 40090 Bascons,40025_0270_00360,G,360 CHEMIN DE PRINCE,
328134804,00025,32813480400025,O,,NN,,,,true,1,,,,QUA,PILLES,40090,BASCONS,,,40025,,,,,,,,,,,,,,,,,,,1997-06-17,F,,,,,52.6E,NAF1993,N,-0.394843,43.816546,0.59,street,Chemin de Pillés 40090 Bascons,40025_0260,G,CHEMIN DE PILLES,
328327432,00014,32832743200014,O,1983-10-17,NN,,,,true,4,,,,,LA FRANCE,40090,BASCONS,,,40025,,,,,,,,,,,,,,,,,,,2001-03-30,F,,,,,02.0B,NAF1993,N,-0.416469,43.823973,0.38,street,Route de la Grande Lande 40090 Bascons,40025_0160,G,ROUTE DE LA GRANDE LANDE,
331647107,00019,33164710700019,O,,NN,,,,true,1,,,,,BOURG,40090,BASCONS,,,40025,,,,,,,,,,,,,,,,,,,,F,,,,,67.01,NAP,N,-0.415082,43.849467,0.6,street,Chemin de Bourboure 40090 Bascons,40025_0095,G,CHEMIN DE BOURBOURE,
332024645,00019,33202464500019,O,,NN,,,,true,1,,,,RTE,DE MAURRIN,40090,BASCONS,,,40025,,,,,,,,,,,,,,,,,,,1994-07-08,F,,,,,28.5D,NAF1993,O,-0.416632,43.826911,0.35,street,Route de la Haute-lande 40090 Bascons,40025_0170,G,ROUTE DE LA HAUTE LANDE,
332030949,00025,33203094900025,O,1987-01-11,NN,,,2011-01-19T15:30:12,false,4,,,,,AU BOURG,40090,BASCONS,,,40025,,,,,,,,,,,,,,,,,,,2010-02-15,F,,,,,86.21Z,NAFRev2,N,-0.415082,43.849467,0.41,street,Chemin de Bourboure 40090 Bascons,40025_0095,G,CHEMIN DE BOURBOURE,
332223940,00013,33222394000013,O,1985-04-01,NN,,,,true,1,,,,,,40090,BASCONS,,,40025,,,,,,,,,,,,,,,,,,,1998-06-30,F,,,,,45.4C,NAF1993,O,,,0,,,,,,
338253081,26979,33825308126979,O,2016-06-01,NN,,,2021-10-27T08:31:50,false,1,FOYER ST AMAND,203,,ALL,ST AMAND ADAPEI 40,40090,BASCONS,,,40025,,,,,,,,,,,,,,,,,,,2016-06-01,A,,,,,56.29A,NAFRev2,O,-0.419656,43.819803,0.5,housenumber,203 Allee Saint Amand 40090 Bascons,40025_0285_00203,G,203 ALLEE SAINT AMAND,
339045809,00011,33904580900011,O,1986-10-16,NN,,,2008-01-04T21:26:57,true,3,,,,,,40090,BASCONS,,,40025,,,,,,,,,,,,,,,,,,,2008-01-01,A,,,,,41.10D,NAFRev2,N,,,0,,,,,,
340525518,00015,34052551800015,O,1986-11-02,NN,,,,true,1,,,,,,40090,BASCONS,,,40025,,,,,,,,,,,,,,,,,,,2001-06-30,F,,,,,01.1A,NAF1993,N,,,0,,,,,,
341154029,00019,34115402900019,O,,NN,,,,true,1,,,,CHE,DE LABARRERE,40090,BASCONS,,,40025,,,,,,,,,,,,,,,,,,,1990-06-25,F,,,,,55.40,NAP,N,-0.407112,43.822301,0.67,street,Chemin Labarrere 40090 Bascons,40025_0195,G,CHEMIN LABARRERE,
341789642,00012,34178964200012,O,,NN,,,,true,1,,,,,L ESTANQUET,40090,BASCONS,,,40025,,,,,,,,,,,,,,,,,,,1989-03-28,F,,,,,67.01,NAP,N,-0.9130364,43.4749675,0.9,poi.bar,L'estanquet (Bar) Salies-de-Béarn,https://osm.org/way/218140356,G,,
343029260,00019,34302926000019,O,,NN,,,,true,1,,,,,BOURG,40090,BASCONS,,,40025,,,,,,,,,,,,,,,,,,,1993-06-30,F,,,,,52.1B,NAF1993,N,-0.415082,43.849467,0.6,street,Chemin de Bourboure 40090 Bascons,40025_0095,G,CHEMIN DE BOURBOURE,
343926770,00011,34392677000011,O,1988-01-01,NN,,,,true,1,,,,,AU PENS,40090,BASCONS,,,40025,,,,,,,,,,,,,,,,,,,1998-12-31,F,,,,,01.3Z,NAF1993,N,-0.410539,43.832995,0.34,street,Route des Petites Landes 40090 Bascons,40025_0255,G,ROUTE DES PETITES LANDES,
344122981,00014,34412298100014,O,1988-03-01,NN,,,,true,1,,,,,MASCOTTE,40090,BASCONS,,,40025,,,,,,,,,,,,,,,,,,,2000-01-01,F,,,,,01.3Z,NAF1993,N,-0.438745,43.824327,0.52,street,Route du Marsan 40090 Bascons,40025_0235,G,ROUTE DU MARSAN,
344478128,00012,34447812800012,O,1988-04-04,NN,,,2008-11-08T00:19:28,true,3,,,,,CONSTANTIN,40090,BASCONS,,,40025,,,,,,,,,,,,,,,,,,,2005-12-31,F,,,,,45.4C,NAFRev1,N,-0.43324,43.845763,0.42,street,Chemin des Coursayres 40090 Bascons,40025_0140,G,CHEMIN DES COURSAYRES,
344701313,00019,34470131300019,O,1988-05-01,01,2020,,2023-01-09T11:00:34,true,4,,64,,CHE,DE TESTELADE,40090,BASCONS,,,40025,,,,,,,,,,,,,,,,,,,2012-12-31,A,,,,,01.11Z,NAFRev2,O,-0.442388,43.82438,0.85,housenumber,64 Chemin de Testelade 40090 Bascons,40025_0290_00064,G,64 CHEMIN DE TESTELADE,
345067664,00010,34506766400010,O,1988-05-07,NN,,,2013-01-22T05:14:53,true,4,,,,CHE,DE CARDONNE,40090,BASCONS,,,40025,,,,,,,,,,,,,,,,,,,2012-12-15,F,,,,,68.31Z,NAFRev2,N,-0.422138,43.821975,0.65,street,Chemin Cardonne 40090 Bascons,40025_0115,G,CHEMIN CARDONNE,
349770388,00016,34977038800016,O,,NN,,,,true,1,,,,,AU BOURG,40090,BASCONS,,,40025,,,,,,,,,,,,,,,,,,,1989-08-04,F,,,,,65.03,NAP,N,-0.415082,43.849467,0.41,street,Chemin de Bourboure 40090 Bascons,40025_0095,G,CHEMIN DE BOURBOURE,
350065991,00027,35006599100027,O,2004-05-28,NN,,,2008-01-04T23:12:06,true,3,,1231,,RTE,DE LA CHALOSSE,40090,BASCONS,,,40025,,,,,,,,,,,,,,,,,,,2008-01-01,A,,,,,68.20A,NAFRev2,N,-0.425056,43.810989,0.87,housenumber,1231 Route de la Chalosse 40090 Bascons,40025_0125_01231,G,1231 ROUTE DE LA CHALOSSE,
350221735,00045,35022173500045,O,2004-02-24,NN,,,2013-05-31T10:23:26,false,8,,1823,,CHE,DE BOURBOURE,40090,BASCONS,,,40025,,,,,,,,,,,,,,,,,,,2011-04-30,F,,,,,43.99C,NAFRev2,N,-0.416131,43.847625,0.86,housenumber,1823 Chemin de Bourboure 40090 Bascons,40025_0095_01823,G,1823 CHEMIN DE BOURBOURE,
350499315,00017,35049931500017,O,1989-02-01,NN,,,2017-11-27T08:50:25,false,4,,,,PL,RAOUL LAPORTERIE,40090,BASCONS,,,40025,,,,,,,,,,,,,,,,,,,2002-05-31,F,,,,,70.2A,NAF1993,N,-0.41813,43.822286,0.59,street,Place Laporterie 40090 Bascons,40025_0275,G,PLACE LAPORTERIE,
352910723,00035,35291072300035,O,2003-11-01,NN,,,2014-07-08T00:57:39,false,5,,15,,AV,DU DOCTEUR DUPOUY,40090,BASCONS,,,40025,,,,,,,,,,,,,,,,,,,2012-02-29,F,,,,,81.21Z,NAFRev2,O,-0.4183,43.821931,0.79,housenumber,15 Rue du Docteur Dupouy 40090 Bascons,40025_0145_00015,G,15 RUE DU DOCTEUR DUPOUY,
353385602,00043,35338560200043,O,2009-03-13,,,4311ZZ,2015-06-17T03:56:20,true,6,,325,,CHE,DE LAHAURIE,40090,BASCONS,,,40025,,,,,,,,,,,,,,,,,,,2015-06-16,F,,,,,43.11Z,NAFRev2,N,-0.438916,43.826852,0.86,housenumber,325 Chemin de Lahaurie 40090 Bascons,40025_0210_00325,G,325 CHEMIN DE LAHAURIE,
353755804,00013,35375580400013,O,,NN,,,,true,1,,,,,QUARTIER BOSTENS,40090,BASCONS,,,40025,,,,,,,,,,,,,,,,,,,1990-06-29,F,,,,,78.01,NAP,N,-0.4237178,43.8503346,0.89,poi.community_centre,salle du comité des fêtes quartier Bostens (Salle des fêtes) Bascons,https://osm.org/way/363145976,G,,
379257298,00016,37925729800016,O,1990-09-12,NN,,,2008-01-04T21:27:00,true,3,,,,LD,LA ROSERAIE,40090,BASCONS,,,40025,,,,,,,,,,,,,,,,,,,2008-01-01,A,,,,,68.20A,NAFRev2,N,-0.416632,43.826911,0.34,street,Route de la Haute-lande 40090 Bascons,40025_0170,G,ROUTE DE LA HAUTE LANDE,
379711583,00011,37971158300011,O,1990-10-24,NN,,,2019-07-29T09:04:54,true,4,,,,LD,AUX CLAOUS,40090,BASCONS,,,40025,,,,,,,,,,,,,,,,,,,2019-07-26,F,,,,,68.20A,NAFRev2,N,,,0,,,,,,
380876847,00019,38087684700019,O,1991-01-01,NN,,,2008-10-26T05:50:18,true,3,,,,,YEPPE,40090,BASCONS,,,40025,,,,,,,,,,,,,,,,,,,2008-01-01,A,,,,,01.11Z,NAFRev2,N,,,0,,,,,,
387472269,00019,38747226900019,O,1900-01-01,NN,,,2020-12-24T08:22:22,false,3,,,,,L ESTANQUET,40090,BASCONS,,,40025,,,,,,,,,,,,,,,,,,,1996-12-31,F,,,,,55.1A,NAF1993,N,-0.9130364,43.4749675,0.9,poi.bar,L'estanquet (Bar) Salies-de-Béarn,https://osm.org/way/218140356,G,,
387472269,00027,38747226900027,O,2021-01-19,,,,2020-12-24T08:22:22,true,1,,1221,,RTE,DU MARSAN,40090,BASCONS,,,40025,,,,,,,,,,,,,,,,,,,2021-01-19,A,,,,,68.20A,NAFRev2,N,-0.432556,43.824314,0.86,housenumber,1221 Route du Marsan 40090 Bascons,40025_0235_01221,G,1221 ROUTE DU MARSAN,
388479016,00015,38847901600015,O,1992-09-01,NN,,,2008-01-04T23:10:00,true,3,,,,,,40090,BASCONS,,,40025,,,,,,,,,,,,,,,,,,,2008-01-01,A,,,,,93.12Z,NAFRev2,N,,,0,,,,,,
389339797,00018,38933979700018,O,1992-12-03,NN,,,2008-11-08T00:50:43,false,3,,,,,AU BOURG,40090,BASCONS,,,40025,,,,,,,,,,,,,,,,,,,1993-12-25,F,,,,,74.1J,NAF1993,N,-0.415082,43.849467,0.41,street,Chemin de Bourboure 40090 Bascons,40025_0095,G,CHEMIN DE BOURBOURE,
392658480,00026,39265848000026,O,1993-10-04,NN,,,2014-07-08T01:21:11,false,4,PEDOUMAS,,,RTE,DE MAURRIN,40090,BASCONS,,,40025,,,,,,,,,,,,,,,,,,,2010-07-12,F,,,,,43.22A,NAFRev2,N,-0.416632,43.826911,0.35,street,Route de la Haute-lande 40090 Bascons,40025_0170,G,ROUTE DE LA HAUTE LANDE,
392658480,00034,39265848000034,O,2010-07-12,NN,,4322BC,2017-05-04T03:56:46,true,4,,298,,CHE,DE BORDENAVE,40090,BASCONS,,,40025,,,,,,,,,,,,,,,,,,,2015-08-31,F,,,,,43.22B,NAFRev2,O,-0.405295,43.827972,0.76,housenumber,298 Chemin Bordenave 40090 Bascons,40025_0090_00298,G,298 CHEMIN BORDENAVE,
392936886,00010,39293688600010,O,1993-10-13,NN,,,2008-01-05T20:05:02,true,3,LE GRAND HILLOT,,,QUA,DE BOSTENS,40090,BASCONS,,,40025,,,,,,,,,,,,,,,,,,,2008-01-01,A,,,,,68.20B,NAFRev2,N,-0.4237178,43.8503346,0.71,poi.community_centre,salle du comité des fêtes quartier Bostens (Salle des fêtes) Bascons,https://osm.org/way/363145976,G,,
394955561,00011,39495556100011,O,1994-04-19,NN,,,,true,1,,,,,LA CLAVERIE,40090,BASCONS,,,40025,,,,,,,,,,,,,,,,,,,2002-06-30,F,,,,,80.4D,NAF1993,N,-0.415921,43.82168,0.7,street,Chemin de Laclaverie 40090 Bascons,40025_0200,G,CHEMIN DE LACLAVERIE,
398637744,00010,39863774400010,O,1994-10-01,03,2020,2562BZ,2023-08-06T20:14:47,true,4,,1365,,RTE,DU BAS ARMAGNAC,40090,BASCONS,,,40025,,,,,,,,,,,,,,,,,,,2008-01-01,A,,,,,25.62B,NAFRev2,O,-0.402787,43.825953,0.88,housenumber,1365 Route du Bas-armagnac 40090 Bascons,40025_0070_01365,G,1365 ROUTE DU BAS ARMAGNAC,
401084009,00026,40108400900026,O,2011-03-04,,,,2019-09-04T08:44:44,true,2,,15,,RUE,DU DOCTEUR DUPOUY,40090,BASCONS,,,40025,,,,,,,,,,,,,,,,,,,2019-09-03,F,,,,,68.20A,NAFRev2,N,-0.4183,43.821931,0.95,housenumber,15 Rue du Docteur Dupouy 40090 Bascons,40025_0145_00015,G,15 RUE DU DOCTEUR DUPOUY,
401912266,00012,40191226600012,O,1992-01-01,NN,,,2023-05-05T20:40:27,true,4,,,,,PETCHE,40090,BASCONS,,,40025,,,,,,,,,,,,,,,,,,,2017-12-25,F,,,,,01.47Z,NAFRev2,N,-0.449922,43.821705,0.91,street,Chemin de Petche 40090 Bascons,40025_0250,G,CHEMIN DE PETCHE,
402356075,00018,40235607500018,O,,,,,,true,1,,,,,GRANGE,40090,BASCONS,,,40025,,,,,,,,,,,,,,,,,,,1996-12-31,F,,,,,01.1A,NAF1993,N,-0.416469,43.823973,0.51,street,Route de la Grande Lande 40090 Bascons,40025_0160,G,ROUTE DE LA GRANDE LANDE,
402754188,00017,40275418800017,O,1995-10-09,NN,,,2008-11-08T01:14:10,false,4,,705,,CHE,DU PRINCE,40090,BASCONS,,,40025,,,,,,,,,,,,,,,,,,,2001-12-31,F,,,,,45.2L,NAF1993,O,-0.424944,43.827965,0.7,housenumber,705 Chemin de Prince 40090 Bascons,40025_0270_00705,G,705 CHEMIN DE PRINCE,
403143498,00026,40314349800026,O,2012-10-30,,,,2022-01-26T03:42:38,true,2,,658,,RTE,DU MARSAN,40090,BASCONS,,,40025,,,,,,,,,,,,,,,,,,,2021-12-23,F,,,,,68.20B,NAFRev2,N,-0.425013,43.82398,0.85,housenumber,658 Route du Marsan 40090 Bascons,40025_0235_00658,G,658 ROUTE DU MARSAN,
403217425,00020,40321742500020,O,1994-12-03,NN,,,2008-01-04T20:18:39,false,3,LDT PATGE,,,QUA,BOSTENS,40090,BASCONS,,,40025,,,,,,,,,,,,,,,,,,,2008-01-01,A,,,,,01.11Z,NAFRev2,N,-0.4237178,43.8503346,0.74,poi.community_centre,salle du comité des fêtes quartier Bostens (Salle des fêtes) Bascons,https://osm.org/way/363145976,G,,
408429777,00027,40842977700027,O,2010-09-01,,,,2015-12-29T03:23:09,true,2,,115,,RTE,DE LA CHALOSSE,40090,BASCONS,,,40025,,,,,,,,,,,,,,,,,,,2015-12-31,F,,,,,70.22Z,NAFRev2,N,-0.421494,43.820242,0.87,housenumber,115 Route de la Chalosse 40090 Bascons,40025_0125_00115,G,115 ROUTE DE LA CHALOSSE,
410467732,00013,41046773200013,O,1997-01-10,NN,,,2012-07-31T08:32:31,false,4,,,,,LE BOURG,40090,BASCONS,,,40025,,,,,,,,,,,,,,,,,,,2000-12-15,F,,,,,55.1A,NAF1993,O,-0.415082,43.849467,0.52,street,Chemin de Bourboure 40090 Bascons,40025_0095,G,CHEMIN DE BOURBOURE,
410581680,00015,41058168000015,O,1997-01-01,,,,,true,1,,,,RTE,DE PETITE LANDES,40090,BASCONS,,,40025,,,,,,,,,,,,,,,,,,,1999-12-31,F,,,,,01.1A,NAF1993,N,-0.410539,43.832995,0.72,street,Route des Petites Landes 40090 Bascons,40025_0255,G,ROUTE DES PETITES LANDES,
410658017,00018,41065801700018,O,1996-10-01,NN,,,2018-09-29T12:35:33,true,4,,103,,RTE,DU BAS ARMAGNAC,40090,BASCONS,,,40025,,,,,,,,,,,,,,,,,,,2017-06-30,F,,,,,93.12Z,NAFRev2,O,-0.415446,43.822467,0.88,housenumber,103 Route du Bas-armagnac 40090 Bascons,40025_0070_00103,G,103 ROUTE DU BAS ARMAGNAC,
410928915,00447,41092891500447,O,1998-07-03,,,,,false,3,,3840,,,RTEDE LA HAUTE LANDE,40090,BASCONS,,,40025,,,,,,,,,,,,,,,,,,,1999-01-01,F,BERMES CHRISTIAN,,,,62.1Z,NAF1993,N,-0.424243,43.850316,0.8,housenumber,3840 Route de la Haute-lande 40090 Bascons,40025_0170_03840,G,3840 ROUTE DE LA HAUTE LANDE,
412563207,00015,41256320700015,O,1996-01-01,NN,,4312AZ,2022-04-27T04:20:49,true,5,,378,,RTE,DU BAS ARMAGNAC,40090,BASCONS,,,40025,,,,,,,,,,,,,,,,,,,2021-01-01,A,,,,,01.61Z,NAFRev2,N,-0.412702,43.822587,0.88,housenumber,378 Route du Bas-armagnac 40090 Bascons,40025_0070_00378,G,378 ROUTE DU BAS ARMAGNAC,
414250969,00014,41425096900014,O,1997-07-01,NN,,,2018-09-29T12:39:31,true,4,PRES MR B DUFAU,,,QUA,BOSTENS,40090,BASCONS,,,40025,,,,,,,,,,,,,,,,,,,2008-01-01,A,,,,,93.12Z,NAFRev2,O,-0.4237178,43.8503346,0.74,poi.community_centre,salle du comité des fêtes quartier Bostens (Salle des fêtes) Bascons,https://osm.org/way/363145976,G,,
418289641,00015,41828964100015,O,1997-01-01,NN,,,2021-10-22T09:50:07,true,5,,82,,IMP,LAHAURIE,40090,BASCONS,,,40025,,,,,,,,,,,,,,,,,,,2021-09-02,A,,,,,35.11Z,NAFRev2,N,-0.440086,43.827011,0.82,housenumber,82 Impasse Lahaurie 40090 Bascons,40025_0215_00082,G,82 IMPASSE LAHAURIE,
419107958,00011,41910795800011,O,1987-12-31,NN,,,2008-01-04T23:31:16,true,3,,,,,LUBET,40090,BASCONS,,,40025,,,,,,,,,,,,,,,,,,,2008-01-01,A,,,,,01.42Z,NAFRev2,N,-0.509676,43.8783879,0.88,poi.school,Collège Lubet Barbon (École) Saint-Pierre-du-Mont,https://osm.org/node/4898115006,G,,
419107966,00014,41910796600014,O,1987-12-31,NN,,,2017-09-20T10:39:48,true,4,,,,,BOURBOURE,40090,BASCONS,,,40025,,,,,,,,,,,,,,,,,,,2017-12-31,F,,,,,01.50Z,NAFRev2,N,-0.415082,43.849467,0.92,street,Chemin de Bourboure 40090 Bascons,40025_0095,G,CHEMIN DE BOURBOURE,
419107974,00018,41910797400018,O,1988-12-31,,,,,true,3,,,,,PILLE,40090,BASCONS,,,40025,,,,,,,,,,,,,,,,,,,2000-12-31,F,,,,,01.1G,NAF1993,N,-0.394843,43.816546,0.76,street,Chemin de Pillés 40090 Bascons,40025_0260,G,CHEMIN DE PILLES,
419107982,00011,41910798200011,O,1988-12-31,,,,,true,3,,,,,GRAND LION QR PILLE,40090,BASCONS,,,40025,,,,,,,,,,,,,,,,,,,1999-01-01,F,,,,,01.2G,NAF1993,N,,,0,,,,,,
419107990,00014,41910799000014,O,1991-01-01,NN,,,2008-01-04T23:31:16,true,3,,,,,COMIFAUT,40090,BASCONS,,,40025,,,,,,,,,,,,,,,,,,,2008-01-01,A,,,,,01.11Z,NAFRev2,N,,,0,,,,,,
419114004,00023,41911400400023,O,1994-01-01,NN,,,2016-01-12T00:20:14,false,3,,,,,CONSTANTIN,40090,BASCONS,,,40025,,,,,,,,,,,,,,,,,,,2008-01-01,A,,,,,02.10Z,NAFRev2,N,-0.43324,43.845763,0.42,street,Chemin des Coursayres 40090 Bascons,40025_0140,G,CHEMIN DES COURSAYRES,
420226698,00017,42022669800017,O,1987-12-31,NN,,,2015-04-09T04:37:07,true,4,,,,,CAUNA,40090,BASCONS,,,40025,,,,,,,,,,,,,,,,,,,2014-05-16,F,,,,,01.50Z,NAFRev2,N,-0.6417648,43.7812754,0.88,poi.castle,(Château) Cauna,https://osm.org/node/4640666431,G,,
420226706,00018,42022670600018,O,1987-12-31,NN,,,2021-02-23T11:41:15,true,4,,1621,,CHE,DU PRINCE,40090,BASCONS,,,40025,,,,,,,,,,,,,,,,,,,2015-01-01,A,,,,,01.45Z,NAFRev2,N,-0.429869,43.826484,0.71,housenumber,1621 Chemin de Prince 40090 Bascons,40025_0270_01621,G,1621 CHEMIN DE PRINCE,
420226714,00012,42022671400012,O,1987-12-31,NN,,,,true,3,,,,,BROUSTE,40090,BASCONS,,,40025,,,,,,,,,,,,,,,,,,,2003-12-30,F,,,,,01.1A,NAFRev1,N,-0.416632,43.826911,0.35,street,Route de la Haute-lande 40090 Bascons,40025_0170,G,ROUTE DE LA HAUTE LANDE,
420226722,00015,42022672200015,O,1996-12-31,NN,,,2016-06-03T16:15:09,false,4,CHEZ MR LACOUTURE,,,,BENCADET,40090,BASCONS,,,40025,,,,,,,,,,,,,,,,,,,2016-04-28,F,,,,,01.11Z,NAFRev2,N,,,0,,,,,,
420715518,00023,42071551800023,P,2000-04-01,NN,,,2006-11-25T16:11:26,false,3,[ND],[ND],[ND],[ND],[ND],[ND],BASCONS,,[ND],40025,[ND],[ND],,,[ND],[ND],[ND],[ND],[ND],[ND],,,[ND],,[ND],[ND],,,2004-01-01,F,[ND],[ND],[ND],[ND],74.1J,NAFRev1,N,,,0,,,,,,
420715518,00049,42071551800049,O,2008-03-17,,,,2008-04-24T10:02:33,true,1,,,,LD,NAOUTUC,40090,BASCONS,,,40025,,,,,,,,,,,,,,,,,,,2008-03-17,A,,,,,01.11Z,NAFRev2,N,,,0,,,,,,
423608769,00018,42360876900018,O,1999-07-01,02,2020,1071CA,2022-08-29T09:05:02,true,3,,59,,RUE,DU DR DUPUY,40090,BASCONS,,,40025,,,,,,,,,,,,,,,,,,,2008-01-01,A,,,,,10.71C,NAFRev2,O,-0.418319,43.8216,0.75,housenumber,59 Rue du Docteur Dupouy 40090 Bascons,40025_0145_00059,G,59 RUE DU DOCTEUR DUPOUY,
423795780,00026,42379578000026,O,2003-12-02,NN,,,2008-10-21T09:23:42,true,3,SARL GRAINE ENERGIE,505,,CHE,DE MOUSSURE,40090,BASCONS,,,40025,,,,,,,,,,,,,,,,,,,2004-12-03,F,,,,,74.1J,NAFRev1,N,-0.393015,43.829355,0.71,housenumber,505 Chemin Moussure 40090 Bascons,40025_0240_00505,G,505 CHEMIN MOUSSURE,
424079176,00014,42407917600014,O,1999-04-09,NN,,,2009-09-18T15:11:43,false,3,,314,,CHE,DU PATGE,40090,BASCONS,,,40025,,,,,,,,,,,,,,,,,,,2006-09-30,F,,,,,01.1F,NAFRev1,N,-0.420844,43.843894,0.83,housenumber,314 Chemin du Patge 40090 Bascons,40025_0245_00314,G,314 CHEMIN DU PATGE,
424403350,00012,42440335000012,O,1971-03-01,NN,,,2015-05-20T03:34:32,true,4,,,,,,40090,BASCONS,,,40025,,,,,,,,,,,,,,,,,,,2010-12-31,F,,,,,11.01Z,NAFRev2,N,,,0,,,,,,