siren,nic,siret,statutDiffusionEtablissement,dateCreationEtablissement,trancheEffectifsEtablissement,anneeEffectifsEtablissement,activitePrincipaleRegistreMetiersEtablissement,dateDernierTraitementEtablissement,etablissementSiege,nombrePeriodesEtablissement,complementAdresseEtablissement,numeroVoieEtablissement,indiceRepetitionEtablissement,typeVoieEtablissement,libelleVoieEtablissement,codePostalEtablissement,libelleCommuneEtablissement,libelleCommuneEtrangerEtablissement,distributionSpecialeEtablissement,codeCommuneEtablissement,codeCedexEtablissement,libelleCedexEtablissement,codePaysEtrangerEtablissement,libellePaysEtrangerEtablissement,complementAdresse2Etablissement,numeroVoie2Etablissement,indiceRepetition2Etablissement,typeVoie2Etablissement,libelleVoie2Etablissement,codePostal2Etablissement,libelleCommune2Etablissement,libelleCommuneEtranger2Etablissement,distributionSpeciale2Etablissement,codeCommune2Etablissement,codeCedex2Etablissement,libelleCedex2Etablissement,codePaysEtranger2Etablissement,libellePaysEtranger2Etablissement,dateDebut,etatAdministratifEtablissement,enseigne1Etablissement,enseigne2Etablissement,enseigne3Etablissement,denominationUsuelleEtablissement,activitePrincipaleEtablissement,nomenclatureActivitePrincipaleEtablissement,caractereEmployeurEtablissement,longitude,latitude,geo_score,geo_type,geo_adresse,geo_id,geo_ligne,geo_l4,geo_l5
174102111,00096,17410211100096,O,1983-03-23,NN,,,2011-04-23T04:08:13,false,4,,26,,RUE,LA VALLEE,41100,SELOMMES,,,41243,,,,,,,,,,,,,,,,,,,2010-01-01,F,TRESORERIE DE SELOMMES,,,,84.11Z,NAFRev2,N,1.191746,47.753195,0.94,housenumber,26 Rue de la Vallée 41100 Selommes,41243_0120_00026,G,26 RUE DE LA VALLEE,
200091098,00018,20009109800018,O,2020-01-01,,,,2020-12-17T08:02:13,false,2,MAIRIE DE SELOMMES,1,,PL,DE LA MAIRIE,41100,SELOMMES,,,41243,,,,,,,,,,,,,,,,,,,2020-12-10,F,,,,,84.11Z,NAFRev2,O,1.193075,47.756101,0.84,housenumber,1 Place de la Mairie 41100 Selommes,41243_0080_00001,G,1 PLACE DE LA MAIRIE,
214102436,00018,21410243600018,O,1983-03-01,11,2020,,2022-08-29T09:07:12,true,4,,1,,PL,DE LA MAIRIE,41100,SELOMMES,,,41243,,,,,,,,,,,,,,,,,,,2008-01-01,A,MAIRIE,,,,84.11Z,NAFRev2,O,1.193075,47.756101,0.84,housenumber,1 Place de la Mairie 41100 Selommes,41243_0080_00001,G,1 PLACE DE LA MAIRIE,
214102436,00026,21410243600026,O,1983-12-21,01,2020,,2022-08-29T09:07:12,false,3,,4,,AV,DE LA GARE,41100,SELOMMES,,,41243,,,,,,,,,,,,,,,,,,,2008-01-01,A,ECOLE MATERNELLE PUBLIQUE,,,,85.10Z,NAFRev2,N,1.192995,47.752048,0.83,housenumber,4 Avenue de la Gare 41100 Selommes,41243_0055_00004,G,4 AVENUE DE LA GARE,
214102436,00034,21410243600034,O,1983-12-21,02,2020,,2022-08-29T09:07:12,false,3,,1,,PL,DE LA MAIRIE,41100,SELOMMES,,,41243,,,,,,,,,,,,,,,,,,,2008-01-01,A,ECOLE PRIMAIRE PUBLIQUE,,,,85.20Z,NAFRev2,N,1.193075,47.756101,0.84,housenumber,1 Place de la Mairie 41100 Selommes,41243_0080_00001,G,1 PLACE DE LA MAIRIE,
214102436,00042,21410243600042,O,1995-01-01,NN,,,2020-11-23T08:49:38,false,4,MAIRIE,1,,PL,DE LA MAIRIE,41100,SELOMMES,,,41243,,,,,,,,,,,,,,,,,,,2019-12-31,F,SERVICE ASSAINISSEMENT,,,,37.00Z,NAFRev2,N,1.193075,47.756101,0.84,housenumber,1 Place de la Mairie 41100 Selommes,41243_0080_00001,G,1 PLACE DE LA MAIRIE,
214102436,00059,21410243600059,O,2005-03-31,,,,2008-01-04T18:33:33,false,2,MAIRIE,1,,PL,DE LA MAIRIE,41100,SELOMMES,,,41243,,,,,,,,,,,,,,,,,,,2008-01-01,A,LOTISSEMENT COMMUNAL,,,,42.99Z,NAFRev2,N,1.193075,47.756101,0.84,housenumber,1 Place de la Mairie 41100 Selommes,41243_0080_00001,G,1 PLACE DE LA MAIRIE,
214102436,00075,21410243600075,O,2013-05-16,,,,2013-06-18T09:57:12,false,1,MAIRIE,1,,PL,DE LA MAIRIE,41100,SELOMMES,,,41243,,,,,,,,,,,,,,,,,,,2013-05-16,F,SPIC PHOTOVOLTAIQUE,,,,35.11Z,NAFRev2,N,1.193075,47.756101,0.84,housenumber,1 Place de la Mairie 41100 Selommes,41243_0080_00001,G,1 PLACE DE LA MAIRIE,
214102436,00083,21410243600083,O,2013-12-26,,,,2021-02-23T10:32:22,false,1,MAIRIE,1,,PL,DE LA MAIRIE,41100,SELOMMES,,,41243,,,,,,,,,,,,,,,,,,,2013-12-26,A,SELOMMES PHOTOVOLTAIQUE,,,,35.11Z,NAFRev2,N,1.193075,47.756101,0.84,housenumber,1 Place de la Mairie 41100 Selommes,41243_0080_00001,G,1 PLACE DE LA MAIRIE,
214102436,00091,21410243600091,O,2023-03-30,,,,2023-08-05T10:52:50,false,1,MAIRIE,1,,PL,DE LA MAIRIE,41100,SELOMMES,,,41243,,,,,,,,,,,,,,,,,,,2023-03-30,A,LOTISSEMENT LES VIGNES,,,,42.99Z,NAFRev2,N,1.193075,47.756101,0.84,housenumber,1 Place de la Mairie 41100 Selommes,41243_0080_00001,G,1 PLACE DE LA MAIRIE,
254101637,00018,25410163700018,O,1983-03-01,00,2020,,2022-08-29T09:10:01,true,5,MAIRIE,1,,PL,DE LA MAIRIE,41100,SELOMMES,,,41243,,,,,,,,,,,,,,,,,,,2020-01-01,F,,,,,36.00Z,NAFRev2,O,1.193075,47.756101,0.84,housenumber,1 Place de la Mairie 41100 Selommes,41243_0080_00001,G,1 PLACE DE LA MAIRIE,
254102601,00013,25410260100013,O,1988-06-07,01,2020,,2022-08-29T09:10:01,true,4,MAIRIE,1,,PL,DE LA MAIRIE,41100,SELOMMES,,,41243,,,,,,,,,,,,,,,,,,,2010-01-24,A,,,,,93.11Z,NAFRev2,O,1.193075,47.756101,0.84,housenumber,1 Place de la Mairie 41100 Selommes,41243_0080_00001,G,1 PLACE DE LA MAIRIE,
254102981,00019,25410298100019,O,,NN,,,2006-11-25T09:09:09,true,1,,1,,PL,DE LA MAIRIE,41100,SELOMMES,,,41243,,,,,,,,,,,,,,,,,,,1997-06-06,F,,,,,70.1C,NAF1993,N,1.193075,47.756101,0.84,housenumber,1 Place de la Mairie 41100 Selommes,41243_0080_00001,G,1 PLACE DE LA MAIRIE,
264100231,00010,26410023100010,O,1983-03-01,12,2020,,2022-08-29T09:10:30,true,4,,2,,RUE,DE LA HAUTE PIERRE,41100,SELOMMES,,,41243,,,,,,,,,,,,,,,,,,,2008-01-01,A,,,,,87.10A,NAFRev2,O,1.195208,47.752681,0.95,housenumber,2 Rue de La Haute Pierre 41100 Selommes,41243_0070_00002,G,2 RUE DE LA HAUTE PIERRE,
264100496,00019,26410049600019,O,1983-03-01,NN,,,2010-06-26T03:09:33,true,3,,,,,,41100,SELOMMES,,,41243,,,,,,,,,,,,,,,,,,,2008-01-01,A,CCAS,,,,88.99B,NAFRev2,N,,,0,,,,,,
294100987,00014,29410098700014,O,1983-09-27,01,2020,,2022-08-29T09:10:55,true,3,,,,,MAIRIE,41100,SELOMMES,,,41243,,,,,,,,,,,,,,,,,,,2008-01-01,A,,,,,42.99Z,NAFRev2,N,1.192998,47.756461,0.91,street,Place de la Mairie 41100 Selommes,41243_0080,G,PLACE DE LA MAIRIE,
303911069,00019,30391106900019,O,,NN,,,,true,1,,1,,RUE,ST BOUCHARD,41100,SELOMMES,,,41243,,,,,,,,,,,,,,,,,,,1987-06-05,F,,,,,55.71,NAP,N,1.193143,47.757776,0.85,housenumber,1 Rue Saint-Bouchard 41100 Selommes,41243_0110_00001,G,1 RUE SAINT BOUCHARD,
303946016,00019,30394601600019,O,,NN,,,,true,1,,,,,,41100,SELOMMES,,,41243,,,,,,,,,,,,,,,,,,,1987-07-30,F,,,,,67.08,NAP,N,,,0,,,,,,
304539026,00019,30453902600019,O,1975-01-01,NN,,,,true,1,,22,,RUE,DE BEAUCE,41100,SELOMMES,,,41243,,,,,,,,,,,,,,,,,,,2000-12-31,F,,,,,45.2L,NAF1993,N,1.196674,47.756522,0.95,housenumber,22 Rue de Beauce 41100 Selommes,41243_0010_00022,G,22 RUE DE BEAUCE,
305142978,00017,30514297800017,O,,NN,,,,true,1,,29,,RUE,DE LA VALLEE,41100,SELOMMES,,,41243,,,,,,,,,,,,,,,,,,,1996-12-06,F,,,,,45.4C,NAF1993,O,1.190253,47.751378,0.95,housenumber,29 Rue de la Vallée 41100 Selommes,41243_0120_00029,G,29 RUE DE LA VALLEE,
306502048,00011,30650204800011,O,,NN,,,,true,1,,22,,RUE,BEAUCE,41100,SELOMMES,,,41243,,,,,,,,,,,,,,,,,,,2000-12-31,F,,,,,45.2L,NAF1993,N,1.196674,47.756522,0.94,housenumber,22 Rue de Beauce 41100 Selommes,41243_0010_00022,G,22 RUE DE BEAUCE,
309006104,00041,30900610400041,O,2003-11-28,NN,,,2014-07-08T00:14:14,true,4,,6,,RUE,DE BEAUCE,41100,SELOMMES,,,41243,,,,,,,,,,,,,,,,,,,2010-07-31,F,,,,,43.34Z,NAFRev2,N,1.194295,47.756043,0.95,housenumber,6 Rue de Beauce 41100 Selommes,41243_0010_00006,G,6 RUE DE BEAUCE,
309838381,00015,30983838100015,O,,NN,,,,true,1,,,,,VILLARCEAU,41100,SELOMMES,,,41243,,,,,,,,,,,,,,,,,,,1987-02-28,F,,,,,35.01,NAP,N,1.177583,47.771369,0.95,street,Villarceau 41100 Selommes,41243_axn6lr,G,VILLARCEAU,
311698518,00033,31169851800033,O,1989-05-02,NN,,,2010-11-18T14:35:22,true,4,,2,,RUE,DES PRASLES,41100,SELOMMES,,,41243,,,,,,,,,,,,,,,,,,,2010-06-02,F,,,,,86.21Z,NAFRev2,N,1.190517,47.757697,0.95,housenumber,2 Rue des Prasles 41100 Selommes,41243_0095_00002,G,2 RUE DES PRASLES,
312720501,00021,31272050100021,O,,NN,,,,true,1,,10,,RUE,BEL AIR,41100,SELOMMES,,,41243,,,,,,,,,,,,,,,,,,,1992-04-12,F,,,,,85.1G,NAF1993,N,1.190075,47.75488,0.94,housenumber,10 Rue de Bel Air 41100 Selommes,41243_0015_00010,G,10 RUE DE BEL AIR,
313735581,00024,31373558100024,O,,,,,,true,1,,,,CHE,DU PLATEREAU,41100,SELOMMES,,,41243,,,,,,,,,,,,,,,,,,,1987-01-11,F,,,,,85.1C,NAF1993,N,1.185049,47.75577,0.77,street,Impasse du Platereau 41100 Selommes,41243_0093,G,IMPASSE DU PLATEREAU,
315767798,00012,31576779800012,O,1979-01-01,NN,,,2008-04-05T00:16:22,true,3,,10,,RUE,DE LA VALLEE,41100,SELOMMES,,,41243,,,,,,,,,,,,,,,,,,,2008-01-01,A,,,,,68.20B,NAFRev2,N,1.19182,47.75474,0.95,housenumber,10 Rue de la Vallée 41100 Selommes,41243_0120_00010,G,10 RUE DE LA VALLEE,
316186154,00019,31618615400019,O,,,,,,true,1,,18,,RUE,GRANDE RUE,41100,SELOMMES,,,41243,,,,,,,,,,,,,,,,,,,1987-09-01,F,,,,,65.06,NAP,N,1.191937,47.757312,0.83,housenumber,18 Grande Rue 41100 Selommes,41243_0060_00018,G,18 GRANDE RUE,
316346337,00025,31634633700025,O,,NN,,,,true,1,,10,,RUE,DE BEL AIR,41100,SELOMMES,,,41243,,,,,,,,,,,,,,,,,,,1995-07-01,F,,,,,70.2C,NAF1993,N,1.190075,47.75488,0.95,housenumber,10 Rue de Bel Air 41100 Selommes,41243_0015_00010,G,10 RUE DE BEL AIR,
318158201,00018,31815820100018,O,1980-01-01,,,,2007-01-18T09:14:51,true,3,,,,,LES EFFETS,41100,SELOMMES,,,41243,,,,,,,,,,,,,,,,,,,2003-10-31,F,,,,,01.1A,NAFRev1,N,1.228037,47.747648,0.94,street,Les Effets 41100 Selommes,41243_1aw3iz,G,LES EFFETS,
318480381,00017,31848038100017,O,1900-01-01,,,,2006-01-08T04:44:39,false,3,,1,,IMP,DU COTEAU,41100,SELOMMES,,,41243,,,,,,,,,,,,,,,,,,,1992-10-01,F,,,,,67.2Z,NAF1993,,1.190658,47.757867,0.82,housenumber,1 Impasse du Coteau 41100 Selommes,41243_0030_00001,G,1 IMPASSE DU COTEAU,
318480381,00025,31848038100025,O,1992-10-01,NN,,,2007-05-19T09:01:50,true,3,,1,,RUE,DE L EGLISE,41100,SELOMMES,,,41243,,,,,,,,,,,,,,,,,,,2005-12-31,F,,,,,67.2Z,NAFRev1,O,1.193749,47.756353,0.94,housenumber,1 Rue de l’Eglise 41100 Selommes,41243_0045_00001,G,1 RUE DE L EGLISE,
319566980,00011,31956698000011,O,1980-07-01,NN,,,2013-03-08T08:43:31,true,4,,,,LD,LA PIGEONNIERE,41100,SELOMMES,,,41243,,,,,,,,,,,,,,,,,,,2008-01-01,A,,,,,68.20B,NAFRev2,N,1.218829,47.74214,0.94,street,La Pigeonniere 41100 Selommes,41243_2aham0,G,LA PIGEONNIERE,
321061749,00024,32106174900024,O,2019-07-15,,,4399CZ,2021-02-23T10:44:54,true,1,,32,,,VILLARCEAU,41100,SELOMMES,,,41243,,,,,,,,,,,,,,,,,,,2019-07-15,A,,,,,43.39Z,NAFRev2,N,1.17781,47.772199,0.95,housenumber,32 Villarceau 41100 Selommes,41243_axn6lr_00032,G,32 VILLARCEAU,
321212268,00015,32121226800015,O,1981-03-11,NN,,,2008-04-05T00:21:02,true,3,,13,,RUE,DE LA PETITE FONTAINE,41100,SELOMMES,,,41243,,,,,,,,,,,,,,,,,,,2008-01-01,A,,,,,01.11Z,NAFRev2,N,1.193621,47.756776,0.95,housenumber,13 Rue de la Petite Fontaine 41100 Selommes,41243_0100_00013,G,13 RUE DE LA PETITE FONTAINE,
321310377,00049,32131037700049,O,1987-04-01,NN,,,,false,3,,,,CHE,PLATEREAU,41100,SELOMMES,,,41243,,,,,,,,,,,,,,,,,,,1995-07-01,F,,,,,85.1C,NAF1993,N,1.185049,47.75577,0.67,street,Impasse du Platereau 41100 Selommes,41243_0093,G,IMPASSE DU PLATEREAU,
322139486,00029,32213948600029,O,1995-09-06,NN,,,2009-03-01T05:36:28,false,4,,1,,,CARREFOUR DE LA LIBERATION,41100,SELOMMES,,,41243,,,,,,,,,,,,,,,,,,,2008-01-01,F,,,,,86.23Z,NAFRev2,N,1.192539,47.755552,0.94,housenumber,1 Carrefour de la Liberation 41100 Selommes,41243_0075_00001,G,1 CARREFOUR DE LA LIBERATION,
322309568,00010,32230956800010,O,,NN,,,,true,1,,8,,RUE,DELAVALLEE,41100,SELOMMES,,,41243,,,,,,,,,,,,,,,,,,,1991-02-28,F,,,,,67.01,NAP,N,1.191935,47.754913,0.74,housenumber,8 Rue de la Vallée 41100 Selommes,41243_0120_00008,G,8 RUE DE LA VALLEE,
323163857,00051,32316385700051,O,2004-07-12,NN,,,2006-11-25T09:53:50,false,2,,10,,RUE,DU CHATEAU,41100,SELOMMES,,,41243,,,,,,,,,,,,,,,,,,,2004-10-01,F,,,,,,,N,1.192398,47.759392,0.95,housenumber,10 Rue du Chateau 41100 Selommes,41243_0025_00010,G,10 RUE DU CHATEAU,
323291971,00022,32329197100022,O,2008-02-26,,,4322AZ,2015-03-18T01:00:45,false,4,,12,,RUE,DE BEAUCE,41100,SELOMMES,,,41243,,,,,,,,,,,,,,,,,,,2014-01-01,F,,,,,43.22A,NAFRev2,N,1.194705,47.756199,0.95,housenumber,12 Rue de Beauce 41100 Selommes,41243_0010_00012,G,12 RUE DE BEAUCE,
323416115,00018,32341611500018,O,1982-01-01,NN,,,2007-01-18T09:16:14,true,3,,,,LD,LE CHATELET,41100,SELOMMES,,,41243,,,,,,,,,,,,,,,,,,,2005-12-31,F,,,,,01.1A,NAFRev1,N,1.23972,47.757975,0.94,street,Le Chatelet 41100 Selommes,41243_3p7dbt,G,LE CHATELET,
323463356,00028,32346335600028,O,2006-01-01,NN,,,2017-05-04T03:21:11,false,4,,1,,RUE,DE L EGLISE,41100,SELOMMES,,,41243,,,,,,,,,,,,,,,,,,,2015-12-31,F,MGA,,,,66.22Z,NAFRev2,O,1.193749,47.756353,0.94,housenumber,1 Rue de l’Eglise 41100 Selommes,41243_0045_00001,G,1 RUE DE L EGLISE,
325006922,00018,32500692200018,O,,NN,,,,true,1,,,,LD,VILLELUISANT,41100,SELOMMES,,,41243,,,,,,,,,,,,,,,,,,,1993-02-28,F,,,,,01.1A,NAF1993,N,1.233994,47.766522,0.94,street,Villeluisant 41100 Selommes,41243_7eq1mz,G,VILLELUISANT,
325449916,00015,32544991600015,O,1982-10-01,NN,,,,true,1,,1,,RUE,DU FOUR A CHAUX,41100,SELOMMES,,,41243,,,,,,,,,,,,,,,,,,,1998-02-20,F,,,,,45.4J,NAF1993,N,1.196824,47.759233,0.94,housenumber,1 Rue du Four a Chaux 41100 Selommes,41243_0050_00001,G,1 RUE DU FOUR A CHAUX,
326618840,00010,32661884000010,O,1983-02-14,NN,,,2021-03-15T10:53:58,true,4,VILLELUISANT,,,,VILLELUISANT,41100,SELOMMES,,,41243,,,,,,,,,,,,,,,,,,,2020-12-31,F,,,,,01.11Z,NAFRev2,N,1.233994,47.766522,0.94,street,Villeluisant 41100 Selommes,41243_7eq1mz,G,VILLELUISANT,
327643417,00014,32764341700014,O,1983-06-21,NN,,,2007-05-22T10:11:20,true,3,,,,,LES EFFETS,41100,SELOMMES,,,41243,,,,,,,,,,,,,,,,,,,2005-12-31,F,,,,,01.1A,NAFRev1,N,1.228037,47.747648,0.94,street,Les Effets 41100 Selommes,41243_1aw3iz,G,LES EFFETS,
330212002,00027,33021200200027,O,,NN,,,,true,1,,,,,LES PRES DE L ARCHE,41100,SELOMMES,,,41243,,,,,,,,,,,,,,,,,,,1989-07-01,F,,,,,77.01,NAP,N,1.196745,47.752061,0.33,street,Residence de la Haute Pierre 41100 Selommes,41243_A050,G,RESIDENCE DE LA HAUTE PIERRE,
330271651,00011,33027165100011,O,1984-06-23,,,,2008-01-04T19:58:01,true,4,,,,LD,LA SALLE,41100,SELOMMES,,,41243,,,,,,,,,,,,,,,,,,,2008-01-01,A,,,,,68.20B,NAFRev2,N,1.230148,47.742817,0.94,street,La Salle 41100 Selommes,41243_3mfqak,G,LA SALLE,
330660911,00018,33066091100018,O,,NN,,,,true,1,,2,,RUE,DES PRASLES,41100,SELOMMES,,,41243,,,,,,,,,,,,,,,,,,,1993-12-31,F,,,,,01.1A,NAF1993,N,1.190517,47.757697,0.95,housenumber,2 Rue des Prasles 41100 Selommes,41243_0095_00002,G,2 RUE DES PRASLES,
332297993,00013,33229799300013,O,1985-04-03,NN,,,2006-10-27T02:19:20,true,6,,8,,RUE,DU TERTRE,41100,SELOMMES,,,41243,,,,,,,,,,,,,,,,,,,2004-06-30,F,,,,,01.1A,NAFRev1,N,1.190667,47.758989,0.94,housenumber,8 Rue du Tertre 41100 Selommes,41243_0115_00008,G,8 RUE DU TERTRE,
332474741,00011,33247474100011,O,,NN,,,,true,1,,,,LD,LE BOUCHET,41100,SELOMMES,,,41243,,,,,,,,,,,,,,,,,,,1992-12-31,F,,,,,01.1A,NAF1993,N,1.224938,47.773085,0.93,street,Hameau le Bouchet 41100 Selommes,41243_0xpj7p,G,HAMEAU LE BOUCHET,
332474758,00015,33247475800015,O,,,,,,true,1,,,,LD,LE CHIQUET,41100,SELOMMES,,,41243,,,,,,,,,,,,,,,,,,,1996-04-30,F,,,,,01.1A,NAF1993,N,1.23972,47.757975,0.5,street,Le Chatelet 41100 Selommes,41243_3p7dbt,G,LE CHATELET,
334678562,00037,33467856200037,O,2002-11-01,NN,,,,false,4,,4,,RUE,DU BOURG NEUF,41100,SELOMMES,,,41243,,,,,,,,,,,,,,,,,,,2003-01-01,F,,,,,85.1G,NAF1993,N,1.191995,47.752969,0.95,housenumber,4 Rue du Bourg-Neuf 41100 Selommes,41243_0020_00004,G,4 RUE DU BOURG NEUF,
334678562,00045,33467856200045,O,2003-01-01,NN,,,2009-01-20T09:28:20,false,2,,3,,RUE,DE L'EGLISE,41100,SELOMMES,,,41243,,,,,,,,,,,,,,,,,,,2003-06-20,F,,,,,,,,1.193718,47.756433,0.94,housenumber,3 Rue de l’Eglise 41100 Selommes,41243_0045_00003,G,3 RUE DE L EGLISE,
334804416,00017,33480441600017,O,,,,,,true,1,,,,,LES PRES DE L'ARCHE,41100,SELOMMES,,,41243,,,,,,,,,,,,,,,,,,,1989-07-01,F,,,,,76.00,NAP,N,1.196745,47.752061,0.33,street,Residence de la Haute Pierre 41100 Selommes,41243_A050,G,RESIDENCE DE LA HAUTE PIERRE,
334861614,00017,33486161400017,O,1986-02-08,NN,,,2017-10-26T08:56:42,false,3,,,,LD,LES PRES DE L ARCHE,41100,SELOMMES,,,41243,,,,,,,,,,,,,,,,,,,2008-01-01,A,,,,,68.20B,NAFRev2,N,1.196745,47.752061,0.33,street,Residence de la Haute Pierre 41100 Selommes,41243_A050,G,RESIDENCE DE LA HAUTE PIERRE,
335218855,00013,33521885500013,O,,,,,,true,1,,,,LD,LES PRES DE L ARCHE,41100,SELOMMES,,,41243,,,,,,,,,,,,,,,,,,,1989-07-01,F,,,,,21.07,NAP,N,1.196745,47.752061,0.33,street,Residence de la Haute Pierre 41100 Selommes,41243_A050,G,RESIDENCE DE LA HAUTE PIERRE,
337537518,00025,33753751800025,O,1987-12-31,NN,,,2017-11-22T08:24:41,false,3,,,,,GRANDE RUE,41100,SELOMMES,,,41243,,,,,,,,,,,,,,,,,,,2007-06-30,F,,,,,70.2C,NAFRev1,N,1.192211,47.756495,0.95,street,Grande Rue 41100 Selommes,41243_0060,G,GRANDE RUE,
337997381,00013,33799738100013,O,,NN,,,,true,1,,2,A,RUE,DU CHATEAU,41100,SELOMMES,,,41243,,,,,,,,,,,,,,,,,,,1993-08-31,F,,,,,01.1A,NAF1993,N,1.193195,47.759942,0.81,street,Rue du Chateau 41100 Selommes,41243_0025,G,RUE DU CHATEAU,
337997464,00017,33799746400017,O,1968-11-01,NN,,,,true,1,,,,LD,LE BOUCHER,41100,SELOMMES,,,41243,,,,,,,,,,,,,,,,,,,2002-11-30,F,,,,,01.1A,NAF1993,N,1.224938,47.773085,0.76,street,Hameau le Bouchet 41100 Selommes,41243_0xpj7p,G,HAMEAU LE BOUCHET,
337998041,00012,33799804100012,O,1973-01-01,NN,,,2009-07-24T04:44:48,true,3,,,,LD,LE BOUCHET,41100,SELOMMES,,,41243,,,,,,,,,,,,,,,,,,,2006-08-31,F,,,,,01.1A,NAFRev1,N,1.224938,47.773085,0.93,street,Hameau le Bouchet 41100 Selommes,41243_0xpj7p,G,HAMEAU LE BOUCHET,
337998249,00011,33799824900011,O,1984-01-01,NN,,,2008-01-04T21:16:08,true,3,,,,LD,LE BOUCHET,41100,SELOMMES,,,41243,,,,,,,,,,,,,,,,,,,2008-01-01,A,,,,,01.11Z,NAFRev2,N,1.224938,47.773085,0.93,street,Hameau le Bouchet 41100 Selommes,41243_0xpj7p,G,HAMEAU LE BOUCHET,
337998496,00018,33799849600018,O,1979-11-01,NN,,,2016-01-12T00:12:20,true,3,,,,LD,MONTEAUX,41100,SELOMMES,,,41243,,,,,,,,,,,,,,,,,,,2008-01-01,A,,,,,01.11Z,NAFRev2,N,1.205209,47.768271,0.94,street,Monteaux 41100 Selommes,41243_vrj2h6,G,MONTEAUX,
337998660,00019,33799866000019,O,,,,,,true,1,,,,LD,VILLARCEAU,41100,SELOMMES,,,41243,,,,,,,,,,,,,,,,,,,1996-10-01,F,,,,,01.1A,NAF1993,N,1.177583,47.771369,0.95,street,Villarceau 41100 Selommes,41243_axn6lr,G,VILLARCEAU,
338078223,00025,33807822300025,O,1992-01-01,NN,,,2008-12-17T09:53:36,false,4,,,,,LA GRANDE NOUE,41100,SELOMMES,,,41243,,,,,,,,,,,,,,,,,,,2008-12-10,F,,,,,01.11Z,NAFRev2,N,1.192211,47.756495,0.54,street,Grande Rue 41100 Selommes,41243_0060,G,GRANDE RUE,
338081813,00010,33808181300010,O,,,,,,true,1,,,,LD,LE BOUCHET,41100,SELOMMES,,,41243,,,,,,,,,,,,,,,,,,,1994-05-31,F,,,,,01.1A,NAF1993,N,1.224938,47.773085,0.93,street,Hameau le Bouchet 41100 Selommes,41243_0xpj7p,G,HAMEAU LE BOUCHET,
338082076,00013,33808207600013,O,,NN,,,2007-01-18T09:22:15,true,1,,16,,RUE,DU CHATEAU,41100,SELOMMES,,,41243,,,,,,,,,,,,,,,,,,,1988-11-01,F,,,,,01.1A,NAF1993,N,1.193195,47.759942,0.95,housenumber,16 Rue du Chateau 41100 Selommes,41243_0025_00016,G,16 RUE DU CHATEAU,
338082241,00013,33808224100013,O,,NN,,,,true,1,,,,,,41100,SELOMMES,,,41243,,,,,,,,,,,,,,,,,,,1992-09-30,F,,,,,01.1A,NAF1993,N,,,0,,,,,,
338083215,00016,33808321500016,O,,,,,,true,1,,,,,VILLARCEAU,41100,SELOMMES,,,41243,,,,,,,,,,,,,,,,,,,1997-10-31,F,,,,,01.1A,NAF1993,N,1.177583,47.771369,0.95,street,Villarceau 41100 Selommes,41243_axn6lr,G,VILLARCEAU,
338083298,00012,33808329800012,O,,NN,,,,true,1,,,,,VILLARCEAU,41100,SELOMMES,,,41243,,,,,,,,,,,,,,,,,,,1990-11-01,F,,,,,01.00,NAP,N,1.177583,47.771369,0.95,street,Villarceau 41100 Selommes,41243_axn6lr,G,VILLARCEAU,
338083371,00017,33808337100017,O,,NN,,,,true,1,,1,,RUE,DU PARC,41100,SELOMMES,,,41243,,,,,,,,,,,,,,,,,,,1987-12-31,F,,,,,01.00,NAP,N,1.19455,47.755691,0.95,housenumber,1 Rue du Parc 41100 Selommes,41243_0090_00001,G,1 RUE DU PARC,
338083504,00013,33808350400013,O,1983-01-01,,,,2007-01-18T09:22:16,false,3,,,,,VILLECLECHE,41100,SELOMMES,,,41243,,,,,,,,,,,,,,,,,,,1998-04-30,F,,,,,01.1A,NAF1993,N,1.248161,47.772444,0.94,street,Villecleche 41100 Selommes,41243_ksrofk,G,VILLECLECHE,
338083561,00013,33808356100013,O,1950-01-01,NN,,,2022-08-06T03:54:40,true,5,,,,,LE BOUCHET,41100,SELOMMES,,,41243,,,,,,,,,,,,,,,,,,,2021-07-31,F,,,,,68.20B,NAFRev2,N,1.224938,47.773085,0.93,street,Hameau le Bouchet 41100 Selommes,41243_0xpj7p,G,HAMEAU LE BOUCHET,
338136013,00012,33813601300012,O,,NN,,,,true,1,,,,,LES ORMEAUX,41100,SELOMMES,,,41243,,,,,,,,,,,,,,,,,,,1992-08-18,F,,,,,01.1A,NAF1993,N,1.234128,47.768515,0.94,street,Les Ormeaux 41100 Selommes,41243_yf3jcp,G,LES ORMEAUX,
338136203,00019,33813620300019,O,,,,,2007-01-18T09:22:18,true,1,,17,,RUE,DU BOUT DES HAIES,41100,SELOMMES,,,41243,,,,,,,,,,,,,,,,,,,1989-12-11,F,,,,,01.1A,NAF1993,N,1.193525,47.754228,0.95,housenumber,17 Rue du Bout des Haies 41100 Selommes,41243_0022_00017,G,17 RUE DU BOUT DES HAIES,
338167588,00015,33816758800015,O,,NN,,,,true,1,,,,LD,BOUCHET,41100,SELOMMES,,,41243,,,,,,,,,,,,,,,,,,,1989-09-01,F,,,,,01.00,NAP,N,1.224938,47.773085,0.92,street,Hameau le Bouchet 41100 Selommes,41243_0xpj7p,G,HAMEAU LE BOUCHET,
338167729,00015,33816772900015,O,,,,,,true,1,,13,,RUE,DE BEAUCE,41100,SELOMMES,,,41243,,,,,,,,,,,,,,,,,,,1995-10-31,F,,,,,01.1A,NAF1993,N,1.195583,47.756202,0.95,housenumber,13 Rue de Beauce 41100 Selommes,41243_0010_00013,G,13 RUE DE BEAUCE,
338167844,00012,33816784400012,O,,NN,,,,true,1,,1,,RUE,ST BOUCHARD,41100,SELOMMES,,,41243,,,,,,,,,,,,,,,,,,,1991-12-01,F,,,,,01.00,NAP,N,1.193143,47.757776,0.85,housenumber,1 Rue Saint-Bouchard 41100 Selommes,41243_0110_00001,G,1 RUE SAINT BOUCHARD,
338167901,00010,33816790100010,O,1980-09-01,NN,,,2008-01-04T21:17:39,true,3,,9,,RUE,DE BEAUCE,41100,SELOMMES,,,41243,,,,,,,,,,,,,,,,,,,2007-06-30,F,,,,,01.1A,NAFRev1,N,1.194152,47.75593,0.95,housenumber,9 Rue de Beauce 41100 Selommes,41243_0010_00009,G,9 RUE DE BEAUCE,
338167984,00016,33816798400016,O,1986-06-18,NN,,,2014-07-08T00:42:00,true,3,,,,LD,VILLARCEAU,41100,SELOMMES,,,41243,,,,,,,,,,,,,,,,,,,2008-01-01,A,,,,,68.20B,NAFRev2,N,1.177583,47.771369,0.95,street,Villarceau 41100 Selommes,41243_axn6lr,G,VILLARCEAU,
338209430,00010,33820943000010,O,,NN,,,,true,1,,,,,LES PRES DE L'ARCHE,41100,SELOMMES,,,41243,,,,,,,,,,,,,,,,,,,1989-12-31,F,,,,,59.08,NAP,N,1.196745,47.752061,0.33,street,Residence de la Haute Pierre 41100 Selommes,41243_A050,G,RESIDENCE DE LA HAUTE PIERRE,
338365190,00010,33836519000010,O,1981-11-01,NN,,,2021-02-23T10:54:56,true,4,,,,,VILLARCEAU,41100,SELOMMES,,,41243,,,,,,,,,,,,,,,,,,,2014-02-28,A,,,,,68.20B,NAFRev2,N,1.177583,47.771369,0.95,street,Villarceau 41100 Selommes,41243_axn6lr,G,VILLARCEAU,
338365265,00010,33836526500010,O,,NN,,,,true,1,,12,,RUE,DE BEAUCE,41100,SELOMMES,,,41243,,,,,,,,,,,,,,,,,,,1989-12-20,F,,,,,01.00,NAP,N,1.194705,47.756199,0.95,housenumber,12 Rue de Beauce 41100 Selommes,41243_0010_00012,G,12 RUE DE BEAUCE,
338365364,00011,33836536400011,O,,NN,,,,true,1,,3,,RUE,DE BEL AIR,41100,SELOMMES,,,41243,,,,,,,,,,,,,,,,,,,1987-11-01,F,,,,,01.1A,NAF1993,N,1.189672,47.754954,0.95,housenumber,3 Rue de Bel Air 41100 Selommes,41243_0015_00003,G,3 RUE DE BEL AIR,
338365406,00010,33836540600010,O,1983-09-01,NN,,,2011-11-10T08:50:49,true,4,,,,,SCHY,41100,SELOMMES,,,41243,,,,,,,,,,,,,,,,,,,2011-08-31,F,,,,,01.11Z,NAFRev2,N,1.227098,47.741944,0.91,street,Hameau de Schy 41100 Selommes,41243_zfz92n,G,HAMEAU DE SCHY,
338365471,00014,33836547100014,O,,NN,,,,true,1,,,,,VILLARCEAU,41100,SELOMMES,,,41243,,,,,,,,,,,,,,,,,,,1992-11-01,F,,,,,01.3Z,NAF1993,N,1.177583,47.771369,0.95,street,Villarceau 41100 Selommes,41243_axn6lr,G,VILLARCEAU,
338365489,00016,33836548900016,O,1971-11-01,NN,,,2008-01-04T21:19:48,true,3,,,,,VILLARCEAU,41100,SELOMMES,,,41243,,,,,,,,,,,,,,,,,,,2008-01-01,A,,,,,01.11Z,NAFRev2,N,1.177583,47.771369,0.95,street,Villarceau 41100 Selommes,41243_axn6lr,G,VILLARCEAU,