siren,nic,siret,statutDiffusionEtablissement,dateCreationEtablissement,trancheEffectifsEtablissement,anneeEffectifsEtablissement,activitePrincipaleRegistreMetiersEtablissement,dateDernierTraitementEtablissement,etablissementSiege,nombrePeriodesEtablissement,complementAdresseEtablissement,numeroVoieEtablissement,indiceRepetitionEtablissement,typeVoieEtablissement,libelleVoieEtablissement,codePostalEtablissement,libelleCommuneEtablissement,libelleCommuneEtrangerEtablissement,distributionSpecialeEtablissement,codeCommuneEtablissement,codeCedexEtablissement,libelleCedexEtablissement,codePaysEtrangerEtablissement,libellePaysEtrangerEtablissement,complementAdresse2Etablissement,numeroVoie2Etablissement,indiceRepetition2Etablissement,typeVoie2Etablissement,libelleVoie2Etablissement,codePostal2Etablissement,libelleCommune2Etablissement,libelleCommuneEtranger2Etablissement,distributionSpeciale2Etablissement,codeCommune2Etablissement,codeCedex2Etablissement,libelleCedex2Etablissement,codePaysEtranger2Etablissement,libellePaysEtranger2Etablissement,dateDebut,etatAdministratifEtablissement,enseigne1Etablissement,enseigne2Etablissement,enseigne3Etablissement,denominationUsuelleEtablissement,activitePrincipaleEtablissement,nomenclatureActivitePrincipaleEtablissement,caractereEmployeurEtablissement,longitude,latitude,geo_score,geo_type,geo_adresse,geo_id,geo_ligne,geo_l4,geo_l5
215105628,00014,21510562800014,O,1983-03-01,02,2020,,2022-08-29T09:07:35,true,3,,,,,,51330,VERNANCOURT,,,51608,,,,,,,,,,,,,,,,,,,2008-01-01,A,MAIRIE,,,,84.11Z,NAFRev2,N,,,0,,,,,,
215105628,00022,21510562800022,O,1994-12-25,NN,,,2008-01-04T18:35:37,false,2,MAIRIE,,,,,51330,VERNANCOURT,,,51608,,,,,,,,,,,,,,,,,,,2008-01-01,A,SERVICE DES EAUX DE VERNANCOURT,,,,36.00Z,NAFRev2,N,,,0,,,,,,
265105171,00010,26510517100010,O,1983-03-01,NN,,,2010-06-26T03:11:19,true,3,,,,,,51330,VERNANCOURT,,,51608,,,,,,,,,,,,,,,,,,,2008-01-01,A,CCAS,,,,88.99B,NAFRev2,N,,,0,,,,,,
295102479,00017,29510247900017,O,1983-08-10,NN,,,2017-05-04T01:42:05,true,4,MAIRIE,,,,,51330,VERNANCOURT,,,51608,,,,,,,,,,,,,,,,,,,2013-03-24,A,,,,,42.99Z,NAFRev2,O,,,0,,,,,,
311037204,00014,31103720400014,O,1900-01-01,NN,,,,false,3,,,,,,51330,VERNANCOURT,,,51608,,,,,,,,,,,,,,,,,,,1993-05-17,F,,,,,,,N,,,0,,,,,,
313647166,00013,31364716600013,O,,NN,,,,true,1,,,,,,51330,VERNANCOURT,,,51608,,,,,,,,,,,,,,,,,,,1987-12-25,F,,,,,01.80,NAP,N,,,0,,,,,,
324198506,00036,32419850600036,O,1994-07-11,NN,,,2015-05-14T05:42:19,true,5,,,,RUE,GRANDE RUE,51330,VERNANCOURT,,,51608,,,,,,,,,,,,,,,,,,,2013-01-31,F,,,,,43.91B,NAFRev2,O,4.821424,48.858022,0.87,street,Grande Rue 51330 Vernancourt,51608_0041,G,GRANDE RUE,
328266143,00010,32826614300010,O,,NN,,,,true,1,,,,,,51330,VERNANCOURT,,,51608,,,,,,,,,,,,,,,,,,,1993-12-31,F,,,,,01.1A,NAF1993,N,,,0,,,,,,
334930534,00014,33493053400014,O,1985-01-01,NN,,,2006-10-27T02:41:48,true,3,,,,,,51330,VERNANCOURT,,,51608,,,,,,,,,,,,,,,,,,,2004-12-31,F,,,,,01.2A,NAFRev1,N,,,0,,,,,,
339149999,00015,33914999900015,O,,NN,,,2007-01-18T09:22:46,true,1,,,,,,51330,VERNANCOURT,,,51608,,,,,,,,,,,,,,,,,,,1987-08-01,F,,,,,01.3Z,NAF1993,N,,,0,,,,,,
339864100,00021,33986410000021,O,1900-01-01,NN,,,2015-05-20T07:56:18,false,3,,,,RTE,,51330,VERNANCOURT,,,51608,,,,,,,,,,,,,,,,,,,1989-12-25,F,,,,,62.46,NAP,N,3.1206907,45.7709538,0.88,poi.industrial,RTE (Zone industrielle) Clermont-Ferrand,https://osm.org/way/43852862,G,,
342240173,00019,34224017300019,O,1987-09-02,01,2020,,2022-08-29T09:27:30,true,3,,,,,,51330,VERNANCOURT,,,51608,,,,,,,,,,,,,,,,,,,2008-01-01,A,,,,,01.42Z,NAFRev2,N,,,0,,,,,,
343886420,00011,34388642000011,O,,NN,,,2007-01-18T09:25:12,true,1,,,,,,51330,VERNANCOURT,,,51608,,,,,,,,,,,,,,,,,,,1989-06-01,F,,,,,01.3Z,NAF1993,N,,,0,,,,,,
344026422,00016,34402642200016,O,1978-02-01,NN,,,2007-01-18T09:25:17,true,3,,,,,,51330,VERNANCOURT,,,51608,,,,,,,,,,,,,,,,,,,1998-12-25,F,,,,,01.1A,NAF1993,N,,,0,,,,,,
349441048,00015,34944104800015,O,,NN,,,,true,1,,,,,,51330,VERNANCOURT,,,51608,,,,,,,,,,,,,,,,,,,1991-03-31,F,,,,,28.5D,NAF1993,N,,,0,,,,,,
350628210,00014,35062821000014,O,1989-04-01,NN,,,2007-01-18T09:27:16,true,3,,,,,,51330,VERNANCOURT,,,51608,,,,,,,,,,,,,,,,,,,1998-12-25,F,,,,,01.3Z,NAF1993,N,,,0,,,,,,
351241377,00016,35124137700016,O,1989-06-01,,,,2018-12-21T19:36:47,false,4,,,,,,51330,VERNANCOURT,,,51608,,,,,,,,,,,,,,,,,,,1999-12-01,F,,,,,01.1A,NAF1993,N,,,0,,,,,,
351241377,00024,35124137700024,O,1999-12-01,NN,,,2019-01-21T19:35:41,true,3,,5,,,GRANDE RUE,51330,VERNANCOURT,,,51608,,,,,,,,,,,,,,,,,,,2008-01-01,A,,,,,01.42Z,NAFRev2,N,4.821815,48.85791,0.94,housenumber,5 Grande Rue 51330 Vernancourt,51608_0041_00005,G,5 GRANDE RUE,
393817382,00012,39381738200012,O,1994-01-01,NN,,,,true,4,,,,,,51330,VERNANCOURT,,,51608,,,,,,,,,,,,,,,,,,,1997-12-31,F,,,,,01.3Z,NAF1993,N,,,0,,,,,,
393996145,00016,39399614500016,O,1994-02-01,NN,,,2020-10-09T09:52:17,false,4,CHEZ M. JEAN DE GROOTE,,,,,51330,VERNANCOURT,,,51608,,,,,,,,,,,,,,,,,,,2020-08-31,F,,,,,01.11Z,NAFRev2,N,,,0,,,,,,
393996145,00024,39399614500024,O,2020-08-31,,,,2021-02-23T11:19:46,true,1,,4,,RUE,DE L EGLISE,51330,VERNANCOURT,,,51608,,,,,,,,,,,,,,,,,,,2020-08-31,A,,,,,01.11Z,NAFRev2,N,4.823723,48.857559,0.93,housenumber,4 Rue de l’Eglise 51330 Vernancourt,51608_0025_00004,G,4 RUE DE L EGLISE,
403252927,00013,40325292700013,O,1995-12-01,NN,,,2012-04-20T08:46:19,true,4,,,,,,51330,VERNANCOURT,,,51608,,,,,,,,,,,,,,,,,,,2011-08-02,F,,,,,68.20B,NAFRev2,N,,,0,,,,,,
411347958,00018,41134795800018,O,1989-06-01,NN,,,2008-01-04T21:57:34,true,3,,,,,,51330,VERNANCOURT,,,51608,,,,,,,,,,,,,,,,,,,2008-01-01,A,,,,,01.11Z,NAFRev2,N,,,0,,,,,,
418503926,00010,41850392600010,O,1997-01-01,NN,,,2007-01-18T09:40:21,true,3,,,,,,51330,VERNANCOURT,,,51608,,,,,,,,,,,,,,,,,,,2000-12-31,F,,,,,01.1A,NAF1993,N,,,0,,,,,,
423475862,00029,42347586200029,O,2000-03-07,NN,,,2006-11-25T16:29:25,false,3,,3,,RUE,GRANDE RUE,51330,VERNANCOURT,,,51608,,,,,,,,,,,,,,,,,,,2005-01-01,F,,,,,45.3A,NAFRev1,O,4.822385,48.857638,0.82,housenumber,3 Grande Rue 51330 Vernancourt,51608_0041_00003,G,3 GRANDE RUE,
442019899,00016,44201989900016,O,2002-05-01,NN,,4312BA,2017-11-02T16:08:34,true,3,,26,,,GRANDE RUE,51330,VERNANCOURT,,,51608,,,,,,,,,,,,,,,,,,,2008-01-01,A,,,,,43.12A,NAFRev2,N,4.819803,48.858649,0.94,housenumber,26 Grande Rue 51330 Vernancourt,51608_0041_00026,G,26 GRANDE RUE,
480703891,00014,48070389100014,O,2005-01-01,,,,2021-02-23T13:43:56,true,3,,1,,,GRANDE RUE,51330,VERNANCOURT,,,51608,,,,,,,,,,,,,,,,,,,2009-04-01,A,,,,,68.20B,NAFRev2,N,4.822679,48.857485,0.94,housenumber,1 Grande Rue 51330 Vernancourt,51608_0041_00001,G,1 GRANDE RUE,
488150236,00013,48815023600013,O,2006-01-01,,,,2008-01-05T02:27:49,true,2,,26,,,GRANDE RUE,51330,VERNANCOURT,,,51608,,,,,,,,,,,,,,,,,,,2008-01-01,A,,,,,01.42Z,NAFRev2,N,4.819803,48.858649,0.94,housenumber,26 Grande Rue 51330 Vernancourt,51608_0041_00026,G,26 GRANDE RUE,
501258669,00016,50125866900016,O,2007-11-20,,,,2016-10-25T11:14:20,false,4,3 GRANDE-RUE,3,,GR,GRANDE RUE,51330,VERNANCOURT,,,51608,,,,,,,,,,,,,,,,,,,2016-09-27,F,,,,,66.30Z,NAFRev2,N,4.822385,48.857638,0.83,housenumber,3 Grande Rue 51330 Vernancourt,51608_0041_00003,G,3 GRANDE RUE,
503459158,00013,50345915800013,O,2008-03-14,,,,2016-12-01T05:16:46,true,2,3 GRANDE-RUE,3,,,GRAND RUE,51330,VERNANCOURT,,,51608,,,,,,,,,,,,,,,,,,,2016-10-01,F,,,,,68.20B,NAFRev2,N,4.822385,48.857638,0.79,housenumber,3 Grande Rue 51330 Vernancourt,51608_0041_00003,G,3 GRANDE RUE,
511439960,00010,51143996000010,O,2009-04-01,,,,2009-03-29T05:52:53,true,1,,1,,,GRANDE RUE,51330,VERNANCOURT,,,51608,,,,,,,,,,,,,,,,,,,2009-04-01,A,,,,,01.42Z,NAFRev2,N,4.822679,48.857485,0.94,housenumber,1 Grande Rue 51330 Vernancourt,51608_0041_00001,G,1 GRANDE RUE,
511439960,00028,51143996000028,O,2022-05-20,,,,2023-08-25T07:55:27,false,1,,,,RUE,DE VANAULT,51330,VERNANCOURT,,,51608,,,,,,,,,,,,,,,,,,,2022-05-20,A,,,,,35.11Z,NAFRev2,N,4.822445,48.856545,0.93,street,Rue de Vanault 51330 Vernancourt,51608_ixzvwt,G,RUE DE VANAULT,
522923747,00011,52292374700011,O,2010-05-11,NN,,,2021-10-27T08:30:30,true,1,,,,RTE,DE VANAULT LES DAMES,51330,VERNANCOURT,,,51608,,,,,,,,,,,,,,,,,,,2010-05-11,A,,,,,01.42Z,NAFRev2,N,4.822445,48.856545,0.52,street,Rue de Vanault 51330 Vernancourt,51608_ixzvwt,G,RUE DE VANAULT,
530333368,00013,53033336800013,O,2010-10-01,,,,2011-02-15T10:39:44,true,1,,6,,RUE,DU CHATEAU,51330,VERNANCOURT,,,51608,,,,,,,,,,,,,,,,,,,2010-10-01,A,,,,,94.99Z,NAFRev2,N,4.825171,48.857076,0.94,housenumber,6 Rue du Chateau 51330 Vernancourt,51608_0010_00006,G,6 RUE DU CHATEAU,
538474115,00010,53847411500010,O,2011-12-14,,,4391BZ,2015-06-18T03:43:40,true,2,,1,,RUE,DE L'EGLISE,51330,VERNANCOURT,,,51608,,,,,,,,,,,,,,,,,,,2013-12-14,F,,,,LE TOITURIER,43.91B,NAFRev2,N,4.823376,48.857404,0.93,housenumber,1 Rue de l’Eglise 51330 Vernancourt,51608_0025_00001,G,1 RUE DE L EGLISE,
736610213,00018,73661021300018,O,,,,,,true,1,,,,RUE,DU CHATEAU,51330,VERNANCOURT,,,51608,,,,,,,,,,,,,,,,,,,1999-09-05,F,,,,,55.71,NAP,N,4.824834,48.857085,0.94,street,Rue du Chateau 51330 Vernancourt,51608_0010,G,RUE DU CHATEAU,
737310128,00019,73731012800019,O,1973-01-01,NN,,,2006-11-03T00:57:27,true,4,,,,,,51330,VERNANCOURT,,,51608,,,,,,,,,,,,,,,,,,,2004-01-31,F,,,,,70.2B,NAFRev1,N,,,0,,,,,,
737310383,00010,73731038300010,O,,,,,2021-05-19T03:46:53,true,1,,,,,,51330,VERNANCOURT,,,51608,,,,,,,,,,,,,,,,,,,1984-12-25,F,,,,,55.73,NAP,N,,,0,,,,,,
737310417,00016,73731041700016,O,,NN,,,2021-05-19T03:46:53,true,1,,,,RUE,DE L EGLISE,51330,VERNANCOURT,,,51608,,,,,,,,,,,,,,,,,,,1990-04-11,F,,,,,22.02,NAP,N,4.82355,48.857461,0.93,street,Rue de l’Eglise 51330 Vernancourt,51608_0025,G,RUE DE L EGLISE,
793894395,00011,79389439500011,O,2013-07-01,,,,2021-06-03T11:39:09,true,1,,6,,,GRANDE RUE,51330,VERNANCOURT,,,51608,,,,,,,,,,,,,,,,,,,2013-07-01,A,,,,,47.89Z,NAFRev2,N,4.822756,48.857546,0.94,housenumber,6 Grande Rue 51330 Vernancourt,51608_0041_00006,G,6 GRANDE RUE,
812255131,00011,81225513100011,O,2015-04-04,,,,2015-06-26T14:35:26,true,1,,32,,,GRANDE RUE,51330,VERNANCOURT,,,51608,,,,,,,,,,,,,,,,,,,2015-04-04,A,,,,,94.99Z,NAFRev2,N,4.817804,48.859129,0.94,housenumber,32 Grande Rue 51330 Vernancourt,51608_0041_00032,G,32 GRANDE RUE,
824937957,00010,82493795700010,O,2017-01-01,,,,2017-02-21T11:34:27,true,1,,26,,,GRANDE RUE,51330,VERNANCOURT,,,51608,,,,,,,,,,,,,,,,,,,2017-01-01,A,,,,,01.42Z,NAFRev2,N,4.819803,48.858649,0.94,housenumber,26 Grande Rue 51330 Vernancourt,51608_0041_00026,G,26 GRANDE RUE,
830268504,00016,83026850400016,O,2017-05-25,,,,2017-06-15T07:22:12,true,1,,32,,,GRANDE RUE,51330,VERNANCOURT,,,51608,,,,,,,,,,,,,,,,,,,2017-05-25,A,,,,MES ANNEES VINTAGE,47.91B,NAFRev2,N,4.817804,48.859129,0.94,housenumber,32 Grande Rue 51330 Vernancourt,51608_0041_00032,G,32 GRANDE RUE,
844721738,00012,84472173800012,O,2019-01-01,,,,2019-06-29T03:37:33,true,1,,4,,RUE,GRANDE RUE,51330,VERNANCOURT,,,51608,,,,,,,,,,,,,,,,,,,2019-01-01,A,,,,,01.50Z,NAFRev2,N,4.823044,48.857395,0.82,housenumber,4 Grande Rue 51330 Vernancourt,51608_0041_00004,G,4 GRANDE RUE,
891133704,00017,89113370400017,O,2018-10-25,,,,2020-11-19T12:37:52,true,1,,3,,RUE,DU TILLEUL,51330,VERNANCOURT,,,51608,,,,,,,,,,,,,,,,,,,2018-10-25,A,,,,,02.10Z,NAFRev2,N,4.824918,48.85618,0.93,housenumber,3 Rue du Tilleul 51330 Vernancourt,51608_0070_00003,G,3 RUE DU TILLEUL,
893455055,00010,89345505500010,O,2019-01-01,,,,2021-01-29T03:43:35,true,1,,,,,LE VILLAGE,51330,VERNANCOURT,,,51608,,,,,,,,,,,,,,,,,,,2019-01-01,A,,,,,02.10Z,NAFRev2,N,2.2950702,48.9311749,0.9,poi.bar,bar le village Gennevilliers,https://osm.org/node/3287755128,G,,
953562592,00014,95356259200014,O,2023-06-14,,,,2023-07-01T13:30:29,true,1,,2,,RUE,DE VANAULT,51330,VERNANCOURT,,,51608,,,,,,,,,,,,,,,,,,,2023-06-14,A,,,,LA PERLERIE D'ISA,32.13Z,NAFRev2,N,4.82306,48.857182,0.93,housenumber,2 Rue de Vanault 51330 Vernancourt,51608_ixzvwt_00002,G,2 RUE DE VANAULT,
953613221,00019,95361322100019,O,2023-06-02,,,,2023-06-19T14:41:31,true,1,,2,B,RUE,DE L EGLISE,51330,VERNANCOURT,,,51608,,,,,,,,,,,,,,,,,,,2023-06-02,A,,,,,35.11Z,NAFRev2,N,4.823582,48.857407,0.84,housenumber,2bis Rue de l’Eglise 51330 Vernancourt,51608_0025_00002_bis,G,2BIS RUE DE L EGLISE,
