siren,nic,siret,statutDiffusionEtablissement,dateCreationEtablissement,trancheEffectifsEtablissement,anneeEffectifsEtablissement,activitePrincipaleRegistreMetiersEtablissement,dateDernierTraitementEtablissement,etablissementSiege,nombrePeriodesEtablissement,complementAdresseEtablissement,numeroVoieEtablissement,indiceRepetitionEtablissement,typeVoieEtablissement,libelleVoieEtablissement,codePostalEtablissement,libelleCommuneEtablissement,libelleCommuneEtrangerEtablissement,distributionSpecialeEtablissement,codeCommuneEtablissement,codeCedexEtablissement,libelleCedexEtablissement,codePaysEtrangerEtablissement,libellePaysEtrangerEtablissement,complementAdresse2Etablissement,numeroVoie2Etablissement,indiceRepetition2Etablissement,typeVoie2Etablissement,libelleVoie2Etablissement,codePostal2Etablissement,libelleCommune2Etablissement,libelleCommuneEtranger2Etablissement,distributionSpeciale2Etablissement,codeCommune2Etablissement,codeCedex2Etablissement,libelleCedex2Etablissement,codePaysEtranger2Etablissement,libellePaysEtranger2Etablissement,dateDebut,etatAdministratifEtablissement,enseigne1Etablissement,enseigne2Etablissement,enseigne3Etablissement,denominationUsuelleEtablissement,activitePrincipaleEtablissement,nomenclatureActivitePrincipaleEtablissement,caractereEmployeurEtablissement,longitude,latitude,geo_score,geo_type,geo_adresse,geo_id,geo_ligne,geo_l4,geo_l5
046240149,00354,04624014900354,O,1983-10-01,NN,,,2008-01-04T18:06:21,false,3,,6,,RUE,DE L'EGLISE,62490,TORTEQUESNE,,,62825,,,,,,,,,,,,,,,,,,,2008-01-01,A,,,,,68.20B,NAFRev2,N,3.039815,50.288955,0.6,housenumber,6 Rue de Lecluse 62490 Tortequesne,62825_0082_00006,G,6 RUE DE LECLUSE,
216208256,00018,21620825600018,O,1983-03-01,11,2020,,2022-08-29T09:08:15,true,4,,,,RUE,DE BELLONNE,62490,TORTEQUESNE,,,62825,,,,,,,,,,,,,,,,,,,2008-01-01,A,MAIRIE,,,,84.11Z,NAFRev2,O,3.040155,50.290701,0.95,street,Rue de Bellonne 62490 Tortequesne,62825_0020,G,RUE DE BELLONNE,
216208256,00026,21620825600026,O,1983-03-16,NN,,,2008-01-04T18:38:38,false,3,MAIRIE,,,RUE,DE BELLONNE,62490,TORTEQUESNE,,,62825,,,,,,,,,,,,,,,,,,,2008-01-01,A,CENTRE AERE MUNICIPAL,,,,93.29Z,NAFRev2,N,3.040155,50.290701,0.95,street,Rue de Bellonne 62490 Tortequesne,62825_0020,G,RUE DE BELLONNE,
216208256,00042,21620825600042,O,1983-12-21,02,2020,,2022-08-29T09:08:15,false,3,,,,RUE,DE BELLONNE,62490,TORTEQUESNE,,,62825,,,,,,,,,,,,,,,,,,,2008-01-01,A,ECOLE PRIMAIRE LEON WAYMEL,,,,85.20Z,NAFRev2,N,3.040155,50.290701,0.95,street,Rue de Bellonne 62490 Tortequesne,62825_0020,G,RUE DE BELLONNE,
216208256,00059,21620825600059,O,1984-01-27,NN,,,,false,4,MAIRIE,,,,,62490,TORTEQUESNE,,,62825,,,,,,,,,,,,,,,,,,,1997-12-31,F,CAISSE DES ECOLES TORTEQUESNE,,,,85.3K,NAF1993,N,3.040364,50.289472,0.91,street,Place de la Mairie 62490 Tortequesne,62825_0101,D,PLACE DE LA MAIRIE,
216208256,00067,21620825600067,O,1995-12-25,NN,,,2006-10-26T23:41:20,false,2,MAIRIE,,,RUE,DE BELLONNE,62490,TORTEQUESNE,,,62825,,,,,,,,,,,,,,,,,,,2006-07-21,F,SERVICE D'ASSAINISSEMENT,,,,90.0A,NAFRev1,N,3.040155,50.290701,0.95,street,Rue de Bellonne 62490 Tortequesne,62825_0020,G,RUE DE BELLONNE,
216208256,00075,21620825600075,O,1995-10-03,NN,,,2008-01-04T18:38:38,false,3,MONT BEDU,,,RUE,DU 8 MAI 1945,62490,TORTEQUESNE,,,62825,,,,,,,,,,,,,,,,,,,2008-01-01,A,CAMPING MUNICIPAL LA SABLIERE,,,,55.30Z,NAFRev2,N,3.04509,50.290209,0.95,street,Rue du 8 Mai 1945 62490 Tortequesne,62825_0083,G,RUE DU 8 MAI 1945,
216208256,00083,21620825600083,O,2004-01-13,NN,,,2007-08-16T17:03:00,false,3,MAIRIE,,,RUE,DE BELLOUNE,62490,TORTEQUESNE,,,62825,,,,,,,,,,,,,,,,,,,2007-08-09,F,LOTISSEMENT AU CHEMIN DE CROIX,,,,70.1C,NAFRev1,N,3.040155,50.290701,0.78,street,Rue de Bellonne 62490 Tortequesne,62825_0020,G,RUE DE BELLONNE,
266208255,00015,26620825500015,O,1983-03-01,NN,,,2022-04-20T14:26:15,true,4,MAIRIE,,,,,62490,TORTEQUESNE,,,62825,,,,,,,,,,,,,,,,,,,2018-01-01,F,CCAS,,,,88.99B,NAFRev2,N,3.040364,50.289472,0.91,street,Place de la Mairie 62490 Tortequesne,62825_0101,D,PLACE DE LA MAIRIE,
266210061,00013,26621006100013,O,1994-03-15,NN,,,2008-01-04T19:01:51,true,4,MAIRIE,,,RUE,DE BELLONNE,62490,TORTEQUESNE,,,62825,,,,,,,,,,,,,,,,,,,2008-01-01,A,CDE,,,,88.99B,NAFRev2,N,3.040155,50.290701,0.95,street,Rue de Bellonne 62490 Tortequesne,62825_0020,G,RUE DE BELLONNE,
296200785,00016,29620078500016,O,1983-12-19,01,2020,,2022-08-29T09:10:57,true,4,MAIRIE,,,PL,DE LA MAIRIE,62490,TORTEQUESNE,,,62825,,,,,,,,,,,,,,,,,,,2008-02-17,A,,,,,42.99Z,NAFRev2,O,3.040364,50.289472,0.82,street,Place de la Mairie 62490 Tortequesne,62825_0101,G,PLACE DE LA MAIRIE,
307665497,00029,30766549700029,O,2013-09-30,,,,2014-05-06T08:03:55,true,1,,,,,LE MARAIS DE DURY,62490,TORTEQUESNE,,,62825,,,,,,,,,,,,,,,,,,,2013-09-30,A,,,,,02.10Z,NAFRev2,N,3.046079,50.284634,0.63,street,Le Marais du Pont Adon 62490 Tortequesne,62825_B013,G,LE MARAIS DU PONT ADON,
313364507,00019,31336450700019,O,,NN,,,,true,1,,,,RUE,DE DOUAI,62490,TORTEQUESNE,,,62825,,,,,,,,,,,,,,,,,,,1992-03-04,F,,,,,55.4B,NAF1993,N,3.043088,50.290344,0.95,street,Rue de Douai 62490 Tortequesne,62825_0080,G,RUE DE DOUAI,
318955127,00010,31895512700010,O,,NN,,,,true,1,,2,,RUE,DU CENTRE,62490,TORTEQUESNE,,,62825,,,,,,,,,,,,,,,,,,,,F,,,,,64.11,NAP,N,3.039255,50.289509,0.95,housenumber,2 Rue du Centre 62490 Tortequesne,62825_0060_00002,G,2 RUE DU CENTRE,
320644123,00012,32064412300012,O,1900-01-01,NN,,,2011-04-28T00:18:35,false,1,,2,,RUE,DE L EGLISE,62490,TORTEQUESNE,,,62825,,,,,,,,,,,,,,,,,,,1900-01-01,F,,,,,67.04,NAP,,3.039906,50.289247,0.6,housenumber,2 Rue de Lecluse 62490 Tortequesne,62825_0082_00002,G,2 RUE DE LECLUSE,
325682227,00013,32568222700013,O,,NN,,,,true,1,,6,,RUE,DE L EGLISE,62490,TORTEQUESNE,,,62825,,,,,,,,,,,,,,,,,,,2002-01-24,F,,,,,67.04,NAP,N,3.039815,50.288955,0.6,housenumber,6 Rue de Lecluse 62490 Tortequesne,62825_0082_00006,G,6 RUE DE LECLUSE,
330343542,00016,33034354200016,O,,NN,,,,true,1,,6,,RUE,DE L EGLISE,62490,TORTEQUESNE,,,62825,,,,,,,,,,,,,,,,,,,1989-12-25,F,,,,,67.04,NAP,N,3.039815,50.288955,0.6,housenumber,6 Rue de Lecluse 62490 Tortequesne,62825_0082_00006,G,6 RUE DE LECLUSE,
331337436,00017,33133743600017,O,1984-12-12,01,2020,,2023-05-04T03:42:43,true,5,,24,,RUE,DE L'ECLUSE,62490,TORTEQUESNE,,,62825,,,,,,,,,,,,,,,,,,,2012-12-31,A,,,,,01.13Z,NAFRev2,O,3.03961,50.288126,0.81,housenumber,24 Rue de Lecluse 62490 Tortequesne,62825_0082_00024,G,24 RUE DE LECLUSE,
334253846,00037,33425384600037,O,2006-02-22,,,,2006-11-25T10:25:26,true,2,,37,,RTE,DE DOUAI,62490,TORTEQUESNE,,,62825,,,,,,,,,,,,,,,,,,,2006-06-30,F,,,,,74.8K,NAFRev1,N,3.045195,50.291962,0.81,housenumber,37 Rue de Douai 62490 Tortequesne,62825_0080_00037,G,37 RUE DE DOUAI,
338806326,00017,33880632600017,P,1986-07-01,NN,,,2018-04-07T07:26:48,false,3,[ND],[ND],[ND],[ND],[ND],[ND],TORTEQUESNE,,[ND],62825,[ND],[ND],,,[ND],[ND],[ND],[ND],[ND],[ND],,,[ND],,[ND],[ND],,,2008-01-01,A,[ND],[ND],[ND],[ND],01.46Z,NAFRev2,N,,,0,,,,,,
338936156,00011,33893615600011,O,,NN,,,,true,1,,6,,RUE,DE L'EGLISE,62490,TORTEQUESNE,,,62825,,,,,,,,,,,,,,,,,,,1987-02-01,F,,,,,67.04,NAP,N,3.039815,50.288955,0.6,housenumber,6 Rue de Lecluse 62490 Tortequesne,62825_0082_00006,G,6 RUE DE LECLUSE,
341616803,00019,34161680300019,O,,,,,,true,1,,35,,RUE,DE SAILLY,62490,TORTEQUESNE,,,62825,,,,,,,,,,,,,,,,,,,1989-03-10,F,,,,,59.05,NAP,N,3.033231,50.291819,0.95,housenumber,35 Rue de Sailly 62490 Tortequesne,62825_0100_00035,G,35 RUE DE SAILLY,
342984259,00016,34298425900016,O,,NN,,,,true,1,,6,,RUE,DE L'EGLISE,62490,TORTEQUESNE,,,62825,,,,,,,,,,,,,,,,,,,1988-12-31,F,,,,,67.04,NAP,N,3.039815,50.288955,0.6,housenumber,6 Rue de Lecluse 62490 Tortequesne,62825_0082_00006,G,6 RUE DE LECLUSE,
378609069,00018,37860906900018,O,1990-07-03,NN,,,2008-01-04T21:18:39,true,3,,1,,RUE,DE DOUAI,62490,TORTEQUESNE,,,62825,,,,,,,,,,,,,,,,,,,2008-01-01,A,,,,,94.99Z,NAFRev2,N,3.040352,50.289348,0.95,housenumber,1 Rue de Douai 62490 Tortequesne,62825_0080_00001,G,1 RUE DE DOUAI,
382255974,00018,38225597400018,O,1991-06-01,NN,,,2012-07-28T11:05:50,true,4,,24,,RUE,DE DOUAI,62490,TORTEQUESNE,,,62825,,,,,,,,,,,,,,,,,,,2009-12-25,F,,,,,01.49Z,NAFRev2,N,3.04437,50.291159,0.95,housenumber,24 Rue de Douai 62490 Tortequesne,62825_0080_00024,G,24 RUE DE DOUAI,
383128550,00019,38312855000019,O,,NN,,,,true,1,,31,,RUE,DE BELLONNE,62490,TORTEQUESNE,,,62825,,,,,,,,,,,,,,,,,,,1992-11-30,F,,,,,60.2M,NAF1993,N,3.040007,50.291308,0.95,housenumber,31 Rue de Bellonne 62490 Tortequesne,62825_0020_00031,G,31 RUE DE BELLONNE,
384057410,00019,38405741000019,O,,,,,,true,1,,27,,RUE,DE SAILLY,62490,TORTEQUESNE,,,62825,,,,,,,,,,,,,,,,,,,1994-01-07,F,,,,,70.2A,NAF1993,N,3.034661,50.291278,0.95,housenumber,27 Rue de Sailly 62490 Tortequesne,62825_0100_00027,G,27 RUE DE SAILLY,
384863890,00016,38486389000016,O,1992-03-05,NN,,,2006-12-15T00:45:59,false,3,,,,RUE,DE DOUAI,62490,TORTEQUESNE,,,62825,,,,,,,,,,,,,,,,,,,1999-12-31,F,,,,,55.4A,NAF1993,O,3.043088,50.290344,0.95,street,Rue de Douai 62490 Tortequesne,62825_0080,G,RUE DE DOUAI,
387833908,00016,38783390800016,O,1992-05-01,NN,,,2006-10-28T01:16:36,true,3,,8,,RUE,DU BOUT D'EPINOY,62490,TORTEQUESNE,,,62825,,,,,,,,,,,,,,,,,,,2004-12-31,F,,,,,01.4A,NAFRev1,N,3.03248,50.289737,0.95,housenumber,8 Rue du Bout d'Epinoy 62490 Tortequesne,62825_0040_00008,G,8 RUE DU BOUT D EPINOY,
390818318,00029,39081831800029,O,2023-01-31,,,,2023-05-22T08:56:28,true,1,,2,,RUE,DU BOUT D'EPINOY,62490,TORTEQUESNE,,,62825,,,,,,,,,,,,,,,,,,,2023-01-31,A,,,,,35.11Z,NAFRev2,N,3.035493,50.289669,0.95,housenumber,2 Rue du Bout d'Epinoy 62490 Tortequesne,62825_0040_00002,G,2 RUE DU BOUT D EPINOY,
398231589,00027,39823158900027,O,2003-01-01,NN,,4321AA,2016-04-26T03:14:39,true,4,,39,B,RUE,DE SAILLY,62490,TORTEQUESNE,,,62825,,,,,,,,,,,,,,,,,,,2014-03-02,F,,,,,43.21A,NAFRev2,O,3.030692,50.292026,0.85,housenumber,39bis Rue de Sailly 62490 Tortequesne,62825_0100_00039_bis,G,39BIS RUE DE SAILLY,
404261687,00010,40426168700010,O,1990-06-11,NN,,,2013-02-02T12:53:26,true,4,,33,,RUE,DU BOUT D EPINOY,62490,TORTEQUESNE,,,62825,,,,,,,,,,,,,,,,,,,2012-12-25,F,,,,,01.11Z,NAFRev2,N,3.033839,50.288859,0.95,housenumber,33 Rue du Bout d'Epinoy 62490 Tortequesne,62825_0040_00033,G,33 RUE DU BOUT D EPINOY,
408259505,00019,40825950500019,O,1996-07-15,NN,,,,true,1,,9,,RUE,DU BOUT D EPINOY,62490,TORTEQUESNE,,,62825,,,,,,,,,,,,,,,,,,,2002-10-31,F,,,,,74.8F,NAF1993,N,3.034878,50.289641,0.95,housenumber,9 Rue du Bout d'Epinoy 62490 Tortequesne,62825_0040_00009,G,9 RUE DU BOUT D EPINOY,
408902765,00036,40890276500036,O,2012-05-15,,,,2014-07-01T21:09:43,true,2,,8,,RUE,DU CENTRE,62490,TORTEQUESNE,,,62825,,,,,,,,,,,,,,,,,,,2014-05-01,F,,,,,47.91A,NAFRev2,N,3.038974,50.28915,0.95,housenumber,8 Rue du Centre 62490 Tortequesne,62825_0060_00008,G,8 RUE DU CENTRE,
414189654,00026,41418965400026,O,2002-04-02,NN,,,2012-10-18T10:23:18,false,4,,4,T,RUE,DU BOUT D'EPINOY,62490,TORTEQUESNE,,,62825,,,,,,,,,,,,,,,,,,,2012-09-25,F,,,,,68.20B,NAFRev2,N,3.034398,50.289662,0.95,housenumber,4t Rue du Bout d'Epinoy 62490 Tortequesne,62825_0040_00004_t,G,4T RUE DU BOUT D EPINOY,
418334363,00011,41833436300011,O,1998-04-03,NN,,,2014-07-08T01:51:58,true,4,,14,,RUE,DE DOUAI,62490,TORTEQUESNE,,,62825,,,,,,,,,,,,,,,,,,,2011-12-31,F,,,,,45.20A,NAFRev2,N,3.042262,50.289589,0.95,housenumber,14 Rue de Douai 62490 Tortequesne,62825_0080_00014,G,14 RUE DE DOUAI,
419807177,00011,41980717700011,O,1998-07-06,,,,,false,3,,12,,RUE,DE SAILLY,62490,TORTEQUESNE,,,62825,,,,,,,,,,,,,,,,,,,1999-12-25,F,,,,,85.1G,NAF1993,N,3.038425,50.289979,0.95,housenumber,12 Rue de Sailly 62490 Tortequesne,62825_0100_00012,G,12 RUE DE SAILLY,
428308209,00017,42830820900017,O,1969-01-01,NN,,,2023-07-03T21:01:54,true,5,,1,,RUE,DU BOUT D'EPINOY,62490,TORTEQUESNE,,,62825,,,,,,,,,,,,,,,,,,,2020-12-25,F,,,,,01.11Z,NAFRev2,N,3.036528,50.289492,0.95,housenumber,1 Rue du Bout d'Epinoy 62490 Tortequesne,62825_0040_00001,G,1 RUE DU BOUT D EPINOY,
430270017,00014,43027001700014,O,2000-01-10,NN,,,2008-09-16T04:33:51,true,4,,,,RUE,DE DOUAI,62490,TORTEQUESNE,,,62825,,,,,,,,,,,,,,,,,,,2008-01-01,A,,,,,56.10A,NAFRev2,N,3.043088,50.290344,0.95,street,Rue de Douai 62490 Tortequesne,62825_0080,G,RUE DE DOUAI,
434343570,00017,43434357000017,O,2001-01-04,NN,,,2014-07-08T02:13:02,true,4,,22,B,RUE,DE SAILLY,62490,TORTEQUESNE,,,62825,,,,,,,,,,,,,,,,,,,2011-02-02,F,,,,,41.20A,NAFRev2,O,3.036772,50.290608,0.85,housenumber,22bis Rue de Sailly 62490 Tortequesne,62825_0100_00022_bis,G,22BIS RUE DE SAILLY,
437518418,00029,43751841800029,O,2011-01-01,,,,2015-01-27T03:39:00,true,2,,39,B,RUE,DE SAILLY,62490,TORTEQUESNE,,,62825,,,,,,,,,,,,,,,,,,,2014-10-31,F,,,,,68.20B,NAFRev2,N,3.030692,50.292026,0.85,housenumber,39bis Rue de Sailly 62490 Tortequesne,62825_0100_00039_bis,G,39BIS RUE DE SAILLY,
444396873,00028,44439687300028,O,2007-03-01,,,4776ZP,2017-05-24T19:31:18,true,3,,24,,RUE,DE DOUAI,62490,TORTEQUESNE,,,62825,,,,,,,,,,,,,,,,,,,2017-05-23,F,,,,,47.76Z,NAFRev2,N,3.04437,50.291159,0.95,housenumber,24 Rue de Douai 62490 Tortequesne,62825_0080_00024,G,24 RUE DE DOUAI,
444574974,00010,44457497400010,O,2002-12-09,NN,,,2006-10-31T04:06:55,true,3,,38,,RUE,DE SAILLY,62490,TORTEQUESNE,,,62825,,,,,,,,,,,,,,,,,,,2005-09-30,F,,,,,52.2G,NAFRev1,N,3.032913,50.29199,0.95,housenumber,38 Rue de Sailly 62490 Tortequesne,62825_0100_00038,G,38 RUE DE SAILLY,
449578343,00047,44957834300047,O,2019-01-02,,,,2021-02-23T13:31:52,true,1,,7,,RUE,DE LECLUSE,62490,TORTEQUESNE,,,62825,,,,,,,,,,,,,,,,,,,2019-01-02,A,,,,,68.20B,NAFRev2,N,3.039769,50.287834,0.95,housenumber,7 Rue de Lecluse 62490 Tortequesne,62825_0082_00007,G,7 RUE DE LECLUSE,
450061932,00015,45006193200015,O,2003-09-08,NN,,,2008-01-05T01:59:50,true,6,,11,,RUE,DE SAILLY,62490,TORTEQUESNE,,,62825,,,,,,,,,,,,,,,,,,,2008-01-01,A,,,,,85.59B,NAFRev2,O,3.037419,50.290246,0.95,housenumber,11 Rue de Sailly 62490 Tortequesne,62825_0100_00011,G,11 RUE DE SAILLY,
450990650,00019,45099065000019,O,2003-10-25,NN,,,2010-08-30T10:12:07,false,4,,25,,RUE,DU CENTRE,62490,TORTEQUESNE,,,62825,,,,,,,,,,,,,,,,,,,2010-07-23,F,,,,,68.20A,NAFRev2,N,3.037686,50.289284,0.95,housenumber,25 Rue du Centre 62490 Tortequesne,62825_0060_00025,G,25 RUE DU CENTRE,
450990650,00027,45099065000027,O,2010-07-23,,,,2010-08-30T10:12:07,true,1,,9,B,RUE,DU CENTRE,62490,TORTEQUESNE,,,62825,,,,,,,,,,,,,,,,,,,2010-07-23,A,,,,,68.20A,NAFRev2,N,3.039225,50.289,0.84,housenumber,9bis Rue du Centre 62490 Tortequesne,62825_0060_00009_bis,G,9BIS RUE DU CENTRE,
478901333,00029,47890133300029,O,2014-01-01,,,,2021-02-23T13:41:05,true,1,,24,,RUE,DE SAILLY,62490,TORTEQUESNE,,,62825,,,,,,,,,,,,,,,,,,,2014-01-01,A,,,,,01.30Z,NAFRev2,N,3.035814,50.290941,0.95,housenumber,24 Rue de Sailly 62490 Tortequesne,62825_0100_00024,G,24 RUE DE SAILLY,
479523177,00067,47952317700067,O,2023-01-06,,,,2023-08-08T09:03:44,true,1,,4,B,RUE,DE DOUAI,62490,TORTEQUESNE,,,62825,,,,,,,,,,,,,,,,,,,2023-01-06,A,,,,,68.31Z,NAFRev2,O,3.04089,50.288667,0.83,housenumber,4bis Rue de Douai 62490 Tortequesne,62825_0080_00004_bis,G,4BIS RUE DE DOUAI,
480590876,00011,48059087600011,O,2005-01-01,NN,,,2014-09-17T03:47:52,true,3,,8,,RUE,DU BOUT D'EPINOY,62490,TORTEQUESNE,,,62825,,,,,,,,,,,,,,,,,,,2014-09-01,F,,,,,01.11Z,NAFRev2,O,3.03248,50.289737,0.95,housenumber,8 Rue du Bout d'Epinoy 62490 Tortequesne,62825_0040_00008,G,8 RUE DU BOUT D EPINOY,
480724780,00030,48072478000030,O,2016-07-01,,,,2017-01-09T13:17:44,true,2,,6,,RUE,ANDRE MARTIN,62490,TORTEQUESNE,,,62825,,,,,,,,,,,,,,,,,,,2016-12-19,F,JERFOMEDIA,,,JERFOMEDIA,63.11Z,NAFRev2,N,3.044052,50.288486,0.8,housenumber,6 Residence Andre Martin 62490 Tortequesne,62825_0010_00006,G,6 RESIDENCE ANDRE MARTIN,
481402311,00015,48140231100015,O,2005-04-04,,,,2012-01-24T04:42:23,true,3,,9,,RUE,DU 19 MARS 1962 LE PETIT M,62490,TORTEQUESNE,,,62825,,,,,,,,,,,,,,,,,,,2011-12-31,F,,,,,81.30Z,NAFRev2,N,3.052522,50.285046,0.67,housenumber,9 Rue du 19 Mars 1962 62490 Tortequesne,62825_0070_00009,G,9 RUE DU 19 MARS 1962,
483153250,00012,48315325000012,O,1998-04-30,NN,,,2008-01-05T01:02:46,true,3,,19,B,RUE,DU BOUT D'EPINOY,62490,TORTEQUESNE,,,62825,,,,,,,,,,,,,,,,,,,2008-01-01,A,,,,,01.11Z,NAFRev2,N,3.03331,50.289494,0.88,housenumber,19bis Rue du Bout d'Epinoy 62490 Tortequesne,62825_0040_00019_bis,G,19BIS RUE DU BOUT D EPINOY,
483718383,00019,48371838300019,O,2005-09-01,NN,,,2021-10-04T09:15:37,false,1,,33,,RUE,DU CENTRE,62490,TORTEQUESNE,,,62825,,,,,,,,,,,,,,,,,,,2005-09-01,F,,,,,93.0D,NAFRev1,N,3.037375,50.289339,0.95,housenumber,33 Rue du Centre 62490 Tortequesne,62825_0060_00033,G,33 RUE DU CENTRE,
484441134,00018,48444113400018,O,2005-09-23,,,,2008-01-05T21:54:10,true,2,,11,B,RUE,DE DOUAI,62490,TORTEQUESNE,,,62825,,,,,,,,,,,,,,,,,,,2008-01-01,A,,,,,68.20B,NAFRev2,N,3.041923,50.289465,0.84,housenumber,11bis Rue de Douai 62490 Tortequesne,62825_0080_00011_bis,G,11BIS RUE DE DOUAI,
489851261,00037,48985126100037,O,2012-07-01,NN,,,2019-06-24T13:24:39,false,2,,30,,RUE,DE SAILLY,62490,TORTEQUESNE,,,62825,,,,,,,,,,,,,,,,,,,2017-10-13,F,,,,,64.20Z,NAFRev2,O,3.035018,50.291733,0.95,housenumber,30 Rue de Sailly 62490 Tortequesne,62825_0100_00030,G,30 RUE DE SAILLY,
490103074,00012,49010307400012,O,2006-05-02,NN,,,2010-05-06T04:45:19,true,6,,4,,RUE,DU BOUT D EPINOY,62490,TORTEQUESNE,,,62825,,,,,,,,,,,,,,,,,,,2010-02-26,F,ST DE NORD FRANCE,,,,47.99A,NAFRev2,O,3.035172,50.289671,0.95,housenumber,4 Rue du Bout d'Epinoy 62490 Tortequesne,62825_0040_00004,G,4 RUE DU BOUT D EPINOY,
490180858,00014,49018085800014,O,2006-04-01,,,,2006-11-25T21:21:09,false,2,,13,,RUE,JULES  GODIN,62490,TORTEQUESNE,,,62825,,,,,,,,,,,,,,,,,,,2006-07-01,F,,,,,70.3A,NAFRev1,N,3.041385,50.291301,0.95,housenumber,13 Rue Jules Godin 62490 Tortequesne,62825_0085_00013,G,13 RUE JULES GODIN,
492315791,00029,49231579100029,O,2021-10-14,,,,2021-10-27T10:30:10,true,1,,4,,RUE,JEAN CARON,62490,TORTEQUESNE,,,62825,,,,,,,,,,,,,,,,,,,2021-10-14,A,,,,,94.99Z,NAFRev2,N,3.033871,50.290312,0.95,housenumber,4 Rue Jean Caron 62490 Tortequesne,62825_0084_00004,G,4 RUE JEAN CARON,
493744494,00011,49374449400011,O,2007-01-02,NN,,8121ZZ,2015-05-14T08:32:41,true,2,,34,,RUE,DE SAILLY,62490,TORTEQUESNE,,,62825,,,,,,,,,,,,,,,,,,,2008-01-01,A,,,,,81.22Z,NAFRev2,O,3.033543,50.291794,0.95,housenumber,34 Rue de Sailly 62490 Tortequesne,62825_0100_00034,G,34 RUE DE SAILLY,
497931923,00039,49793192300039,O,2011-08-11,,,,2012-07-23T11:34:39,false,2,,29,,RUE,DE DOUAI,62490,TORTEQUESNE,,,62825,,,,,,,,,,,,,,,,,,,2012-05-31,F,,,,,85.59A,NAFRev2,N,3.044261,50.291233,0.95,housenumber,29 Rue de Douai 62490 Tortequesne,62825_0080_00029,G,29 RUE DE DOUAI,
497931923,00047,49793192300047,O,2012-06-01,,,,2017-08-07T14:03:21,true,2,,29,,RUE,DE DOUAI,62490,TORTEQUESNE,,,62825,,,,,,,,,,,,,,,,,,,2017-08-07,F,,,,,70.10Z,NAFRev2,N,3.044261,50.291233,0.95,housenumber,29 Rue de Douai 62490 Tortequesne,62825_0080_00029,G,29 RUE DE DOUAI,
498977206,00032,49897720600032,O,2010-07-23,,,,2013-08-21T11:36:37,false,2,,4,T,RUE,BOUT D EPINOY,62490,TORTEQUESNE,,,62825,,,,,,,,,,,,,,,,,,,2013-01-01,F,,,,,86.22C,NAFRev2,N,3.034398,50.289662,0.91,housenumber,4t Rue du Bout d'Epinoy 62490 Tortequesne,62825_0040_00004_t,G,4T RUE DU BOUT D EPINOY,
499175487,00010,49917548700010,O,2007-06-23,,,,2017-07-12T04:30:08,true,2,,27,,RUE,DE SAILLY,62490,TORTEQUESNE,,,62825,,,,,,,,,,,,,,,,,,,2008-01-01,A,,,,,68.20B,NAFRev2,N,3.034661,50.291278,0.95,housenumber,27 Rue de Sailly 62490 Tortequesne,62825_0100_00027,G,27 RUE DE SAILLY,
499971968,00015,49997196800015,O,2007-09-01,,,,2019-08-08T09:41:31,false,3,,29,,RUE,DE DOUAI,62490,TORTEQUESNE,,,62825,,,,,,,,,,,,,,,,,,,2019-03-01,F,,,,,85.59B,NAFRev2,N,3.044261,50.291233,0.95,housenumber,29 Rue de Douai 62490 Tortequesne,62825_0080_00029,G,29 RUE DE DOUAI,
508269065,00019,50826906500019,O,2008-11-01,NN,,,2016-04-26T02:40:54,true,3,,34,,RUE,DE SAILLY,62490,TORTEQUESNE,,,62825,,,,,,,,,,,,,,,,,,,2015-06-09,F,,,,,96.09Z,NAFRev2,O,3.033543,50.291794,0.95,housenumber,34 Rue de Sailly 62490 Tortequesne,62825_0100_00034,G,34 RUE DE SAILLY,
508711983,00017,50871198300017,O,2008-10-01,,,,2008-10-28T05:02:31,true,1,,13,,RUE,DE BELLONNE,62490,TORTEQUESNE,,,62825,,,,,,,,,,,,,,,,,,,2008-10-01,A,,,,,64.20Z,NAFRev2,N,3.040064,50.290483,0.95,housenumber,13 Rue de Bellonne 62490 Tortequesne,62825_0020_00013,G,13 RUE DE BELLONNE,
511448235,00016,51144823500016,O,2009-04-06,,,,2013-03-13T04:46:10,true,2,,6,,RUE,DU 8MAI 1945,62490,TORTEQUESNE,,,62825,,,,,,,,,,,,,,,,,,,2012-12-01,F,,,,,43.33Z,NAFRev2,N,3.044633,50.290346,0.86,housenumber,6 Rue du 8 Mai 1945 62490 Tortequesne,62825_0083_00006,G,6 RUE DU 8 MAI 1945,
513898353,00018,51389835300018,O,2009-08-18,,,,2015-09-18T03:20:12,true,4,,6,,RUE,DE DOUAI,62490,TORTEQUESNE,,,62825,,,,,,,,,,,,,,,,,,,2013-12-31,F,,,,LES BELLES DE MARIE,47.91A,NAFRev2,N,3.041312,50.288884,0.95,housenumber,6 Rue de Douai 62490 Tortequesne,62825_0080_00006,G,6 RUE DE DOUAI,
515367274,00013,51536727400013,O,2009-11-01,,,,2012-11-10T01:21:10,false,2,,2,B,RUE,DE LECLUSE,62490,TORTEQUESNE,,,62825,,,,,,,,,,,,,,,,,,,2010-01-01,F,,,,,96.09Z,NAFRev2,N,3.039895,50.289196,0.85,housenumber,2bis Rue de Lecluse 62490 Tortequesne,62825_0082_00002_bis,G,2BIS RUE DE LECLUSE,
519404842,00014,51940484200014,O,2009-07-06,,,,2015-12-15T04:20:16,false,2,,23,,RUE,JULES GODIN,62490,TORTEQUESNE,,,62825,,,,,,,,,,,,,,,,,,,2015-11-16,F,,,,,86.90E,NAFRev2,N,3.041613,50.292333,0.95,housenumber,23 Rue Jules Godin 62490 Tortequesne,62825_0085_00023,G,23 RUE JULES GODIN,
523630424,00035,52363042400035,O,2016-03-01,,,3220ZA,2021-02-23T15:39:51,true,1,,4,,RUE,DU BOUT D'EPINOY,62490,TORTEQUESNE,,,62825,,,,,,,,,,,,,,,,,,,2016-03-01,A,,,,SLEDGE GUITARS,47.78C,NAFRev2,N,3.035172,50.289671,0.95,housenumber,4 Rue du Bout d'Epinoy 62490 Tortequesne,62825_0040_00004,G,4 RUE DU BOUT D EPINOY,
524315876,00010,52431587600010,O,2010-09-01,01,2020,4321AB,2022-08-29T09:26:52,true,2,,1,,RUE,DE LECLUSE,62490,TORTEQUESNE,,,62825,,,,,,,,,,,,,,,,,,,2012-07-02,A,,,,,43.21A,NAFRev2,O,3.040125,50.289221,0.95,housenumber,1 Rue de Lecluse 62490 Tortequesne,62825_0082_00001,G,1 RUE DE LECLUSE,
525317582,00043,52531758200043,O,2020-01-13,,,,2022-11-29T08:38:30,true,2,,9,,RUE,ANDRE MARTIN,62490,TORTEQUESNE,,,62825,,,,,,,,,,,,,,,,,,,2022-12-15,F,,,,,71.12B,NAFRev2,N,3.044235,50.289046,0.8,housenumber,9 Residence Andre Martin 62490 Tortequesne,62825_0010_00009,G,9 RESIDENCE ANDRE MARTIN,
531037646,00027,53103764600027,O,2021-10-01,,,9602BB,2022-05-07T12:41:27,true,2,,6,,RUE,DE LECLUSE,62490,TORTEQUESNE,,,62825,,,,,,,,,,,,,,,,,,,2022-04-01,A,,,,DOLCE NAILS,96.02B,NAFRev2,N,3.039815,50.288955,0.95,housenumber,6 Rue de Lecluse 62490 Tortequesne,62825_0082_00006,G,6 RUE DE LECLUSE,
531319275,00016,53131927500016,O,2011-03-01,,,,2022-09-21T20:34:41,true,1,,18,,RUE,JULES GODIN,62490,TORTEQUESNE,,,62825,,,,,,,,,,,,,,,,,,,2011-03-01,A,,,,,68.20B,NAFRev2,N,3.041801,50.292271,0.95,housenumber,18 Rue Jules Godin 62490 Tortequesne,62825_0085_00018,G,18 RUE JULES GODIN,
533390670,00032,53339067000032,O,2018-09-01,,,4331ZB,2022-06-15T03:49:05,false,3,,2,,RUE,DU GENERAL DE GAULLE,62490,TORTEQUESNE,,,62825,,,,,,,,,,,,,,,,,,,2021-09-06,F,,,,TC BATIMENT,43.31Z,NAFRev2,O,3.032462,50.291666,0.95,housenumber,2 Rue du General de Gaulle 62490 Tortequesne,62825_0090_00002,G,2 RUE DU GENERAL DE GAULLE,
533424909,00018,53342490900018,O,2011-06-21,,,,2014-04-01T03:30:25,false,2,,3,,RUE,DU 8 MAI 1945,62490,TORTEQUESNE,,,62825,,,,,,,,,,,,,,,,,,,2014-03-01,F,,,,,68.20B,NAFRev2,N,3.044292,50.29053,0.95,housenumber,3 Rue du 8 Mai 1945 62490 Tortequesne,62825_0083_00003,G,3 RUE DU 8 MAI 1945,
535306450,00037,53530645000037,O,2019-07-01,,,9521ZZ,2021-12-23T03:55:35,true,2,,6,,RUE,DE SAILLY,62490,TORTEQUESNE,,,62825,,,,,,,,,,,,,,,,,,,2021-12-31,F,,,,TELE VIDEO SERVICE,95.21Z,NAFRev2,N,3.039361,50.289688,0.95,housenumber,6 Rue de Sailly 62490 Tortequesne,62825_0100_00006,G,6 RUE DE SAILLY,