siren,nic,siret,statutDiffusionEtablissement,dateCreationEtablissement,trancheEffectifsEtablissement,anneeEffectifsEtablissement,activitePrincipaleRegistreMetiersEtablissement,dateDernierTraitementEtablissement,etablissementSiege,nombrePeriodesEtablissement,complementAdresseEtablissement,numeroVoieEtablissement,indiceRepetitionEtablissement,typeVoieEtablissement,libelleVoieEtablissement,codePostalEtablissement,libelleCommuneEtablissement,libelleCommuneEtrangerEtablissement,distributionSpecialeEtablissement,codeCommuneEtablissement,codeCedexEtablissement,libelleCedexEtablissement,codePaysEtrangerEtablissement,libellePaysEtrangerEtablissement,complementAdresse2Etablissement,numeroVoie2Etablissement,indiceRepetition2Etablissement,typeVoie2Etablissement,libelleVoie2Etablissement,codePostal2Etablissement,libelleCommune2Etablissement,libelleCommuneEtranger2Etablissement,distributionSpeciale2Etablissement,codeCommune2Etablissement,codeCedex2Etablissement,libelleCedex2Etablissement,codePaysEtranger2Etablissement,libellePaysEtranger2Etablissement,dateDebut,etatAdministratifEtablissement,enseigne1Etablissement,enseigne2Etablissement,enseigne3Etablissement,denominationUsuelleEtablissement,activitePrincipaleEtablissement,nomenclatureActivitePrincipaleEtablissement,caractereEmployeurEtablissement,longitude,latitude,geo_score,geo_type,geo_adresse,geo_id,geo_ligne,geo_l4,geo_l5
176702116,00383,17670211600383,O,1983-03-16,,,,2007-03-06T15:02:33,false,3,,40,,,GRAND RUE,67430,DIEMERINGEN,,,67095,,,,,,,,,,,,,,,,,,,2007-01-01,F,TRESORERIE DE DIEMERINGEN,,,,75.1A,NAFRev1,N,7.186931,48.939589,0.96,housenumber,40 Grand-rue 67430 Diemeringen,67095_0280_00040,G,40 GRAND RUE,
186707444,00011,18670744400011,O,1985-11-19,,,,2008-01-04T18:18:42,true,3,,9,,,DE L EICHEL,67430,DIEMERINGEN,,,67095,,,,,,,,,,,,,,,,,,,2008-01-01,A,,,,,94.91Z,NAFRev2,N,7.188203,48.941327,0.88,housenumber,9 Quai de l'Eichel 67430 Diemeringen,67095_0060_00009,G,9 QUAI DE L EICHEL,
186708400,00012,18670840000012,O,1986-02-04,NN,,,2022-11-22T10:41:47,true,3,,9,,QUAI,DE L EICHEL,67430,DIEMERINGEN,,,67095,,,,,,,,,,,,,,,,,,,2008-01-01,A,,,,,94.91Z,NAFRev2,N,7.188203,48.941327,0.95,housenumber,9 Quai de l'Eichel 67430 Diemeringen,67095_0060_00009,G,9 QUAI DE L EICHEL,
186715637,00028,18671563700028,O,2022-01-01,,,,2023-03-13T13:56:12,false,1,,12,,RUE,DES LILAS,67430,DIEMERINGEN,,,67095,,,,,,,,,,,,,,,,,,,2022-01-01,F,ANNEXE MACKWILLER,,,,94.91Z,NAFRev2,N,7.193059,48.940902,0.95,housenumber,12 Rue des Lilas 67430 Diemeringen,67095_0160_00012,G,12 RUE DES LILAS,
186715751,00019,18671575100019,O,2004-12-25,NN,,,2008-01-04T18:18:45,true,2,,,,,,67430,DIEMERINGEN,,,67095,,,,,,,,,,,,,,,,,,,2008-01-01,A,,,,,94.91Z,NAFRev2,N,,,0,,,,,,
196717417,00014,19671741700014,O,1983-03-01,12,2020,,2022-08-29T09:04:37,true,3,,6,,RUE,DU COLLEGE,67430,DIEMERINGEN,,,67095,,,,,,,,,,,,,,,,,,,2008-01-01,A,,,,,85.31Z,NAFRev2,N,7.190868,48.940328,0.95,housenumber,6 Rue du Collège 67430 Diemeringen,67095_0040_00006,G,6 RUE DU COLLEGE,
200044626,00014,20004462600014,O,2013-11-04,02,2020,,2022-08-29T09:05:08,true,2,,12,,RUE,DES REMPARTS,67430,DIEMERINGEN,,,67095,,,,,,,,,,,,,,,,,,,2015-05-11,A,,,,,37.00Z,NAFRev2,O,7.186282,48.940967,0.95,housenumber,12 Rue des Remparts 67430 Diemeringen,67095_0240_00012,G,12 RUE DES REMPARTS,
200101301,00014,20010130100014,O,2023-08-08,,,,2023-08-10T13:18:34,true,1,,12,,RUE,DES LILAS,67430,DIEMERINGEN,,,67095,,,,,,,,,,,,,,,,,,,2023-08-08,A,,,,,94.91Z,NAFRev2,N,7.193059,48.940902,0.95,housenumber,12 Rue des Lilas 67430 Diemeringen,67095_0160_00012,G,12 RUE DES LILAS,
216700955,00018,21670095500018,O,1983-03-01,11,2020,,2022-08-29T09:08:26,true,3,,10,,RUE,PAUL PARAY,67430,DIEMERINGEN,,,67095,,,,,,,,,,,,,,,,,,,2008-01-01,A,MAIRIE,,,,84.11Z,NAFRev2,O,7.191207,48.938877,0.95,housenumber,10 Rue Paul Paray 67430 Diemeringen,67095_0190_00010,G,10 RUE PAUL PARAY,
216700955,00026,21670095500026,O,1983-03-16,NN,,,2010-04-18T03:13:19,false,3,,,,,,67430,DIEMERINGEN,,,67095,,,,,,,,,,,,,,,,,,,2008-01-01,A,PISCINE MUNICIPALE,,,,93.11Z,NAFRev2,N,,,0,,,,,,
216700955,00034,21670095500034,O,1983-12-21,03,2020,,2022-08-29T09:08:26,false,4,,10,,QUAI,DE L'EICHEL,67430,DIEMERINGEN,,,67095,,,,,,,,,,,,,,,,,,,2022-05-13,A,ECOLE PRIMAIRE,,,,85.20Z,NAFRev2,N,7.18834,48.941629,0.95,housenumber,10 Quai de l'Eichel 67430 Diemeringen,67095_0060_00010,G,10 QUAI DE L EICHEL,
216700955,00042,21670095500042,O,1983-12-21,01,2020,,2022-08-29T09:08:26,false,3,,80,,,GRAND RUE,67430,DIEMERINGEN,,,67095,,,,,,,,,,,,,,,,,,,2008-01-01,A,ECOLE MATERNELLE PUBLIQUE,,,,85.10Z,NAFRev2,N,7.186908,48.943014,0.96,housenumber,80 Grand-rue 67430 Diemeringen,67095_0280_00080,G,80 GRAND RUE,
216700955,00059,21670095500059,O,2011-09-01,02,2020,,2022-08-29T09:08:26,false,1,CENTRE CULTUREL,95,,,GRAND RUE,67430,DIEMERINGEN,,,67095,,,,,,,,,,,,,,,,,,,2011-09-01,A,ACCUEIL PERISCOLAIRE,,,,88.91A,NAFRev2,O,7.186148,48.945287,0.96,housenumber,95 Grand-rue 67430 Diemeringen,67095_0280_00095,G,95 GRAND RUE,
246700074,00015,24670007400015,O,1983-03-01,NN,,,2021-10-27T08:11:51,true,5,,40,,,GRAND'RUE,67430,DIEMERINGEN,,,67095,,,,,,,,,,,,,,,,,,,2020-12-30,F,,,,,84.11Z,NAFRev2,O,7.186931,48.939589,0.96,housenumber,40 Grand-rue 67430 Diemeringen,67095_0280_00040,G,40 GRAND RUE,
246700074,00023,24670007400023,O,1999-12-25,NN,,,2021-01-11T08:04:49,false,3,,40,,,GRAND'RUE,67430,DIEMERINGEN,,,67095,,,,,,,,,,,,,,,,,,,2020-12-30,F,SERVICE D'EAU,,,,36.00Z,NAFRev2,N,7.186931,48.939589,0.96,housenumber,40 Grand-rue 67430 Diemeringen,67095_0280_00040,G,40 GRAND RUE,
246700074,00031,24670007400031,O,1999-12-25,NN,,,2021-01-11T08:04:49,false,3,,40,,,GRAND'RUE,67430,DIEMERINGEN,,,67095,,,,,,,,,,,,,,,,,,,2020-12-30,F,SERVICE D'ASSAINISSEMENT,,,,37.00Z,NAFRev2,N,7.186931,48.939589,0.96,housenumber,40 Grand-rue 67430 Diemeringen,67095_0280_00040,G,40 GRAND RUE,
246700074,00049,24670007400049,O,2001-12-25,NN,,,2021-01-11T08:04:49,false,3,MAIRIE,40,,,GRAND'RUE,67430,DIEMERINGEN,,,67095,,,,,,,,,,,,,,,,,,,2020-12-30,F,SERVICE VOIRIE,,,,37.00Z,NAFRev2,N,7.186931,48.939589,0.96,housenumber,40 Grand-rue 67430 Diemeringen,67095_0280_00040,G,40 GRAND RUE,
246700074,00056,24670007400056,O,2003-01-01,NN,,,2021-01-11T08:04:49,false,4,MAIRIE,40,,,GRAND'RUE,67430,DIEMERINGEN,,,67095,,,,,,,,,,,,,,,,,,,2020-12-30,F,ZONAGE ASSAINISSEMENT,,,,37.00Z,NAFRev2,N,7.186931,48.939589,0.96,housenumber,40 Grand-rue 67430 Diemeringen,67095_0280_00040,G,40 GRAND RUE,
246700512,00014,24670051200014,O,1985-02-04,NN,,,,true,1,,34,,,GRAND RUE,67430,DIEMERINGEN,,,67095,,,,,,,,,,,,,,,,,,,1998-12-30,F,,,,,75.1A,NAF1993,O,7.186839,48.939024,0.96,housenumber,34 Grand-rue 67430 Diemeringen,67095_0280_00034,G,34 GRAND RUE,
246700942,00013,24670094200013,O,1998-12-30,NN,,,2009-06-27T03:27:40,false,3,,34,,,GRAND RUE,67430,DIEMERINGEN,,,67095,,,,,,,,,,,,,,,,,,,2006-10-30,F,,,,,75.1A,NAFRev1,O,7.186839,48.939024,0.96,housenumber,34 Grand-rue 67430 Diemeringen,67095_0280_00034,G,34 GRAND RUE,
246700942,00062,24670094200062,O,2006-10-30,NN,,,2013-05-18T02:18:44,false,3,,12,,RUE,DES REMPARTS,67430,DIEMERINGEN,,,67095,,,,,,,,,,,,,,,,,,,2011-10-04,F,,,,,84.11Z,NAFRev2,O,7.186282,48.940967,0.95,housenumber,12 Rue des Remparts 67430 Diemeringen,67095_0240_00012,G,12 RUE DES REMPARTS,
256700154,00014,25670015400014,O,1983-03-01,NN,,,2021-10-27T08:12:22,true,4,MAIRIE,10,,RUE,PAUL PARAY,67430,DIEMERINGEN,,,67095,,,,,,,,,,,,,,,,,,,2008-01-01,A,,,,,84.12Z,NAFRev2,O,7.191207,48.938877,0.95,housenumber,10 Rue Paul Paray 67430 Diemeringen,67095_0190_00010,G,10 RUE PAUL PARAY,
256700311,00010,25670031100010,O,,,,,2006-11-25T09:09:19,true,1,,24,,,GRAND RUE,67430,DIEMERINGEN,,,67095,,,,,,,,,,,,,,,,,,,,F,,,,,97.23,NAP,N,7.186773,48.937651,0.96,housenumber,24 Grand-rue 67430 Diemeringen,67095_0280_00024,G,24 GRAND RUE,
256702465,00012,25670246500012,O,1996-04-22,NN,,,2016-06-01T08:41:21,false,5,,,,,MAIRIE,67430,DIEMERINGEN,,,67095,,,,,,,,,,,,,,,,,,,2016-05-31,F,,,,,84.13Z,NAFRev2,N,3.0709671,50.6304695,0.92,poi.townhall,Hôtel de Ville Lille,https://osm.org/way/40917078,G,,
256702663,00012,25670266300012,O,1998-10-08,NN,,,2015-05-14T03:47:39,true,4,,34,,,GRAND RUE,67430,DIEMERINGEN,,,67095,,,,,,,,,,,,,,,,,,,2013-11-04,F,,,,,37.00Z,NAFRev2,O,7.186839,48.939024,0.96,housenumber,34 Grand-rue 67430 Diemeringen,67095_0280_00034,G,34 GRAND RUE,
266701051,00010,26670105100010,O,1995-12-25,NN,,,2010-06-26T03:14:16,true,3,MAIRIE,,,RUE,PAUL PARAY,67430,DIEMERINGEN,,,67095,,,,,,,,,,,,,,,,,,,2008-12-25,A,,,,,88.99B,NAFRev2,N,7.190489,48.938823,0.95,street,Rue Paul Paray 67430 Diemeringen,67095_0190,G,RUE PAUL PARAY,
296700511,00011,29670051100011,O,1983-08-10,NN,,,2006-11-25T09:11:00,true,4,,,,,MAIRIE,67430,DIEMERINGEN,,,67095,,,,,,,,,,,,,,,,,,,1992-05-01,F,,,,,70.1C,NAF1993,N,3.0709671,50.6304695,0.92,poi.townhall,Hôtel de Ville Lille,https://osm.org/way/40917078,G,,
300060688,00011,30006068800011,O,,NN,,,,true,1,,1,,RUE,DE LA GARE,67430,DIEMERINGEN,,,67095,,,,,,,,,,,,,,,,,,,2001-01-15,F,,,,,85.1E,NAF1993,O,7.185849,48.942728,0.95,housenumber,1 Rue de la Gare 67430 Diemeringen,67095_0120_00001,G,1 RUE DE LA GARE,
300061306,00027,30006130600027,O,1900-01-01,NN,,,2012-05-05T00:40:36,true,5,,116,,,GRAND RUE,67430,DIEMERINGEN,,,67095,,,,,,,,,,,,,,,,,,,2010-03-31,F,,,,,86.21Z,NAFRev2,O,7.186052,48.946255,0.96,housenumber,116 Grand-rue 67430 Diemeringen,67095_0280_00116,G,116 GRAND RUE,
300311784,00015,30031178400015,O,1977-01-01,NN,,,2008-11-07T00:16:40,true,3,,11,,QUAI,DES GLACIERES,67430,DIEMERINGEN,,,67095,,,,,,,,,,,,,,,,,,,2005-12-31,F,,,,,26.7Z,NAFRev1,N,7.183605,48.93793,0.7,housenumber,11 Rue des Glacieres 67430 Diemeringen,67095_0142_00011,G,11 RUE DES GLACIERES,
300839495,00011,30083949500011,O,,,,,,true,1,,24,,RUE,DU FAUBOURG,67430,DIEMERINGEN,,,67095,,,,,,,,,,,,,,,,,,,1984-12-25,F,,,,,65.06,NAP,N,7.187994,48.938055,0.96,housenumber,24 Rue du Faubourg 67430 Diemeringen,67095_0100_00024,G,24 RUE DU FAUBOURG,
301968459,00018,30196845900018,O,,,,,,true,1,,,,RTE,DE MACKWILLER,67430,DIEMERINGEN,,,67095,,,,,,,,,,,,,,,,,,,1992-06-25,F,,,,,26.2J,NAF1993,N,7.185363,48.937788,0.85,street,Route de Mackwiller 67430 Diemeringen,67095_0170,G,ROUTE DE MACKWILLER,
301968475,00014,30196847500014,O,,,,,,true,1,,,,RTE,DE MACKWILLER,67430,DIEMERINGEN,,,67095,,,,,,,,,,,,,,,,,,,1992-06-25,F,,,,,74.8K,NAF1993,N,7.185363,48.937788,0.85,street,Route de Mackwiller 67430 Diemeringen,67095_0170,G,ROUTE DE MACKWILLER,
302923636,00013,30292363600013,O,,,,,,true,1,,27,,,GRAND RUE,67430,DIEMERINGEN,,,67095,,,,,,,,,,,,,,,,,,,1984-12-25,F,,,,,87.03,NAP,N,7.186693,48.938968,0.96,housenumber,27 Grand-rue 67430 Diemeringen,67095_0280_00027,G,27 GRAND RUE,
303963748,00015,30396374800015,O,,NN,,,,true,1,,6,,RUE,DE SARRE UNION,67430,DIEMERINGEN,,,67095,,,,,,,,,,,,,,,,,,,1987-03-01,F,,,,,49.05,NAP,N,7.186226,48.942474,0.95,housenumber,6 Rue de Sarre-union 67430 Diemeringen,67095_0300_00006,G,6 RUE DE SARRE UNION,
305823726,00016,30582372600016,O,,NN,,,,true,1,,,,RTE,DE MACKWILLER,67430,DIEMERINGEN,,,67095,,,,,,,,,,,,,,,,,,,,F,,,,,15.12,NAP,N,7.185363,48.937788,0.85,street,Route de Mackwiller 67430 Diemeringen,67095_0170,G,ROUTE DE MACKWILLER,
305837577,00017,30583757700017,O,1900-01-01,11,2020,,2022-08-29T09:12:22,true,4,,95,,,GRAND RUE,67430,DIEMERINGEN,,,67095,,,,,,,,,,,,,,,,,,,2008-01-01,A,,,,,94.99Z,NAFRev2,O,7.186148,48.945287,0.96,housenumber,95 Grand-rue 67430 Diemeringen,67095_0280_00095,G,95 GRAND RUE,
307063461,00015,30706346100015,O,,NN,,,,true,1,,55,,,GRAND RUE,67430,DIEMERINGEN,,,67095,,,,,,,,,,,,,,,,,,,1991-03-31,F,,,,,64.49,NAP,N,7.186785,48.940661,0.96,housenumber,55 Grand-rue 67430 Diemeringen,67095_0280_00055,G,55 GRAND RUE,
307063636,00012,30706363600012,O,1976-01-01,NN,,,,true,1,,87,,,GRAND RUE,67430,DIEMERINGEN,,,67095,,,,,,,,,,,,,,,,,,,1999-12-31,F,,,,,70.2C,NAF1993,N,7.186436,48.943937,0.96,housenumber,87 Grand-rue 67430 Diemeringen,67095_0280_00087,G,87 GRAND RUE,
307086298,00014,30708629800014,O,1964-01-01,NN,,,,true,1,,115,,,GRAND RUE,67430,DIEMERINGEN,,,67095,,,,,,,,,,,,,,,,,,,2000-12-10,F,,,,,70.2C,NAF1993,N,7.185578,48.947415,0.96,housenumber,115 Grand-rue 67430 Diemeringen,67095_0280_00115,G,115 GRAND RUE,
307108258,00012,30710825800012,O,,NN,,,,true,1,,41,,,GRAND'RUE,67430,DIEMERINGEN,,,67095,,,,,,,,,,,,,,,,,,,,F,,,,,00.98,NAP,N,7.186804,48.940072,0.96,housenumber,41 Grand-rue 67430 Diemeringen,67095_0280_00041,G,41 GRAND RUE,
307108803,00015,30710880300015,O,,,,,,true,1,,4,,QUAI,DE L EICHEL,67430,DIEMERINGEN,,,67095,,,,,,,,,,,,,,,,,,,1987-01-14,F,,,,,62.43,NAP,N,7.187758,48.940412,0.95,housenumber,4 Quai de l'Eichel 67430 Diemeringen,67095_0060_00004,G,4 QUAI DE L EICHEL,
307127589,00017,30712758900017,O,,NN,,,,true,1,,124,,,GRAND RUE,67430,DIEMERINGEN,,,67095,,,,,,,,,,,,,,,,,,,1995-12-19,F,,,,,55.4B,NAF1993,N,7.185868,48.946958,0.96,housenumber,124 Grand-rue 67430 Diemeringen,67095_0280_00124,G,124 GRAND RUE,
307189506,00016,30718950600016,O,1900-01-01,,,,,true,4,,11,,RUE,DES POTIERS,67430,DIEMERINGEN,,,67095,,,,,,,,,,,,,,,,,,,1992-12-25,F,,,,,28.7P,NAF1993,N,7.189119,48.940732,0.95,housenumber,11 Rue des Potiers 67430 Diemeringen,67095_0200_00011,G,11 RUE DES POTIERS,
307772327,00010,30777232700010,O,1976-01-01,NN,,4520AB,2019-06-19T19:33:16,true,5,,106,,,GRAND RUE,67430,DIEMERINGEN,,,67095,,,,,,,,,,,,,,,,,,,2011-10-31,A,,,,,45.11Z,NAFRev2,N,7.186255,48.945343,0.96,housenumber,106 Grand-rue 67430 Diemeringen,67095_0280_00106,G,106 GRAND RUE,
309002624,00018,30900262400018,O,1976-01-01,NN,,,2011-04-23T04:37:10,false,5,,53,,,GRAND RUE,67430,DIEMERINGEN,,,67095,,,,,,,,,,,,,,,,,,,2009-01-01,F,,,,,47.71Z,NAFRev2,O,7.186764,48.94056,0.96,housenumber,53 Grand-rue 67430 Diemeringen,67095_0280_00053,G,53 GRAND RUE,
309002624,00026,30900262400026,O,2009-01-01,01,2020,,2022-08-29T09:12:58,true,3,,59,,,GRAND RUE,67430,DIEMERINGEN,,,67095,,,,,,,,,,,,,,,,,,,2020-02-05,A,,,,,47.71Z,NAFRev2,O,7.186845,48.940947,0.96,housenumber,59 Grand-rue 67430 Diemeringen,67095_0280_00059,G,59 GRAND RUE,
309066058,00038,30906605800038,O,1991-01-15,NN,,4722ZB,2014-07-15T19:24:48,false,4,,4,,QUAI,DE L EICHEL,67430,DIEMERINGEN,,,67095,,,,,,,,,,,,,,,,,,,2008-01-01,A,,,,,47.22Z,NAFRev2,O,7.187758,48.940412,0.95,housenumber,4 Quai de l'Eichel 67430 Diemeringen,67095_0060_00004,G,4 QUAI DE L EICHEL,
309117745,00013,30911774500013,O,,,,,,true,1,,5,,RUE,SARRE UNION,67430,DIEMERINGEN,,,67095,,,,,,,,,,,,,,,,,,,1985-12-25,F,,,,,55.10,NAP,N,7.186354,48.942535,0.94,housenumber,5 Rue de Sarre-union 67430 Diemeringen,67095_0300_00005,G,5 RUE DE SARRE UNION,
309668325,00017,30966832500017,O,1977-01-01,,,7420ZQ,2015-09-24T14:06:17,false,5,,70,,,GRAND RUE,67430,DIEMERINGEN,,,67095,,,,,,,,,,,,,,,,,,,2013-05-21,F,,,,,47.52A,NAFRev2,N,7.187195,48.942046,0.96,housenumber,70 Grand-rue 67430 Diemeringen,67095_0280_00070,G,70 GRAND RUE,
309668325,00025,30966832500025,O,2015-08-01,,,,2021-07-19T08:35:56,true,2,,26,,RUE,FAUBOURG,67430,DIEMERINGEN,,,67095,,,,,,,,,,,,,,,,,,,2020-12-31,F,,,,,66.22Z,NAFRev2,N,7.188356,48.937813,0.89,housenumber,26 Rue du Faubourg 67430 Diemeringen,67095_0100_00026,G,26 RUE DU FAUBOURG,
309675718,00055,30967571800055,O,2013-11-01,,,,2014-07-08T14:34:50,false,2,,69,,,GRAND RUE,67430,DIEMERINGEN,,,67095,,,,,,,,,,,,,,,,,,,2014-06-05,F,,,,,96.03Z,NAFRev2,N,7.186977,48.941822,0.96,housenumber,69 Grand-rue 67430 Diemeringen,67095_0280_00069,G,69 GRAND RUE,
310011358,00010,31001135800010,O,1977-01-01,NN,,,2006-11-25T09:25:38,true,3,,17,,,QUARTIER DES GLACIERES,67430,DIEMERINGEN,,,67095,,,,,,,,,,,,,,,,,,,2006-12-25,F,,,,,51.1R,NAFRev1,N,7.182684,48.939223,0.95,street,Quartier des Glacières 67430 Diemeringen,67095_ptksv1,G,QUARTIER DES GLACIERES,
311284392,00017,31128439200017,O,,,,,,true,1,,47,,,GRAND RUE,67430,DIEMERINGEN,,,67095,,,,,,,,,,,,,,,,,,,1986-01-31,F,,,,,64.45,NAP,N,7.186737,48.940225,0.96,housenumber,47 Grand-rue 67430 Diemeringen,67095_0280_00047,G,47 GRAND RUE,
311510390,00058,31151039000058,O,2011-09-01,01,2020,,2022-08-29T09:13:42,false,1,,50,,,GRAND RUE,67430,DIEMERINGEN,,,67095,,,,,,,,,,,,,,,,,,,2011-09-01,A,,,,,68.31Z,NAFRev2,O,7.186895,48.940459,0.96,housenumber,50 Grand-rue 67430 Diemeringen,67095_0280_00050,G,50 GRAND RUE,
312241466,00019,31224146600019,O,1978-01-01,NN,,,,true,1,,65,,RUE,GRAND RUE,67430,DIEMERINGEN,,,67095,,,,,,,,,,,,,,,,,,,1998-10-01,F,,,,,52.4V,NAF1993,O,7.186957,48.941535,0.84,housenumber,65 Grand-rue 67430 Diemeringen,67095_0280_00065,G,65 GRAND RUE,
312380173,00012,31238017300012,O,,NN,,,,true,1,,,,RTE,DE MACKWILLER,67430,DIEMERINGEN,,,67095,,,,,,,,,,,,,,,,,,,1992-06-25,F,,,,,26.2J,NAF1993,N,7.185363,48.937788,0.85,street,Route de Mackwiller 67430 Diemeringen,67095_0170,G,ROUTE DE MACKWILLER,
312478233,00017,31247823300017,O,1978-01-01,01,2020,4932ZA,2022-08-29T09:14:01,true,9,,2,,IMP,DU CHATEAU,67430,DIEMERINGEN,,,67095,,,,,,,,,,,,,,,,,,,2021-03-22,F,,,,,49.39B,NAFRev2,O,7.185757,48.939452,0.84,housenumber,2 Impasse du Château 67430 Diemeringen,67095_0020_00002,G,2 IMPASSE DU CHATEAU,
312478266,02583,31247826602583,O,2009-01-01,NN,,,2011-04-23T04:44:55,false,1,,,,RUE,TIERGARTEN,67430,DIEMERINGEN,,,67095,,,,,,,,,,,,,,,,,,,2009-01-01,A,REF INTERNE   653219,,,,56.29A,NAFRev2,O,7.182914,48.945593,0.95,street,Rue Tiergarten 67430 Diemeringen,67095_0305,G,RUE TIERGARTEN,
313029290,00027,31302929000027,O,1992-02-01,NN,,,2011-04-23T04:46:09,false,5,77-79 GRAND RUE,79,,,GRAND RUE,67430,DIEMERINGEN,,,67095,,,,,,,,,,,,,,,,,,,2009-02-01,F,,,,,47.53Z,NAFRev2,O,7.186699,48.943197,0.96,housenumber,79 Grand-rue 67430 Diemeringen,67095_0280_00079,G,79 GRAND RUE,
313029290,00043,31302929000043,O,2009-02-01,NN,,,2017-05-04T02:27:13,false,2,,53,,,GRAND RUE,67430,DIEMERINGEN,,,67095,,,,,,,,,,,,,,,,,,,2015-01-31,F,,,,,47.53Z,NAFRev2,O,7.186764,48.94056,0.96,housenumber,53 Grand-rue 67430 Diemeringen,67095_0280_00053,G,53 GRAND RUE,
313068280,00012,31306828000012,O,,NN,,,,true,1,,32,,,GRAND RUE,67430,DIEMERINGEN,,,67095,,,,,,,,,,,,,,,,,,,,F,,,,,53.05,NAP,N,7.186778,48.938767,0.96,housenumber,32 Grand-rue 67430 Diemeringen,67095_0280_00032,G,32 GRAND RUE,
313735326,00016,31373532600016,O,,NN,,,,true,1,,114,,,GRAND RUE,67430,DIEMERINGEN,,,67095,,,,,,,,,,,,,,,,,,,1990-06-16,F,,,,,84.11,NAP,N,7.186117,48.946042,0.96,housenumber,114 Grand-rue 67430 Diemeringen,67095_0280_00114,G,114 GRAND RUE,
314149956,00067,31414995600067,O,1991-10-01,,,,2008-01-04T20:27:22,false,3,,50,,,GRAND RUE,67430,DIEMERINGEN,,,67095,,,,,,,,,,,,,,,,,,,2008-01-01,A,BOUTIQUE MARIE CLAIR'S - DIGITAL,,,,47.71Z,NAFRev2,N,7.186895,48.940459,0.96,housenumber,50 Grand-rue 67430 Diemeringen,67095_0280_00050,G,50 GRAND RUE,
314457144,00017,31445714400017,O,1978-01-01,NN,,,2016-11-14T07:30:55,true,5,,3,,RUE,DES MUGUETS,67430,DIEMERINGEN,,,67095,,,,,,,,,,,,,,,,,,,2016-12-31,F,,,,,43.99C,NAFRev2,N,7.194194,48.940995,0.95,housenumber,3 Rue des Muguets 67430 Diemeringen,67095_0180_00003,G,3 RUE DES MUGUETS,
314816802,00024,31481680200024,O,1979-12-01,,,,2008-01-04T20:33:07,false,3,,57,,,GRAND RUE,67430,DIEMERINGEN,,,67095,,,,,,,,,,,,,,,,,,,2008-01-01,A,,,,,47.22Z,NAFRev2,N,7.186809,48.940782,0.96,housenumber,57 Grand-rue 67430 Diemeringen,67095_0280_00057,G,57 GRAND RUE,
315479436,00018,31547943600018,O,1979-01-01,NN,,,2008-01-04T20:39:13,true,6,,69,,,GRAND RUE,67430,DIEMERINGEN,,,67095,,,,,,,,,,,,,,,,,,,2007-07-30,F,,,,,52.4R,NAFRev1,N,7.186977,48.941822,0.96,housenumber,69 Grand-rue 67430 Diemeringen,67095_0280_00069,G,69 GRAND RUE,
315571638,00016,31557163800016,O,,NN,,,,true,1,,13,,RUE,DES TULIPES,67430,DIEMERINGEN,,,67095,,,,,,,,,,,,,,,,,,,1993-12-03,F,,,,,15.1A,NAF1993,N,7.193659,48.938794,0.95,housenumber,13 Rue des Tulipes 67430 Diemeringen,67095_0310_00013,G,13 RUE DES TULIPES,
315724229,00028,31572422900028,O,1981-12-01,00,2020,,2022-08-29T09:15:02,true,5,,18,,RUE,DU COLLEGE,67430,DIEMERINGEN,,,67095,,,,,,,,,,,,,,,,,,,2020-08-31,F,,,,,86.21Z,NAFRev2,O,7.191708,48.937404,0.95,housenumber,18 Rue du Collège 67430 Diemeringen,67095_0040_00018,G,18 RUE DU COLLEGE,
315992743,00023,31599274300023,O,1981-07-05,NN,,3299ZG,2015-03-18T00:59:55,true,4,,26,,RUE,DU FAUBOURG,67430,DIEMERINGEN,,,67095,,,,,,,,,,,,,,,,,,,2013-12-31,F,,,,,32.99Z,NAFRev2,N,7.188356,48.937813,0.96,housenumber,26 Rue du Faubourg 67430 Diemeringen,67095_0100_00026,G,26 RUE DU FAUBOURG,
315992743,00056,31599274300056,O,1990-07-15,NN,,3299ZG,2015-03-18T00:59:55,false,6,,35,,RUE,DES VOSGES,67430,DIEMERINGEN,,,67095,,,,,,,,,,,,,,,,,,,2013-12-31,F,ETS FLOREST,,,,32.99Z,NAFRev2,N,7.191423,48.933729,0.95,housenumber,35 Rue des Vosges 67430 Diemeringen,67095_0324_00035,G,35 RUE DES VOSGES,
316006014,00013,31600601400013,O,,,,,,true,1,,76,,,GRAND RUE,67430,DIEMERINGEN,,,67095,,,,,,,,,,,,,,,,,,,1984-12-25,F,,,,,84.12,NAP,N,7.187016,48.942822,0.96,housenumber,76 Grand-rue 67430 Diemeringen,67095_0280_00076,G,76 GRAND RUE,
316022482,00020,31602248200020,O,1984-01-01,NN,,,2019-05-07T08:40:42,true,9,,88,,RUE,GRAND RUE,67430,DIEMERINGEN,,,67095,,,,,,,,,,,,,,,,,,,2019-04-01,F,,,,,86.90E,NAFRev2,O,7.186623,48.943723,0.84,housenumber,88 Grand-rue 67430 Diemeringen,67095_0280_00088,G,88 GRAND RUE,
316064013,00014,31606401300014,O,1979-01-01,NN,,,2006-12-15T00:18:52,false,4,,43,,,GRAND RUE,67430,DIEMERINGEN,,,67095,,,,,,,,,,,,,,,,,,,1999-08-15,F,,,,,70.2C,NAF1993,N,7.186735,48.940159,0.96,housenumber,43 Grand-rue 67430 Diemeringen,67095_0280_00043,G,43 GRAND RUE,
316064195,00019,31606419500019,O,,NN,,,,true,1,,19,,RUE,DU COLLEGE,67430,DIEMERINGEN,,,67095,,,,,,,,,,,,,,,,,,,1995-09-30,F,,,,,74.2B,NAF1993,N,7.191724,48.939553,0.95,housenumber,19 Rue du Collège 67430 Diemeringen,67095_0040_00019,G,19 RUE DU COLLEGE,
316777333,00022,31677733300022,O,,,,,,true,1,,4,,,QU DE L EICHEL,67430,DIEMERINGEN,,,67095,,,,,,,,,,,,,,,,,,,1990-12-31,F,,,,,62.43,NAP,N,7.187758,48.940412,0.84,housenumber,4 Quai de l'Eichel 67430 Diemeringen,67095_0060_00004,G,4 QUAI DE L EICHEL,
316919687,00012,31691968700012,O,1979-01-01,NN,,,,true,1,,5,,IMP,DU CHATEAU,67430,DIEMERINGEN,,,67095,,,,,,,,,,,,,,,,,,,1998-10-18,F,,,,,70.2A,NAF1993,N,7.186101,48.939343,0.84,housenumber,5 Impasse du Château 67430 Diemeringen,67095_0020_00005,G,5 IMPASSE DU CHATEAU,
316961150,00018,31696115000018,O,,,,,,true,1,,46,,,GRAND RUE,67430,DIEMERINGEN,,,67095,,,,,,,,,,,,,,,,,,,1988-09-30,F,,,,,81.21,NAP,N,7.187013,48.939923,0.96,housenumber,46 Grand-rue 67430 Diemeringen,67095_0280_00046,G,46 GRAND RUE,
317545663,00021,31754566300021,O,1990-03-15,NN,,,,true,1,,27,,,GRAND RUE,67430,DIEMERINGEN,,,67095,,,,,,,,,,,,,,,,,,,1999-08-31,F,,,,,55.4B,NAF1993,O,7.186693,48.938968,0.96,housenumber,27 Grand-rue 67430 Diemeringen,67095_0280_00027,G,27 GRAND RUE,
317568327,00017,31756832700017,O,,NN,,,,true,1,,68,,RUE,PRINCIPALE,67430,DIEMERINGEN,,,67095,,,,,,,,,,,,,,,,,,,1981-08-15,F,,,,,49.01,NAP,N,7.187138,48.941587,0.4,housenumber,68 Grand-rue 67430 Diemeringen,67095_0280_00068,G,68 GRAND RUE,
317873818,00031,31787381800031,O,2000-02-01,NN,,,2008-04-26T09:13:50,true,3,,27,,,GRAND RUE,67430,DIEMERINGEN,,,67095,,,,,,,,,,,,,,,,,,,2006-06-30,F,,,,,67.2Z,NAFRev1,O,7.186693,48.938968,0.96,housenumber,27 Grand-rue 67430 Diemeringen,67095_0280_00027,G,27 GRAND RUE,
318169984,00016,31816998400016,O,1980-01-01,NN,,,2012-09-11T03:39:43,true,4,,14,,RUE,DES POTIERS,67430,DIEMERINGEN,,,67095,,,,,,,,,,,,,,,,,,,2012-07-31,F,,,,,68.20B,NAFRev2,N,7.189699,48.941006,0.95,housenumber,14 Rue des Potiers 67430 Diemeringen,67095_0200_00014,G,14 RUE DES POTIERS,
318410560,00011,31841056000011,O,,,,,,true,1,,6,,IMP,DU CHATEAU,67430,DIEMERINGEN,,,67095,,,,,,,,,,,,,,,,,,,1991-10-31,F,,,,,15.12,NAP,N,7.186281,48.939298,0.84,housenumber,6 Impasse du Château 67430 Diemeringen,67095_0020_00006,G,6 IMPASSE DU CHATEAU,
318509080,00012,31850908000012,O,,,,,,true,1,,2,,RUE,DE LA GARE,67430,DIEMERINGEN,,,67095,,,,,,,,,,,,,,,,,,,1984-12-25,F,,,,,67.08,NAP,N,7.18544,48.941757,0.95,housenumber,2 Rue de la Gare 67430 Diemeringen,67095_0120_00002,G,2 RUE DE LA GARE,