siren,nic,siret,statutDiffusionEtablissement,dateCreationEtablissement,trancheEffectifsEtablissement,anneeEffectifsEtablissement,activitePrincipaleRegistreMetiersEtablissement,dateDernierTraitementEtablissement,etablissementSiege,nombrePeriodesEtablissement,complementAdresseEtablissement,numeroVoieEtablissement,indiceRepetitionEtablissement,typeVoieEtablissement,libelleVoieEtablissement,codePostalEtablissement,libelleCommuneEtablissement,libelleCommuneEtrangerEtablissement,distributionSpecialeEtablissement,codeCommuneEtablissement,codeCedexEtablissement,libelleCedexEtablissement,codePaysEtrangerEtablissement,libellePaysEtrangerEtablissement,complementAdresse2Etablissement,numeroVoie2Etablissement,indiceRepetition2Etablissement,typeVoie2Etablissement,libelleVoie2Etablissement,codePostal2Etablissement,libelleCommune2Etablissement,libelleCommuneEtranger2Etablissement,distributionSpeciale2Etablissement,codeCommune2Etablissement,codeCedex2Etablissement,libelleCedex2Etablissement,codePaysEtranger2Etablissement,libellePaysEtranger2Etablissement,dateDebut,etatAdministratifEtablissement,enseigne1Etablissement,enseigne2Etablissement,enseigne3Etablissement,denominationUsuelleEtablissement,activitePrincipaleEtablissement,nomenclatureActivitePrincipaleEtablissement,caractereEmployeurEtablissement,longitude,latitude,geo_score,geo_type,geo_adresse,geo_id,geo_ligne,geo_l4,geo_l5
210101333,00016,21010133300016,O,1983-03-01,03,2020,,2022-08-29T09:05:37,true,4,HOTEL DE VILLE,,,,,01350,CRESSIN-ROCHEFORT,,,01133,,,,,,,,,,,,,,,,,,,2008-01-01,A,MAIRIE,,,,84.11Z,NAFRev2,O,5.768323,45.7887,0.33,street,Rue de la Chapelle 01350 Cressin-Rochefort,01133_0030,D,RUE DE LA CHAPELLE,
210101333,00024,21010133300024,O,1983-12-21,01,2020,,2022-08-29T09:05:37,false,3,,,,PL,DE LA MAIRIE,01350,CRESSIN-ROCHEFORT,,,01133,,,,,,,,,,,,,,,,,,,2008-01-01,A,ECOLE PRIMAIRE PUBLIQUE,,,,85.20Z,NAFRev2,N,5.765387,45.784425,0.82,street,Place de la Mairie 01350 Cressin-Rochefort,01133_0180,G,PLACE DE LA MAIRIE,
210101333,00032,21010133300032,O,1997-01-01,NN,,,2019-11-14T14:00:12,false,3,MAIRIE,,,,,01350,CRESSIN-ROCHEFORT,,,01133,,,,,,,,,,,,,,,,,,,2008-01-01,A,SCE EAU ET ASSAINISSEMENT,,,,36.00Z,NAFRev2,N,5.765387,45.784425,0.91,street,Place de la Mairie 01350 Cressin-Rochefort,01133_0180,D,PLACE DE LA MAIRIE,
240100263,00013,24010026300013,O,1983-03-01,NN,,,2019-11-14T14:00:12,false,3,,,,,HOTEL DE VILLE,01350,CRESSIN-ROCHEFORT,,,01133,,,,,,,,,,,,,,,,,,,1997-04-08,F,,,,,75.1A,NAF1993,,5.768323,45.7887,0.33,street,Rue de la Chapelle 01350 Cressin-Rochefort,01133_0030,G,RUE DE LA CHAPELLE,
250100351,00015,25010035100015,O,1983-03-01,NN,,,2019-11-14T14:00:12,true,4,,,,,HOTEL DE VILLE,01350,CRESSIN-ROCHEFORT,,,01133,,,,,,,,,,,,,,,,,,,2008-02-22,F,,,,,84.13Z,NAFRev2,N,5.768323,45.7887,0.33,street,Rue de la Chapelle 01350 Cressin-Rochefort,01133_0030,G,RUE DE LA CHAPELLE,
260103031,00019,26010303100019,O,1987-01-01,NN,,,2019-11-14T14:00:12,true,4,,,,,,01350,CRESSIN-ROCHEFORT,,,01133,,,,,,,,,,,,,,,,,,,2017-08-01,F,CCAS,,,,88.99B,NAFRev2,N,,,0,,,,,,
290100163,00010,29010016300010,O,1981-11-16,NN,,,2019-11-14T14:00:12,true,3,,,,,MAIRIE,01350,CRESSIN-ROCHEFORT,,,01133,,,,,,,,,,,,,,,,,,,1995-12-31,F,ROCHEFORT,,,,70.1C,NAF1993,N,5.765387,45.784425,0.91,street,Place de la Mairie 01350 Cressin-Rochefort,01133_0180,G,PLACE DE LA MAIRIE,
307685636,00010,30768563600010,O,1976-01-01,NN,,,2019-11-14T14:00:12,true,6,,,,,ROCHEFORT,01350,CRESSIN-ROCHEFORT,,,01133,,,,,,,,,,,,,,,,,,,2011-12-12,F,,,,,43.21A,NAFRev2,N,5.767893,45.786872,0.92,street,Grande Rue 01350 Cressin-Rochefort,01133_0130,G,GRANDE RUE,
320674690,00013,32067469000013,O,1980-11-13,,,,2019-11-14T14:00:12,true,5,,,,,PARISSIEU,01350,CRESSIN-ROCHEFORT,,,01133,,,,,,,,,,,,,,,,,,,2017-07-01,F,,,,,01.21Z,NAFRev2,N,5.762562,45.78089,0.92,street,Route de Parissieu 01350 Cressin-Rochefort,01133_0210,G,ROUTE DE PARISSIEU,
324564756,00025,32456475600025,O,,,,,2019-11-14T14:00:12,true,1,,,,,,01350,CRESSIN-ROCHEFORT,,,01133,,,,,,,,,,,,,,,,,,,1988-12-31,F,,,,,55.40,NAP,N,,,0,,,,,,
328716188,00029,32871618800029,O,,NN,,,2019-11-14T14:00:12,true,1,,,,,,01350,CRESSIN-ROCHEFORT,,,01133,,,,,,,,,,,,,,,,,,,1990-09-12,F,,,,,51.1R,NAF1993,N,,,0,,,,,,
338491723,00015,33849172300015,O,,NN,,,2019-11-14T14:00:12,true,1,,,,,,01350,CRESSIN-ROCHEFORT,,,01133,,,,,,,,,,,,,,,,,,,1987-09-18,F,,,,,67.01,NAP,N,,,0,,,,,,
340445220,00049,34044522000049,P,2003-06-01,NN,,,2019-11-14T14:00:12,false,4,[ND],[ND],[ND],[ND],[ND],[ND],CRESSIN-ROCHEFORT,,[ND],01133,[ND],[ND],,,[ND],[ND],[ND],[ND],[ND],[ND],,,[ND],,[ND],[ND],,,2005-01-01,F,[ND],[ND],[ND],[ND],51.5E,NAFRev1,O,,,0,,,,,,
340622703,00023,34062270300023,O,,NN,,,2019-11-14T14:00:12,true,1,,,,,MAISON RECAMIER,01350,CRESSIN-ROCHEFORT,,,01133,,,,,,,,,,,,,,,,,,,1990-09-15,F,,,,,86.10,NAP,N,,,0,,,,,,
342437381,00037,34243738100037,O,1996-06-01,,,,2019-11-14T14:00:12,false,3,,,,,,01350,CRESSIN-ROCHEFORT,,,01133,,,,,,,,,,,,,,,,,,,1997-09-30,F,,,,,55.3A,NAF1993,,,,0,,,,,,
348342304,00014,34834230400014,O,1988-10-03,NN,,,2019-11-14T14:00:12,true,1,,,,,,01350,CRESSIN-ROCHEFORT,,,01133,,,,,,,,,,,,,,,,,,,2001-04-12,F,,,,,45.2J,NAF1993,N,,,0,,,,,,
351597851,00010,35159785100010,O,,NN,,,2019-11-14T14:00:12,true,1,,,,,,01350,CRESSIN-ROCHEFORT,,,01133,,,,,,,,,,,,,,,,,,,1989-09-30,F,,,,,55.3A,NAF1993,N,,,0,,,,,,
378963052,00048,37896305200048,O,1995-07-14,NN,,,2019-11-14T14:00:12,true,4,PLAGE DE L ECOINCON,,,,,01350,CRESSIN-ROCHEFORT,,,01133,,,,,,,,,,,,,,,,,,,1998-12-31,F,,,,,92.7C,NAF1993,N,5.772138,45.779636,0.7,street,Route de l’Ecoincon 01350 Cressin-Rochefort,01133_0090,D,ROUTE DE L ECOINCON,
379293780,00019,37929378000019,O,1990-10-03,NN,,4332AA,2023-09-06T11:33:29,true,6,LE MOLLARD,114,,,LES GRANDS HAUTINS,01350,CRESSIN-ROCHEFORT,,,01133,,,,,,,,,,,,,,,,,,,2023-06-01,F,,,,,43.99C,NAFRev2,N,5.764956,45.788455,0.94,housenumber,114 Les Grands Hautins 01350 Cressin-Rochefort,01133_b045_00114,G,114 LES GRANDS HAUTINS,
385249115,00028,38524911500028,O,2019-10-31,,,,2019-12-16T11:55:54,true,1,,125,,CHE,DU CHATEAU,01350,CRESSIN-ROCHEFORT,,,01133,,,,,,,,,,,,,,,,,,,2019-10-31,A,,,,,68.20B,NAFRev2,N,5.767432,45.788363,0.84,housenumber,125 Chemin du Chateau 01350 Cressin-Rochefort,01133_0050_00125,G,125 CHEMIN DU CHATEAU,
388729212,00018,38872921200018,O,1992-10-01,NN,,,2019-11-14T14:00:12,true,4,,,,,,01350,CRESSIN-ROCHEFORT,,,01133,,,,,,,,,,,,,,,,,,,2008-12-31,F,,,,,02.20Z,NAFRev2,N,,,0,,,,,,
390242782,00014,39024278200014,O,1993-03-08,NN,,,2019-11-14T14:00:12,false,3,,,,,PARISSIEU,01350,CRESSIN-ROCHEFORT,,,01133,,,,,,,,,,,,,,,,,,,1995-10-01,F,,,,,29.2F,NAF1993,,5.762562,45.78089,0.92,street,Route de Parissieu 01350 Cressin-Rochefort,01133_0210,G,ROUTE DE PARISSIEU,
392023677,00025,39202367700025,O,2015-04-01,,,4321AB,2019-11-14T14:00:12,true,2,,280,,RUE,DE L'ECOLE,01350,CRESSIN-ROCHEFORT,,,01133,,,,,,,,,,,,,,,,,,,2017-03-31,F,,,,D.E,43.21A,NAFRev2,N,5.763196,45.786316,0.94,housenumber,280 Rue de l’Ecole 01350 Cressin-Rochefort,01133_0100_00280,G,280 RUE DE L ECOLE,
393912803,00011,39391280300011,O,1994-01-01,NN,,,2021-06-16T03:40:01,true,4,,,,,,01350,CRESSIN-ROCHEFORT,,,01133,,,,,,,,,,,,,,,,,,,2021-06-02,F,,,,,01.21Z,NAFRev2,N,,,0,,,,,,
394465603,00014,39446560300014,O,1993-01-01,NN,,,2019-11-14T14:00:12,true,3,,,,,,01350,CRESSIN-ROCHEFORT,,,01133,,,,,,,,,,,,,,,,,,,2008-01-01,A,,,,,01.11Z,NAFRev2,N,,,0,,,,,,
394983233,00013,39498323300013,O,1994-05-10,NN,,,2019-11-14T14:00:12,true,5,,,,,,01350,CRESSIN-ROCHEFORT,,,01133,,,,,,,,,,,,,,,,,,,2014-09-30,F,,,,,68.20B,NAFRev2,N,,,0,,,,,,
395269731,00026,39526973100026,O,1998-07-01,NN,,,2019-11-14T14:00:12,true,5,,,,,,01350,CRESSIN-ROCHEFORT,,,01133,,,,,,,,,,,,,,,,,,,2008-07-01,A,,,,,68.20B,NAFRev2,N,,,0,,,,,,
402728406,00057,40272840600057,O,2014-01-01,,,,2019-11-14T14:00:12,true,2,,67,,RUE,DU PUITS,01350,CRESSIN-ROCHEFORT,,,01133,,,,,,,,,,,,,,,,,,,2014-11-17,F,,,,,45.20A,NAFRev2,N,5.759773,45.776204,0.94,housenumber,67 Rue du Puits 01350 Cressin-Rochefort,01133_0230_00067,G,67 RUE DU PUITS,
402892566,00017,40289256600017,O,1995-11-23,NN,,,2019-11-14T14:00:12,false,3,PARISSIEU,,,,,01350,CRESSIN-ROCHEFORT,,,01133,,,,,,,,,,,,,,,,,,,1998-12-31,F,,,,,45.4M,NAF1993,O,5.762562,45.78089,0.92,street,Route de Parissieu 01350 Cressin-Rochefort,01133_0210,D,ROUTE DE PARISSIEU,
409102761,00015,40910276100015,O,1969-01-01,NN,,,2019-11-14T14:00:12,true,4,,,,,,01350,CRESSIN-ROCHEFORT,,,01133,,,,,,,,,,,,,,,,,,,2006-12-31,F,,,,,01.1A,NAFRev1,N,,,0,,,,,,
409103256,00015,40910325600015,O,1982-01-01,NN,,,2019-11-14T14:00:12,false,4,,,,,PARISSIEU,01350,CRESSIN-ROCHEFORT,,,01133,,,,,,,,,,,,,,,,,,,2009-12-31,F,,,,,01.11Z,NAFRev2,N,5.762562,45.78089,0.92,street,Route de Parissieu 01350 Cressin-Rochefort,01133_0210,G,ROUTE DE PARISSIEU,
409103256,00023,40910325600023,O,2009-01-01,,,,2021-02-23T11:31:14,true,1,121 RUE DE,,,,LA PEROUZE,01350,CRESSIN-ROCHEFORT,,,01133,,,,,,,,,,,,,,,,,,,2009-01-01,A,,,,,46.73A,NAFRev2,N,5.763294,45.785437,0.94,street,La Perouze 01350 Cressin-Rochefort,01133_00ett2,G,LA PEROUZE,
418850574,00017,41885057400017,O,1988-12-31,NN,,,2019-11-14T14:00:12,true,3,,,,,,01350,CRESSIN-ROCHEFORT,,,01133,,,,,,,,,,,,,,,,,,,2008-01-01,A,,,,,01.11Z,NAFRev2,N,,,0,,,,,,
424367407,00014,42436740700014,O,1999-08-28,NN,,,2022-09-06T03:48:52,true,3,CLOS DU CHATEAU,,,,,01350,CRESSIN-ROCHEFORT,,,01133,,,,,,,,,,,,,,,,,,,2008-01-01,A,,,,,68.20A,NAFRev2,N,5.767645,45.788397,0.65,street,Chemin du Chateau 01350 Cressin-Rochefort,01133_0050,D,CHEMIN DU CHATEAU,
428793277,00016,42879327700016,O,1999-12-24,NN,,,2019-11-14T14:00:12,true,3,,5,,IMP,DU FOUR,01350,CRESSIN-ROCHEFORT,,,01133,,,,,,,,,,,,,,,,,,,2008-01-01,A,,,,,68.20A,NAFRev2,N,5.761947,45.785953,0.81,housenumber,5 Impasse du Four 01350 Cressin-Rochefort,01133_0120_00005,G,5 IMPASSE DU FOUR,
433425006,00023,43342500600023,P,2010-03-26,,,,2023-08-16T10:35:23,true,3,[ND],[ND],[ND],[ND],[ND],[ND],CRESSIN-ROCHEFORT,,[ND],01133,[ND],[ND],,,[ND],[ND],[ND],[ND],[ND],[ND],,,[ND],,[ND],[ND],,,2023-08-11,A,[ND],[ND],[ND],[ND],74.30Z,NAFRev2,N,,,0,,,,,,
437908437,00019,43790843700019,P,2001-06-01,NN,,4321AB,2023-03-21T12:25:07,true,9,[ND],[ND],[ND],[ND],[ND],[ND],CRESSIN-ROCHEFORT,,[ND],01133,[ND],[ND],,,[ND],[ND],[ND],[ND],[ND],[ND],,,[ND],,[ND],[ND],,,2023-03-20,A,[ND],[ND],[ND],[ND],43.21A,NAFRev2,N,,,0,,,,,,
439140237,00041,43914023700041,O,2014-12-01,01,2020,,2023-02-02T03:36:20,true,2,,,,,SITE DE L'ECOINCON,01350,CRESSIN-ROCHEFORT,,,01133,,,,,,,,,,,,,,,,,,,2022-12-31,F,,,,,56.10A,NAFRev2,O,5.772138,45.779636,0.79,street,Route de l’Ecoincon 01350 Cressin-Rochefort,01133_0090,G,ROUTE DE L ECOINCON,
441962347,00015,44196234700015,O,2002-04-01,NN,,4321AB,2019-11-14T14:00:12,true,5,,,,,VERS ECOLE,01350,CRESSIN-ROCHEFORT,,,01133,,,,,,,,,,,,,,,,,,,2014-12-31,F,,,,,43.21A,NAFRev2,N,5.76416,45.786148,0.51,street,Rue de l’Ecole 01350 Cressin-Rochefort,01133_0100,G,RUE DE L ECOLE,
443598917,00013,44359891700013,O,2002-08-03,NN,,,2019-11-14T14:00:12,true,3,,,,,ILE BEARD,01350,CRESSIN-ROCHEFORT,,,01133,,,,,,,,,,,,,,,,,,,2008-01-01,A,,,,,01.49Z,NAFRev2,N,5.765313,45.789254,0.37,street,Le Mollard 01350 Cressin-Rochefort,01133_dknlgo,G,LE MOLLARD,
453349052,00028,45334905200028,O,2014-06-01,,,,2019-11-14T14:00:12,false,2,,96,,RTE,DE PARISSIEU,01350,CRESSIN-ROCHEFORT,,,01133,,,,,,,,,,,,,,,,,,,2015-12-31,F,,,,,81.29B,NAFRev2,N,5.762855,45.77978,0.85,housenumber,96 Route de Parissieu 01350 Cressin-Rochefort,01133_0210_00096,G,96 ROUTE DE PARISSIEU,
484311857,00011,48431185700011,O,2005-08-10,,,,2020-03-20T03:42:19,true,2,,272,,RTE,DE BELLEY,01350,CRESSIN-ROCHEFORT,,,01133,,,,,,,,,,,,,,,,,,,2008-01-01,A,,,,,68.20B,NAFRev2,N,5.768126,45.784104,0.83,housenumber,272 Route de Belley 01350 Cressin-Rochefort,01133_0010_00272,G,272 ROUTE DE BELLEY,
487624942,00032,48762494200032,O,2008-08-11,,,,2019-11-14T14:00:12,true,2,,35,,RUE,DE LA CHAPELLE,01350,CRESSIN-ROCHEFORT,,,01133,,,,,,,,,,,,,,,,,,,2008-12-31,F,,,,,43.22B,NAFRev2,O,5.768326,45.788728,0.94,housenumber,35 Rue de la Chapelle 01350 Cressin-Rochefort,01133_0030_00035,G,35 RUE DE LA CHAPELLE,
493095509,00011,49309550900011,O,2006-11-16,,,,2019-11-14T14:00:12,false,3,,,,,ROCHEFORT,01350,CRESSIN-ROCHEFORT,,,01133,,,,,,,,,,,,,,,,,,,2010-08-01,F,,,,,68.20B,NAFRev2,N,5.767893,45.786872,0.92,street,Grande Rue 01350 Cressin-Rochefort,01133_0130,G,GRANDE RUE,
493095509,00029,49309550900029,O,2010-08-01,,,,2021-02-23T14:00:31,true,1,,67,,RUE,DU PUITS,01350,CRESSIN-ROCHEFORT,,,01133,,,,,,,,,,,,,,,,,,,2010-08-01,A,,,,,68.20B,NAFRev2,N,5.759773,45.776204,0.94,housenumber,67 Rue du Puits 01350 Cressin-Rochefort,01133_0230_00067,G,67 RUE DU PUITS,
493649248,00017,49364924800017,O,2007-01-01,,,,2023-01-09T11:06:37,true,2,,248,,RUE,DU FOUR,01350,CRESSIN-ROCHEFORT,,,01133,,,,,,,,,,,,,,,,,,,2008-01-01,A,,,,,01.50Z,NAFRev2,N,5.759978,45.776931,0.94,housenumber,248 Rue du Four 01350 Cressin-Rochefort,01133_0125_00248,G,248 RUE DU FOUR,
503811812,00018,50381181200018,O,2008-04-01,NN,,,2019-11-14T14:00:12,true,2,,272,,RTE,DE BELLEY,01350,CRESSIN-ROCHEFORT,,,01133,,,,,,,,,,,,,,,,,,,2010-10-22,F,CENOLLI PRO BAT CHARPENTE,,,,43.99C,NAFRev2,O,5.768126,45.784104,0.83,housenumber,272 Route de Belley 01350 Cressin-Rochefort,01133_0010_00272,G,272 ROUTE DE BELLEY,
503987489,00013,50398748900013,O,2007-07-31,,,,2020-03-25T03:44:39,false,2,PARISSIEU,36,,RUE,DE LA SOURCE,01350,CRESSIN-ROCHEFORT,,,01133,,,,,,,,,,,,,,,,,,,2020-03-02,F,,,,,86.90D,NAFRev2,N,5.761742,45.786407,0.94,housenumber,36 Rue de la Source 01350 Cressin-Rochefort,01133_0255_00036,G,36 RUE DE LA SOURCE,
504841990,00014,50484199000014,O,2008-07-01,NN,,4322AZ,2019-11-14T14:00:12,false,2,,,,,IMPASSE DES DOUANIERS,01350,CRESSIN-ROCHEFORT,,,01133,,,,,,,,,,,,,,,,,,,2017-07-10,F,,,,,43.22A,NAFRev2,O,5.768738,45.788293,0.94,street,Impasse des Douaniers 01350 Cressin-Rochefort,01133_0080,G,IMPASSE DES DOUANIERS,
507766244,00010,50776624400010,O,2007-01-01,,,,2019-11-14T14:00:12,false,1,PARISSIEU,,,,,01350,CRESSIN-ROCHEFORT,,,01133,,,,,,,,,,,,,,,,,,,2007-01-01,A,,,,,01.61Z,NAFRev2,N,5.762562,45.78089,0.92,street,Route de Parissieu 01350 Cressin-Rochefort,01133_0210,D,ROUTE DE PARISSIEU,
507766244,00028,50776624400028,O,1993-09-01,,,,2021-02-23T14:19:57,true,1,,48,,IMP,DU FOUR,01350,CRESSIN-ROCHEFORT,,,01133,,,,,,,,,,,,,,,,,,,1993-09-01,A,,,,,01.21Z,NAFRev2,N,5.761645,45.785754,0.81,housenumber,48 Impasse du Four 01350 Cressin-Rochefort,01133_0120_00048,G,48 IMPASSE DU FOUR,
518013685,00012,51801368500012,O,2009-11-01,,,,2019-11-14T14:00:12,false,2,,69,,RUE,DE LA CHAPELLE,01350,CRESSIN-ROCHEFORT,,,01133,,,,,,,,,,,,,,,,,,,2010-11-01,F,,,,,56.10C,NAFRev2,N,5.768442,45.788611,0.94,housenumber,69 Rue de la Chapelle 01350 Cressin-Rochefort,01133_0030_00069,G,69 RUE DE LA CHAPELLE,
519330534,00016,51933053400016,O,2010-01-01,NN,,,2019-11-14T14:00:12,true,2,,150,,RUE,DU CENTRE,01350,CRESSIN-ROCHEFORT,,,01133,,,,,,,,,,,,,,,,,,,2014-12-31,A,,,,,01.11Z,NAFRev2,O,5.760484,45.786163,0.94,housenumber,150 Rue du Centre 01350 Cressin-Rochefort,01133_0020_00150,G,150 RUE DU CENTRE,
521005496,00018,52100549600018,O,2010-01-01,,,,2019-11-14T14:00:12,true,1,PARISSIEU,121,,,LA PEROUZE,01350,CRESSIN-ROCHEFORT,,,01133,,,,,,,,,,,,,,,,,,,2010-01-01,A,,,,,01.21Z,NAFRev2,N,5.763551,45.785173,0.94,housenumber,121 La Perouze 01350 Cressin-Rochefort,01133_00ett2_00121,G,121 LA PEROUZE,
521176511,00025,52117651100025,O,2016-03-10,,,4520AA,2022-07-01T19:34:22,false,4,,68,,RUE,DE LA CHAPELLE,01350,CRESSIN-ROCHEFORT,,,01133,,,,,,,,,,,,,,,,,,,2022-02-01,F,,,,MECA AUTO SERVICE 01,45.20A,NAFRev2,N,5.768198,45.788458,0.94,housenumber,68 Rue de la Chapelle 01350 Cressin-Rochefort,01133_0030_00068,G,68 RUE DE LA CHAPELLE,
521421487,00013,52142148700013,O,2010-03-26,,,,2019-11-14T14:00:12,false,2,,152,,RUE,DU PARC,01350,CRESSIN-ROCHEFORT,,,01133,,,,,,,,,,,,,,,,,,,2012-12-12,F,,,,,74.30Z,NAFRev2,N,5.761895,45.778013,0.94,housenumber,152 Rue du Parc 01350 Cressin-Rochefort,01133_0200_00152,G,152 RUE DU PARC,
523883312,00010,52388331200010,O,2010-06-01,NN,,5610CQ,2019-11-14T14:00:12,false,2,,,,,ILE BEARD,01350,CRESSIN-ROCHEFORT,,,01133,,,,,,,,,,,,,,,,,,,2015-01-01,F,,,,,56.10A,NAFRev2,O,5.765313,45.789254,0.37,street,Le Mollard 01350 Cressin-Rochefort,01133_dknlgo,G,LE MOLLARD,
530413624,00020,53041362400020,P,2017-06-15,,,4322AZ,2020-07-11T03:37:06,false,2,[ND],[ND],[ND],[ND],[ND],[ND],CRESSIN-ROCHEFORT,,[ND],01133,[ND],[ND],,,[ND],[ND],[ND],[ND],[ND],[ND],,,[ND],,[ND],[ND],,,2018-06-20,F,[ND],[ND],[ND],[ND],43.22A,NAFRev2,N,,,0,,,,,,
537577397,00020,53757739700020,O,2011-09-01,01,2020,4399CZ,2022-08-29T09:36:02,true,5,,272,B,RTE,DE BELLEY,01350,CRESSIN-ROCHEFORT,,,01133,,,,,,,,,,,,,,,,,,,2017-06-01,A,,,,,43.99C,NAFRev2,O,5.768126,45.784104,0.61,street,Route de Belley 01350 Cressin-Rochefort,01133_0010,G,ROUTE DE BELLEY,
539979849,00012,53997984900012,O,2012-01-15,,,4321AB,2020-01-17T03:53:30,true,5,,87,,,GRANDE RUE,01350,CRESSIN-ROCHEFORT,,,01133,,,,,,,,,,,,,,,,,,,2019-12-31,F,EIRL YANN BANC,,,YELM ELEC,43.21A,NAFRev2,N,5.768672,45.788057,0.95,housenumber,87 Grande Rue 01350 Cressin-Rochefort,01133_0130_00087,G,87 GRANDE RUE,
546810029,00019,54681002900019,O,,,,,2019-11-14T14:00:12,true,1,,,,,,01350,CRESSIN-ROCHEFORT,,,01133,,,,,,,,,,,,,,,,,,,1984-12-25,F,,,,,,,N,,,0,,,,,,
547110346,00012,54711034600012,O,,NN,,,2019-11-14T14:00:12,true,1,,,,,,01350,CRESSIN-ROCHEFORT,,,01133,,,,,,,,,,,,,,,,,,,1992-09-30,F,,,,,51.5E,NAF1993,N,,,0,,,,,,
753307271,00019,75330727100019,O,2012-09-01,,,7420ZR,2021-02-23T16:10:16,true,1,,26,,RTE,DES GRANGES,01350,CRESSIN-ROCHEFORT,,,01133,,,,,,,,,,,,,,,,,,,2012-09-01,A,,,,CRYSTAL EDIT PHOTO,74.20Z,NAFRev2,N,5.768613,45.78916,0.84,housenumber,26 Route des Granges 01350 Cressin-Rochefort,01133_0140_00026,G,26 ROUTE DES GRANGES,
779323393,00016,77932339300016,O,,NN,,,2019-11-14T14:00:12,true,1,,,,,,01350,CRESSIN-ROCHEFORT,,,01133,,,,,,,,,,,,,,,,,,,1983-01-01,F,,,,,01.4A,NAF1993,N,,,0,,,,,,
779323419,00019,77932341900019,O,,,,,2019-11-14T14:00:12,true,1,,,,,,01350,CRESSIN-ROCHEFORT,,,01133,,,,,,,,,,,,,,,,,,,1984-12-25,F,,,,,22.02,NAP,N,,,0,,,,,,
793769936,00022,79376993600022,O,2019-08-02,,,,2022-05-31T08:45:50,true,2,,150,,RUE,DU CENTRE,01350,CRESSIN-ROCHEFORT,,,01133,,,,,,,,,,,,,,,,,,,2022-04-30,F,,,,,52.29B,NAFRev2,N,5.760484,45.786163,0.94,housenumber,150 Rue du Centre 01350 Cressin-Rochefort,01133_0020_00150,G,150 RUE DU CENTRE,
794979450,00010,79497945000010,O,2013-09-01,,,,2019-11-14T14:00:12,true,1,,13,,RUE,DU PUITS,01350,CRESSIN-ROCHEFORT,,,01133,,,,,,,,,,,,,,,,,,,2013-09-01,A,,,,,46.19B,NAFRev2,N,5.759979,45.776446,0.94,housenumber,13 Rue du Puits 01350 Cressin-Rochefort,01133_0230_00013,G,13 RUE DU PUITS,
798239521,00015,79823952100015,O,2013-10-22,,,,2019-11-14T14:00:12,true,1,,248,,RUE,DU FOUR,01350,CRESSIN-ROCHEFORT,,,01133,,,,,,,,,,,,,,,,,,,2013-10-22,A,,,,,68.20B,NAFRev2,N,5.759978,45.776931,0.94,housenumber,248 Rue du Four 01350 Cressin-Rochefort,01133_0125_00248,G,248 RUE DU FOUR,
799496765,00022,79949676500022,O,2015-05-20,,,4332AA,2021-02-23T16:28:38,true,1,,9,,RUE,DU CENTRE PARISSIEU,01350,CRESSIN-ROCHEFORT,,,01133,,,,,,,,,,,,,,,,,,,2015-05-20,A,,,,JACQUET CYRIL MENUISIER POSEUR,43.32B,NAFRev2,N,5.762562,45.78089,0.48,street,Route de Parissieu 01350 Cressin-Rochefort,01133_0210,G,ROUTE DE PARISSIEU,
799554332,00012,79955433200012,P,2014-01-01,,,,2019-11-14T14:00:12,true,3,[ND],[ND],[ND],[ND],[ND],[ND],CRESSIN-ROCHEFORT,,[ND],01133,[ND],[ND],,,[ND],[ND],[ND],[ND],[ND],[ND],,,[ND],,[ND],[ND],,,2017-09-23,A,[ND],[ND],[ND],[ND],85.51Z,NAFRev2,N,,,0,,,,,,
799962485,00014,79996248500014,O,2014-01-19,,,,2021-02-23T17:14:04,true,1,,255,,RUE,DU PARC,01350,CRESSIN-ROCHEFORT,,,01133,,,,,,,,,,,,,,,,,,,2014-01-19,A,VIVE CREATIONS MAROQUINERIE,,,VIVE CREATIONS,15.12Z,NAFRev2,N,5.761698,45.777035,0.94,housenumber,255 Rue du Parc 01350 Cressin-Rochefort,01133_0200_00255,G,255 RUE DU PARC,
801012865,00011,80101286500011,O,2014-01-23,,,,2019-11-14T14:00:12,true,1,,20,,IMP,DES TERRASSES,01350,CRESSIN-ROCHEFORT,,,01133,,,,,,,,,,,,,,,,,,,2014-01-23,A,,,,,35.11Z,NAFRev2,N,5.767872,45.787352,0.85,housenumber,20 Impasse des Terrasses 01350 Cressin-Rochefort,01133_0260_00020,G,20 IMPASSE DES TERRASSES,
802138305,00015,80213830500015,O,1989-12-30,,,,2019-11-14T14:00:12,true,1,,,,,MAIRIE,01350,CRESSIN-ROCHEFORT,,,01133,,,,,,,,,,,,,,,,,,,1989-12-30,A,,,,,94.99Z,NAFRev2,N,5.765387,45.784425,0.91,street,Place de la Mairie 01350 Cressin-Rochefort,01133_0180,G,PLACE DE LA MAIRIE,
802474247,00011,80247424700011,O,2013-04-19,,,,2019-11-14T14:00:12,true,1,MAIRIE,,,,,01350,CRESSIN-ROCHEFORT,,,01133,,,,,,,,,,,,,,,,,,,2013-04-19,A,,,,,94.99Z,NAFRev2,N,5.765387,45.784425,0.91,street,Place de la Mairie 01350 Cressin-Rochefort,01133_0180,D,PLACE DE LA MAIRIE,
814861811,00010,81486181100010,P,2015-11-25,,,,2020-10-25T20:00:22,true,2,[ND],[ND],[ND],[ND],[ND],[ND],CRESSIN-ROCHEFORT,,[ND],01133,[ND],[ND],,,[ND],[ND],[ND],[ND],[ND],[ND],,,[ND],,[ND],[ND],,,2019-05-18,F,[ND],[ND],[ND],[ND],93.29Z,NAFRev2,N,,,0,,,,,,
818031221,00018,81803122100018,O,2016-02-01,,,2229BZ,2021-09-08T16:43:47,true,1,,395,,,GRANDE RUE,01350,CRESSIN-ROCHEFORT,,,01133,,,,,,,,,,,,,,,,,,,2016-02-01,A,SOFT-TECH,,,,22.29B,NAFRev2,N,5.766644,45.785381,0.95,housenumber,395 Grande Rue 01350 Cressin-Rochefort,01133_0130_00395,G,395 GRANDE RUE,
818693566,00015,81869356600015,O,2008-09-01,,,,2019-11-14T14:00:12,true,1,,395,,,GRANDE RUE,01350,CRESSIN-ROCHEFORT,,,01133,,,,,,,,,,,,,,,,,,,2008-09-01,A,,,,,68.20A,NAFRev2,N,5.766644,45.785381,0.95,housenumber,395 Grande Rue 01350 Cressin-Rochefort,01133_0130_00395,G,395 GRANDE RUE,
821062841,00019,82106284100019,O,2016-06-03,02,2020,2620ZZ,2022-08-29T10:11:53,false,5,,212,,RUE,DE LA MONTAGNE,01350,CRESSIN-ROCHEFORT,,,01133,,,,,,,,,,,,,,,,,,,2021-07-01,F,,,,INOVEC INDUSTRIES,25.62B,NAFRev2,O,5.759014,45.776797,0.94,housenumber,212 Rue de la Montagne 01350 Cressin-Rochefort,01133_0190_00212,G,212 RUE DE LA MONTAGNE,
821062841,00043,82106284100043,O,2023-04-02,,,,2023-08-06T20:30:01,true,1,,235,,RUE,DE LA MONTAGNE,01350,CRESSIN-ROCHEFORT,,,01133,,,,,,,,,,,,,,,,,,,2023-04-02,A,,,,,25.62B,NAFRev2,N,5.759626,45.776613,0.8,street,Rue de la Montagne 01350 Cressin-Rochefort,01133_0190,G,RUE DE LA MONTAGNE,
827574799,00017,82757479900017,O,2017-02-09,,,2599BA,2020-12-17T08:34:03,true,2,,146,,RTE,DE CRESSIN,01350,CRESSIN-ROCHEFORT,,,01133,,,,,,,,,,,,,,,,,,,2020-01-30,F,,,,,25.99B,NAFRev2,N,5.764421,45.783665,0.85,housenumber,146 Route de Cressin 01350 Cressin-Rochefort,01133_0070_00146,G,146 ROUTE DE CRESSIN,
829115633,00028,82911563300028,P,2019-09-01,,,4776ZP,2023-05-22T15:12:45,true,1,[ND],[ND],[ND],[ND],[ND],[ND],CRESSIN-ROCHEFORT,,[ND],01133,[ND],[ND],,,[ND],[ND],[ND],[ND],[ND],[ND],,,[ND],,[ND],[ND],,,2019-09-01,A,[ND],[ND],[ND],[ND],47.76Z,NAFRev2,N,,,0,,,,,,
830725610,00018,83072561000018,O,2017-07-06,,,9602BA,2019-11-14T14:00:12,true,2,,195,,,LOTISSEMENT LES GRANDS HAUTINS,01350,CRESSIN-ROCHEFORT,,,01133,,,,,,,,,,,,,,,,,,,2018-11-10,F,,,,MILLE & UN ONGLES,96.02B,NAFRev2,N,5.764056,45.788666,0.67,housenumber,195 Les Grands Hautins 01350 Cressin-Rochefort,01133_b045_00195,G,195 LES GRANDS HAUTINS,
831683362,00022,83168336200022,P,2018-12-01,,,,2022-10-17T20:01:44,false,2,[ND],[ND],[ND],[ND],[ND],[ND],CRESSIN-ROCHEFORT,,[ND],01133,[ND],[ND],,,[ND],[ND],[ND],[ND],[ND],[ND],,,[ND],,[ND],[ND],,,2022-02-01,F,[ND],[ND],[ND],[ND],86.90F,NAFRev2,N,,,0,,,,,,
832018873,00030,83201887300030,P,2021-10-17,,,,2023-09-02T13:36:34,true,2,[ND],[ND],[ND],[ND],[ND],[ND],CRESSIN-ROCHEFORT,,[ND],01133,[ND],[ND],,,[ND],[ND],[ND],[ND],[ND],[ND],,,[ND],,[ND],[ND],,,2023-07-21,A,[ND],[ND],[ND],[ND],86.90F,NAFRev2,N,,,0,,,,,,
834810988,00016,83481098800016,P,2018-02-01,,,,2021-07-16T09:02:29,true,2,[ND],[ND],[ND],[ND],[ND],[ND],CRESSIN-ROCHEFORT,,[ND],01133,[ND],[ND],,,[ND],[ND],[ND],[ND],[ND],[ND],,,[ND],,[ND],[ND],,,2020-12-31,F,[ND],[ND],[ND],[ND],96.09Z,NAFRev2,N,,,0,,,,,,