siren,nic,siret,statutDiffusionEtablissement,dateCreationEtablissement,trancheEffectifsEtablissement,anneeEffectifsEtablissement,activitePrincipaleRegistreMetiersEtablissement,dateDernierTraitementEtablissement,etablissementSiege,nombrePeriodesEtablissement,complementAdresseEtablissement,numeroVoieEtablissement,indiceRepetitionEtablissement,typeVoieEtablissement,libelleVoieEtablissement,codePostalEtablissement,libelleCommuneEtablissement,libelleCommuneEtrangerEtablissement,distributionSpecialeEtablissement,codeCommuneEtablissement,codeCedexEtablissement,libelleCedexEtablissement,codePaysEtrangerEtablissement,libellePaysEtrangerEtablissement,complementAdresse2Etablissement,numeroVoie2Etablissement,indiceRepetition2Etablissement,typeVoie2Etablissement,libelleVoie2Etablissement,codePostal2Etablissement,libelleCommune2Etablissement,libelleCommuneEtranger2Etablissement,distributionSpeciale2Etablissement,codeCommune2Etablissement,codeCedex2Etablissement,libelleCedex2Etablissement,codePaysEtranger2Etablissement,libellePaysEtranger2Etablissement,dateDebut,etatAdministratifEtablissement,enseigne1Etablissement,enseigne2Etablissement,enseigne3Etablissement,denominationUsuelleEtablissement,activitePrincipaleEtablissement,nomenclatureActivitePrincipaleEtablissement,caractereEmployeurEtablissement,longitude,latitude,geo_score,geo_type,geo_adresse,geo_id,geo_ligne,geo_l4,geo_l5
210201679,00011,21020167900011,O,1983-03-01,03,2020,,2022-08-29T09:05:39,true,4,,8,,RUE,VENDOME,02000,CHERY-LES-POUILLY,,,02180,,,,,,,,,,,,,,,,,,,2008-01-01,A,MAIRIE,,,,84.11Z,NAFRev2,O,3.603542,49.657601,0.95,housenumber,8 Rue Vendôme 02000 Chéry-lès-Pouilly,02180_0064_00008,G,8 RUE VENDOME,
210201679,00029,21020167900029,O,1983-03-16,NN,,,2019-11-14T14:00:12,false,3,,,,,,02000,CHERY-LES-POUILLY,,,02180,,,,,,,,,,,,,,,,,,,2008-01-01,A,SAPEURS POMPIERS,,,,84.25Z,NAFRev2,N,,,0,,,,,,
210201679,00037,21020167900037,O,1983-12-21,02,2020,,2022-08-29T09:05:39,false,4,,2,,RUE,VENDOME,02000,CHERY-LES-POUILLY,,,02180,,,,,,,,,,,,,,,,,,,1997-12-31,A,ECOLE PRIMAIRE PUBLIQUE,,,,85.20Z,NAFRev2,N,3.606152,49.657054,0.95,housenumber,2 Rue Vendôme 02000 Chéry-lès-Pouilly,02180_0064_00002,G,2 RUE VENDOME,
210201679,00045,21020167900045,O,1983-12-21,NN,,,2019-11-14T14:00:12,false,4,,,,,,02000,CHERY-LES-POUILLY,,,02180,,,,,,,,,,,,,,,,,,,1997-12-31,F,ECOL PRIM ECOLE N 2,,,,80.1Z,NAF1993,N,,,0,,,,,,
260201785,00011,26020178500011,O,1983-03-01,NN,,,2019-11-14T14:00:12,true,3,MAIRIE,8,,RUE,VENDOME,02000,CHERY-LES-POUILLY,,,02180,,,,,,,,,,,,,,,,,,,2008-01-01,A,CCAS,,,,88.99B,NAFRev2,N,3.603542,49.657601,0.95,housenumber,8 Rue Vendôme 02000 Chéry-lès-Pouilly,02180_0064_00008,G,8 RUE VENDOME,
290200997,00010,29020099700010,O,1985-02-18,NN,,,2019-11-14T14:00:12,true,3,MAIRIE,8,,RUE,VENDOME,02000,CHERY-LES-POUILLY,,,02180,,,,,,,,,,,,,,,,,,,2004-07-02,F,,,,,70.1C,NAFRev1,N,3.603542,49.657601,0.95,housenumber,8 Rue Vendôme 02000 Chéry-lès-Pouilly,02180_0064_00008,G,8 RUE VENDOME,
300866191,00012,30086619100012,O,,,,,2019-11-14T14:00:12,true,1,,,,,,02000,CHERY-LES-POUILLY,,,02180,,,,,,,,,,,,,,,,,,,1984-12-25,F,,,,,67.04,NAP,N,,,0,,,,,,
302727573,00016,30272757300016,O,1900-01-01,12,2020,,2022-08-29T09:11:38,true,4,,,,RUE,DE VIVAISE,02000,CHERY-LES-POUILLY,,,02180,,,,,,,,,,,,,,,,,,,2008-12-31,A,,,,,01.11Z,NAFRev2,O,3.600176,49.654261,0.95,street,Rue de Vivaise 02000 Chéry-lès-Pouilly,02180_0066,G,RUE DE VIVAISE,
306106022,00016,30610602200016,O,,NN,,,2019-11-14T14:00:12,true,1,,,,RUE,DE BARENTON,02000,CHERY-LES-POUILLY,,,02180,,,,,,,,,,,,,,,,,,,1989-04-01,F,,,,,67.04,NAP,N,3.609112,49.654886,0.95,street,Rue de Barenton 02000 Chéry-lès-Pouilly,02180_0006,G,RUE DE BARENTON,
310361498,00010,31036149800010,O,1977-01-01,NN,,,2019-11-14T14:00:12,true,1,,5,,RUE,DE COUVRON,02000,CHERY-LES-POUILLY,,,02180,,,,,,,,,,,,,,,,,,,1998-10-01,F,,,,,70.2C,NAF1993,N,3.598856,49.658346,0.95,housenumber,5 Rue de Couvron 02000 Chéry-lès-Pouilly,02180_0018_00005,G,5 RUE DE COUVRON,
310765227,00015,31076522700015,O,,,,,2019-11-14T14:00:12,true,1,,,,,,02000,CHERY-LES-POUILLY,,,02180,,,,,,,,,,,,,,,,,,,1995-06-30,F,,,,,15.8C,NAF1993,N,,,0,,,,,,
313322331,00015,31332233100015,O,1900-01-01,,,,2019-11-14T14:00:12,true,4,,,,RUE,DU CHATEAU,02000,CHERY-LES-POUILLY,,,02180,,,,,,,,,,,,,,,,,,,1995-04-14,F,,,,,01.1A,NAF1993,N,3.605751,49.656208,0.95,street,Rue du Château 02000 Chéry-lès-Pouilly,02180_0015,G,RUE DU CHATEAU,
313322349,00017,31332234900017,O,1978-01-01,,,,2023-07-04T14:50:09,false,3,,,,,,02000,CHERY-LES-POUILLY,,,02180,,,,,,,,,,,,,,,,,,,2004-05-31,F,,,,,01.1A,NAFRev1,N,,,0,,,,,,
313588220,00019,31358822000019,O,,,,,2019-11-14T14:00:12,true,1,,,,,,02000,CHERY-LES-POUILLY,,,02180,,,,,,,,,,,,,,,,,,,,F,,,,,01.00,NAP,N,,,0,,,,,,
313852253,00027,31385225300027,O,,NN,,,2019-11-14T14:00:12,true,1,,,,RUE,DU CHATEAU,02000,CHERY-LES-POUILLY,,,02180,,,,,,,,,,,,,,,,,,,2001-11-12,F,,,,,01.1A,NAF1993,N,3.605751,49.656208,0.95,street,Rue du Château 02000 Chéry-lès-Pouilly,02180_0015,G,RUE DU CHATEAU,
317123420,00018,31712342000018,O,,NN,,,2019-11-14T14:00:12,true,1,,,,,,02000,CHERY-LES-POUILLY,,,02180,,,,,,,,,,,,,,,,,,,2001-06-27,F,,,,,60.05,NAP,N,,,0,,,,,,
324130160,00017,32413016000017,O,1979-01-01,,,,2019-11-14T14:00:12,true,3,,,,,,02000,CHERY-LES-POUILLY,,,02180,,,,,,,,,,,,,,,,,,,1998-12-25,F,,,,,01.1A,NAF1993,N,,,0,,,,,,
325943777,00020,32594377700020,O,2019-12-15,,,1392ZC,2021-02-23T10:48:12,true,1,,2,,RUE,DE COUVRON,02000,CHERY-LES-POUILLY,,,02180,,,,,,,,,,,,,,,,,,,2019-12-15,A,,,,MAMYMARYSE,13.92Z,NAFRev2,N,3.599747,49.658427,0.95,housenumber,2 Rue de Couvron 02000 Chéry-lès-Pouilly,02180_0018_00002,G,2 RUE DE COUVRON,
328518568,00030,32851856800030,O,2003-06-01,NN,,,2019-11-14T14:00:12,true,3,,6,,RUE,VENDOME,02000,CHERY-LES-POUILLY,,,02180,,,,,,,,,,,,,,,,,,,2005-01-31,F,,,,,51.1R,NAFRev1,O,3.603803,49.657636,0.95,housenumber,6 Rue Vendôme 02000 Chéry-lès-Pouilly,02180_0064_00006,G,6 RUE VENDOME,
328782073,00014,32878207300014,O,,,,,2019-11-14T14:00:12,true,1,,9,,RUE,DE CRECY,02000,CHERY-LES-POUILLY,,,02180,,,,,,,,,,,,,,,,,,,1997-12-11,F,,,,,60.2M,NAF1993,N,3.606594,49.660217,0.95,housenumber,9 Rue de Crécy 02000 Chéry-lès-Pouilly,02180_0019_00009,G,9 RUE DE CRECY,
331234625,00035,33123462500035,O,1994-01-18,NN,,,2019-11-14T14:00:12,false,3,,2,,RUE,DE CRECY,02000,CHERY-LES-POUILLY,,,02180,,,,,,,,,,,,,,,,,,,1995-08-01,F,,,,,93.0D,NAF1993,N,3.605864,49.658459,0.95,housenumber,2 Rue de Crécy 02000 Chéry-lès-Pouilly,02180_0019_00002,G,2 RUE DE CRECY,
332779057,00014,33277905700014,O,,NN,,,2019-11-14T14:00:12,true,1,,1,,RUE,DE CHALANDRY,02000,CHERY-LES-POUILLY,,,02180,,,,,,,,,,,,,,,,,,,,F,,,,,54.07,NAP,N,3.606872,49.656697,0.95,housenumber,1 Rue de Chalandry 02000 Chéry-lès-Pouilly,02180_0012_00001,G,1 RUE DE CHALANDRY,
333277655,00036,33327765500036,O,1993-02-14,NN,,,2019-11-14T14:00:12,false,3,,1,,RUE,DE POUILLY,02000,CHERY-LES-POUILLY,,,02180,,,,,,,,,,,,,,,,,,,2004-06-01,F,,,,,85.1G,NAFRev1,N,3.601754,49.655236,0.95,housenumber,1 Rue de Pouilly 02000 Chéry-lès-Pouilly,02180_0049_00001,G,1 RUE DE POUILLY,
334737970,00023,33473797000023,O,,NN,,,2019-11-14T14:00:12,true,1,,9,,RUE,DE VANDOME,02000,CHERY-LES-POUILLY,,,02180,,,,,,,,,,,,,,,,,,,1988-01-02,F,,,,,80.04,NAP,N,3.604516,49.65763,0.64,housenumber,9 Rue Vendôme 02000 Chéry-lès-Pouilly,02180_0064_00009,G,9 RUE VENDOME,
337666424,00011,33766642400011,O,,NN,,,2019-11-14T14:00:12,true,1,,1,,RUE,DE VENDOME,02000,CHERY-LES-POUILLY,,,02180,,,,,,,,,,,,,,,,,,,1993-05-28,F,,,,,52.1B,NAF1993,N,3.606664,49.656762,0.8,housenumber,1 Rue Vendôme 02000 Chéry-lès-Pouilly,02180_0064_00001,G,1 RUE VENDOME,
338325723,00017,33832572300017,O,1986-06-10,,,,2023-01-26T03:48:50,true,3,,,,,,02000,CHERY-LES-POUILLY,,,02180,,,,,,,,,,,,,,,,,,,2008-01-01,A,,,,,68.20B,NAFRev2,N,,,0,,,,,,
339523771,00022,33952377100022,O,1993-04-01,NN,,,2019-11-14T14:00:12,true,1,,1,,RUE,DE CHALANDRY,02000,CHERY-LES-POUILLY,,,02180,,,,,,,,,,,,,,,,,,,2002-06-30,F,,,,,55.4A,NAF1993,N,3.606872,49.656697,0.95,housenumber,1 Rue de Chalandry 02000 Chéry-lès-Pouilly,02180_0012_00001,G,1 RUE DE CHALANDRY,
340826619,00033,34082661900033,O,1998-07-01,NN,,,2021-02-23T10:56:44,true,6,,3,,RUE,DE LA TERRIERE,02000,CHERY-LES-POUILLY,,,02180,,,,,,,,,,,,,,,,,,,2008-01-01,A,E.2.M.K,,,,85.59B,NAFRev2,O,3.60376,49.658438,0.95,housenumber,3 Rue de la Terrière 02000 Chéry-lès-Pouilly,02180_0061_00003,G,3 RUE DE LA TERRIERE,
340928712,00033,34092871200033,O,2004-01-05,NN,,,2019-11-14T14:00:12,true,5,,1,B,RUE,DE VIVAISE,02000,CHERY-LES-POUILLY,,,02180,,,,,,,,,,,,,,,,,,,2006-03-27,F,,,,,70.3A,NAFRev1,N,3.601576,49.654859,0.85,housenumber,1bis Rue de Vivaise 02000 Chéry-lès-Pouilly,02180_0066_00001_bis,G,1BIS RUE DE VIVAISE,
344527213,00039,34452721300039,O,1991-09-01,NN,,,2019-11-14T14:00:12,false,4,,,,,,02000,CHERY-LES-POUILLY,,,02180,,,,,,,,,,,,,,,,,,,2001-08-14,F,,,,,60.2M,NAF1993,N,,,0,,,,,,
344850383,00011,34485038300011,O,1988-04-01,NN,,,2019-11-14T14:00:12,true,4,,9,,RUE,DE VENDOME,02000,CHERY-LES-POUILLY,,,02180,,,,,,,,,,,,,,,,,,,1993-12-16,F,,,,,60.2L,NAF1993,N,3.604516,49.65763,0.8,housenumber,9 Rue Vendôme 02000 Chéry-lès-Pouilly,02180_0064_00009,G,9 RUE VENDOME,
350901971,00019,35090197100019,O,,NN,,,2019-11-14T14:00:12,true,1,,,,RUE,DE BARENTON,02000,CHERY-LES-POUILLY,,,02180,,,,,,,,,,,,,,,,,,,1993-04-01,F,,,,,55.4B,NAF1993,N,3.609112,49.654886,0.95,street,Rue de Barenton 02000 Chéry-lès-Pouilly,02180_0006,G,RUE DE BARENTON,
351381298,00022,35138129800022,O,2001-06-01,NN,,,2019-11-14T14:00:12,true,1,,6,,RUE,VENDOME,02000,CHERY-LES-POUILLY,,,02180,,,,,,,,,,,,,,,,,,,2002-03-31,F,,,,,70.1F,NAF1993,N,3.603803,49.657636,0.95,housenumber,6 Rue Vendôme 02000 Chéry-lès-Pouilly,02180_0064_00006,G,6 RUE VENDOME,
352700603,00017,35270060300017,O,1989-08-01,,,,2019-11-14T14:00:12,true,4,,1,,RUE,DU CHATEAU,02000,CHERY-LES-POUILLY,,,02180,,,,,,,,,,,,,,,,,,,2008-01-01,A,,,,,94.99Z,NAFRev2,N,3.606304,49.656582,0.95,housenumber,1 Rue du Château 02000 Chéry-lès-Pouilly,02180_0015_00001,G,1 RUE DU CHATEAU,
385045273,00013,38504527300013,O,1992-03-23,01,2020,,2023-01-03T03:40:43,true,4,,,,,,02000,CHERY-LES-POUILLY,,,02180,,,,,,,,,,,,,,,,,,,2012-12-31,A,,,,,01.11Z,NAFRev2,O,,,0,,,,,,
385380464,00011,38538046400011,O,1992-03-26,NN,,,2019-11-14T14:00:12,true,3,,21,,RUE,VENDOME,02000,CHERY-LES-POUILLY,,,02180,,,,,,,,,,,,,,,,,,,2008-01-01,A,,,,,01.11Z,NAFRev2,N,3.601693,49.657896,0.95,housenumber,21 Rue Vendôme 02000 Chéry-lès-Pouilly,02180_0064_00021,G,21 RUE VENDOME,
388381923,00019,38838192300019,O,,NN,,,2019-11-14T14:00:12,true,1,,10,,RUE,CHALANDRY,02000,CHERY-LES-POUILLY,,,02180,,,,,,,,,,,,,,,,,,,1994-12-21,F,,,,,60.2M,NAF1993,N,3.607762,49.658425,0.94,housenumber,10 Rue de Chalandry 02000 Chéry-lès-Pouilly,02180_0012_00010,G,10 RUE DE CHALANDRY,
394029649,00016,39402964900016,O,1994-02-01,NN,,,2019-11-14T14:00:12,true,4,,,,RUE,DE VIVAISE,02000,CHERY-LES-POUILLY,,,02180,,,,,,,,,,,,,,,,,,,2014-03-31,F,,,,,46.38B,NAFRev2,N,3.600176,49.654261,0.95,street,Rue de Vivaise 02000 Chéry-lès-Pouilly,02180_0066,G,RUE DE VIVAISE,
395248552,00014,39524855200014,O,1994-06-01,01,2020,,2022-08-29T09:18:47,true,4,,7,,RUE,VENDOME,02000,CHERY-LES-POUILLY,,,02180,,,,,,,,,,,,,,,,,,,2012-12-31,A,,,,,01.11Z,NAFRev2,O,3.605422,49.657552,0.95,housenumber,7 Rue Vendôme 02000 Chéry-lès-Pouilly,02180_0064_00007,G,7 RUE VENDOME,
399937820,00013,39993782000013,O,1995-02-10,NN,,,2019-11-14T14:00:12,true,4,,1,,RUE,DE LA SENTE,02000,CHERY-LES-POUILLY,,,02180,,,,,,,,,,,,,,,,,,,2011-04-30,F,,,,,96.02A,NAFRev2,N,3.607463,49.658144,0.94,housenumber,1 Rue de la Sente 02000 Chéry-lès-Pouilly,02180_0059_00001,G,1 RUE DE LA SENTE,
401975198,00011,40197519800011,O,1995-07-01,NN,,,2019-11-14T14:00:12,false,4,,14,,RUE,DU CHATEAU,02000,CHERY-LES-POUILLY,,,02180,,,,,,,,,,,,,,,,,,,2000-06-30,F,,,,,15.8C,NAF1993,N,3.605416,49.655936,0.95,housenumber,14 Rue du Château 02000 Chéry-lès-Pouilly,02180_0015_00014,G,14 RUE DU CHATEAU,
402081764,00019,40208176400019,O,1995-04-14,00,2020,,2022-08-29T09:22:49,true,3,,5,,RUE,DU CHATEAU,02000,CHERY-LES-POUILLY,,,02180,,,,,,,,,,,,,,,,,,,2008-01-01,A,,,,,01.11Z,NAFRev2,N,3.604191,49.655657,0.95,housenumber,5 Rue du Château 02000 Chéry-lès-Pouilly,02180_0015_00005,G,5 RUE DU CHATEAU,
403566391,00013,40356639100013,O,1996-01-08,NN,,,2019-11-14T14:00:12,false,4,,7,,RUE,VENDOME,02000,CHERY-LES-POUILLY,,,02180,,,,,,,,,,,,,,,,,,,2008-04-01,F,,,,,68.20B,NAFRev2,N,3.605422,49.657552,0.95,housenumber,7 Rue Vendôme 02000 Chéry-lès-Pouilly,02180_0064_00007,G,7 RUE VENDOME,
403636749,00018,40363674900018,O,1995-12-31,00,2020,,2022-08-29T09:24:12,true,3,,1,,RUE,MILON,02000,CHERY-LES-POUILLY,,,02180,,,,,,,,,,,,,,,,,,,2008-01-01,A,,,,,01.11Z,NAFRev2,N,3.602387,49.656942,0.94,housenumber,1 Rue Milon 02000 Chéry-lès-Pouilly,02180_0037_00001,G,1 RUE MILON,
404420242,00012,40442024200012,O,1996-01-28,NN,,,2019-11-14T14:00:12,true,3,MAIRIE,,,,,02000,CHERY-LES-POUILLY,,,02180,,,,,,,,,,,,,,,,,,,2008-01-01,A,,,,,90.02Z,NAFRev2,N,3.602079,49.659571,0.38,street,Impasse de la Briqueterie 02000 Chéry-lès-Pouilly,02180_0010,D,IMPASSE DE LA BRIQUETERIE,
404566291,00013,40456629100013,O,1996-01-01,NN,,,2019-11-14T14:00:12,true,4,,,,,,02000,CHERY-LES-POUILLY,,,02180,,,,,,,,,,,,,,,,,,,2001-12-31,F,,,,,51.1R,NAF1993,N,,,0,,,,,,
408868180,00014,40886818000014,O,1977-01-01,NN,,,2019-11-14T14:00:12,true,4,,21,,RUE,VENDOME,02000,CHERY-LES-POUILLY,,,02180,,,,,,,,,,,,,,,,,,,2008-03-31,F,,,,,01.11Z,NAFRev2,N,3.601693,49.657896,0.95,housenumber,21 Rue Vendôme 02000 Chéry-lès-Pouilly,02180_0064_00021,G,21 RUE VENDOME,
409451291,00036,40945129100036,P,2017-07-16,,,,2023-09-07T19:38:11,false,1,[ND],[ND],[ND],[ND],[ND],[ND],CHERY-LES-POUILLY,,[ND],02180,[ND],[ND],,,[ND],[ND],[ND],[ND],[ND],[ND],,,[ND],,[ND],[ND],,,2017-07-16,F,[ND],[ND],[ND],[ND],56.10C,NAFRev2,N,,,0,,,,,,
411636103,00011,41163610300011,O,1989-06-30,NN,,,2019-11-14T14:00:12,true,1,,18,,RUE,DU CHATEAU,02000,CHERY-LES-POUILLY,,,02180,,,,,,,,,,,,,,,,,,,2001-11-12,F,,,,,01.1A,NAF1993,N,3.603167,49.655303,0.95,housenumber,18 Rue du Château 02000 Chéry-lès-Pouilly,02180_0015_00018,G,18 RUE DU CHATEAU,
413975061,00016,41397506100016,O,1997-10-06,NN,,,2019-11-14T14:00:12,false,4,,5,,RUE,VENDOME,02000,CHERY-LES-POUILLY,,,02180,,,,,,,,,,,,,,,,,,,2000-12-31,F,CHRISTOPHE CHEF ALUMINIUM,,,,45.4D,NAF1993,O,3.606137,49.657177,0.95,housenumber,5 Rue Vendôme 02000 Chéry-lès-Pouilly,02180_0064_00005,G,5 RUE VENDOME,
415088889,00068,41508888900068,O,2008-04-01,,,,2019-11-14T14:00:12,true,3,,5,,RUE,DE COUVRON,02000,CHERY-LES-POUILLY,,,02180,,,,,,,,,,,,,,,,,,,2012-04-30,F,,,,MIL'PAT,56.10C,NAFRev2,N,3.598856,49.658346,0.95,housenumber,5 Rue de Couvron 02000 Chéry-lès-Pouilly,02180_0018_00005,G,5 RUE DE COUVRON,
418310116,00011,41831011600011,O,1998-04-03,NN,,,2019-11-14T14:00:12,false,4,,3,,RUE,DU MOULIN,02000,CHERY-LES-POUILLY,,,02180,,,,,,,,,,,,,,,,,,,2001-02-08,F,,,,,70.2A,NAF1993,O,3.607067,49.659757,0.95,housenumber,3 Rue du Moulin 02000 Chéry-lès-Pouilly,02180_0039_00003,G,3 RUE DU MOULIN,
418310116,00029,41831011600029,O,2001-02-08,NN,,,2019-11-14T14:00:12,true,3,,6,,RUE,VENDOME,02000,CHERY-LES-POUILLY,,,02180,,,,,,,,,,,,,,,,,,,2008-01-01,A,,,,,68.20A,NAFRev2,N,3.603803,49.657636,0.95,housenumber,6 Rue Vendôme 02000 Chéry-lès-Pouilly,02180_0064_00006,G,6 RUE VENDOME,
423242445,00025,42324244500025,O,2010-06-15,,,,2021-02-23T11:45:08,true,1,,3,,,COUR DES MARCHANDISES,02000,CHERY-LES-POUILLY,,,02180,,,,,,,,,,,,,,,,,,,2010-06-15,A,,,,,68.10Z,NAFRev2,N,3.610827,49.65293,0.94,housenumber,3 Cour des Marchandises 02000 Chéry-lès-Pouilly,02180_0036_00003,G,3 COUR DES MARCHANDISES,
423949999,00027,42394999900027,O,2019-01-01,,,,2021-07-28T03:36:59,true,1,,3,,CRS,DES MARCHANDISES,02000,CHERY-LES-POUILLY,,,02180,,,,,,,,,,,,,,,,,,,2019-01-01,A,,,,,68.20B,NAFRev2,N,3.610827,49.65293,0.78,housenumber,3 Cour des Marchandises 02000 Chéry-lès-Pouilly,02180_0036_00003,G,3 COUR DES MARCHANDISES,
425115425,00018,42511542500018,O,1999-11-01,,,,2019-11-14T14:00:12,true,5,,1,,RUE,DU MOULIN,02000,CHERY-LES-POUILLY,,,02180,,,,,,,,,,,,,,,,,,,2017-10-01,A,,,,,90.03A,NAFRev2,N,3.606729,49.659733,0.95,housenumber,1 Rue du Moulin 02000 Chéry-lès-Pouilly,02180_0039_00001,G,1 RUE DU MOULIN,
433337441,00011,43333744100011,O,2000-10-23,NN,,,2019-11-14T14:00:12,false,3,,19,,RUE,VENDOME,02000,CHERY-LES-POUILLY,,,02180,,,,,,,,,,,,,,,,,,,2003-12-01,F,,,,,74.1J,NAFRev1,N,3.602084,49.657954,0.95,housenumber,19 Rue Vendôme 02000 Chéry-lès-Pouilly,02180_0064_00019,G,19 RUE VENDOME,
439372905,00018,43937290500018,O,2000-07-15,NN,,,2019-11-14T14:00:12,true,3,M. RYTTER CHRISTOPHE,3,,RUE,DE LAON,02000,CHERY-LES-POUILLY,,,02180,,,,,,,,,,,,,,,,,,,2008-01-01,A,,,,,68.20A,NAFRev2,N,3.604758,49.655423,0.94,housenumber,3 Rue de Laon 02000 Chéry-lès-Pouilly,02180_0031_00003,G,3 RUE DE LAON,
440413433,00010,44041343300010,O,2001-11-13,,,,2019-11-14T14:00:12,true,4,,18,,RUE,DU CHATEAU,02000,CHERY-LES-POUILLY,,,02180,,,,,,,,,,,,,,,,,,,2015-01-01,F,,,,,01.50Z,NAFRev2,N,3.603167,49.655303,0.95,housenumber,18 Rue du Château 02000 Chéry-lès-Pouilly,02180_0015_00018,G,18 RUE DU CHATEAU,
441222445,00021,44122244500021,O,2013-01-22,,,4334ZA,2019-11-14T14:00:12,false,2,,12,T,RUE,DE CRECY,02000,CHERY-LES-POUILLY,,,02180,,,,,,,,,,,,,,,,,,,2014-01-13,F,,,,,43.34Z,NAFRev2,N,3.606461,49.659968,0.95,housenumber,12t Rue de Crécy 02000 Chéry-lès-Pouilly,02180_0019_00012_t,G,12T RUE DE CRECY,
442823167,00014,44282316700014,O,2002-07-01,NN,,,2019-11-14T14:00:12,true,4,,1,,RUE,DE CHALANDRY,02000,CHERY-LES-POUILLY,,,02180,,,,,,,,,,,,,,,,,,,2008-02-29,F,,,,,56.30Z,NAFRev2,N,3.606872,49.656697,0.95,housenumber,1 Rue de Chalandry 02000 Chéry-lès-Pouilly,02180_0012_00001,G,1 RUE DE CHALANDRY,
443518089,00018,44351808900018,O,2002-09-13,01,2020,4312BA,2022-08-29T09:19:33,true,6,,10,,RUE,DE CHALANDRY,02000,CHERY-LES-POUILLY,,,02180,,,,,,,,,,,,,,,,,,,2008-01-01,A,,,,,43.12B,NAFRev2,O,3.607762,49.658425,0.95,housenumber,10 Rue de Chalandry 02000 Chéry-lès-Pouilly,02180_0012_00010,G,10 RUE DE CHALANDRY,
445007263,00012,44500726300012,O,2002-12-20,NN,,,2020-06-25T03:58:55,true,4,,11,,RUE,DU JARDIN FOULON,02000,CHERY-LES-POUILLY,,,02180,,,,,,,,,,,,,,,,,,,2020-02-13,F,,,,,68.20B,NAFRev2,N,3.601123,49.66052,0.95,housenumber,11 Rue du Jardin Foulon 02000 Chéry-lès-Pouilly,02180_0028_00011,G,11 RUE DU JARDIN FOULON,
445135619,00010,44513561900010,O,2003-02-06,NN,,,2022-05-11T03:35:29,false,4,,3,,RUE,DE LA TERRIERE,02000,CHERY-LES-POUILLY,,,02180,,,,,,,,,,,,,,,,,,,2022-05-01,F,,,,,68.20B,NAFRev2,N,3.60376,49.658438,0.95,housenumber,3 Rue de la Terrière 02000 Chéry-lès-Pouilly,02180_0061_00003,G,3 RUE DE LA TERRIERE,
447868365,00019,44786836500019,O,2003-03-01,NN,,,2019-11-14T14:00:12,true,4,,11,,RUE,DU JARDIN FOULON,02000,CHERY-LES-POUILLY,,,02180,,,,,,,,,,,,,,,,,,,2008-12-03,F,,,,,70.10Z,NAFRev2,N,3.601123,49.66052,0.95,housenumber,11 Rue du Jardin Foulon 02000 Chéry-lès-Pouilly,02180_0028_00011,G,11 RUE DU JARDIN FOULON,
452535040,00011,45253504000011,O,1980-11-17,NN,,,2019-11-14T14:00:12,true,3,,,,,,02000,CHERY-LES-POUILLY,,,02180,,,,,,,,,,,,,,,,,,,2008-01-01,A,,,,,93.12Z,NAFRev2,N,,,0,,,,,,
480294669,00027,48029466900027,O,2006-11-04,NN,,,2020-08-25T10:24:23,false,4,,7,,RUE,MILON,02000,CHERY-LES-POUILLY,,,02180,,,,,,,,,,,,,,,,,,,2018-08-01,F,,,,,90.01Z,NAFRev2,O,3.601555,49.656816,0.94,housenumber,7 Rue Milon 02000 Chéry-lès-Pouilly,02180_0037_00007,G,7 RUE MILON,
480333475,00022,48033347500022,O,2017-07-27,,,,2020-01-30T04:03:52,true,1,,12,T,RUE,DE CRECY,02000,CHERY-LES-POUILLY,,,02180,,,,,,,,,,,,,,,,,,,2017-07-27,A,,,,,68.20B,NAFRev2,N,3.606461,49.659968,0.95,housenumber,12t Rue de Crécy 02000 Chéry-lès-Pouilly,02180_0019_00012_t,G,12T RUE DE CRECY,
484326772,00049,48432677200049,O,2019-01-01,,,,2023-03-19T03:36:10,true,2,,13,,RUE,DE LA TERRIERE,02000,CHERY-LES-POUILLY,,,02180,,,,,,,,,,,,,,,,,,,2023-03-17,F,,,,,47.91A,NAFRev2,O,3.601706,49.658596,0.95,housenumber,13 Rue de la Terrière 02000 Chéry-lès-Pouilly,02180_0061_00013,G,13 RUE DE LA TERRIERE,
484712302,00021,48471230200021,O,2013-01-14,,,,2019-11-14T14:00:12,false,2,,12,B,RUE,DE CRECY,02000,CHERY-LES-POUILLY,,,02180,,,,,,,,,,,,,,,,,,,2017-06-27,F,,,,,47.89Z,NAFRev2,N,3.606425,49.659863,0.95,housenumber,12b Rue de Crécy 02000 Chéry-lès-Pouilly,02180_0019_00012_b,G,12B RUE DE CRECY,
488584822,00024,48858482200024,O,2019-06-14,,,,2021-02-23T13:53:15,true,1,,5,,RUE,DE RENEUIL,02000,CHERY-LES-POUILLY,,,02180,,,,,,,,,,,,,,,,,,,2019-06-14,A,,,,,47.89Z,NAFRev2,N,3.608915,49.654273,0.95,housenumber,5 Rue de Reneuil 02000 Chéry-lès-Pouilly,02180_0051_00005,G,5 RUE DE RENEUIL,
497720185,00014,49772018500014,O,2007-04-06,,,,2019-11-14T14:00:12,true,2,,8,,RUE,PAYONNE,02000,CHERY-LES-POUILLY,,,02180,,,,,,,,,,,,,,,,,,,2008-01-01,A,,,,,68.20B,NAFRev2,N,3.60751,49.654436,0.87,housenumber,8 Rue de la Payonne 02000 Chéry-lès-Pouilly,02180_0046_00008,G,8 RUE DE LA PAYONNE,
498392083,00016,49839208300016,O,2007-07-01,01,2020,4391BZ,2022-08-29T09:30:11,true,5,,12,,RUE,DE VIVAISE,02000,CHERY-LES-POUILLY,,,02180,,,,,,,,,,,,,,,,,,,2017-05-02,A,,,,,43.91B,NAFRev2,O,3.599149,49.653258,0.95,housenumber,12 Rue de Vivaise 02000 Chéry-lès-Pouilly,02180_0066_00012,G,12 RUE DE VIVAISE,
499235133,00018,49923513300018,O,2007-08-01,,,,2019-11-14T14:00:12,true,3,,19,,RUE,VENDOME,02000,CHERY-LES-POUILLY,,,02180,,,,,,,,,,,,,,,,,,,2011-02-28,F,,,,,79.11Z,NAFRev2,N,3.602084,49.657954,0.95,housenumber,19 Rue Vendôme 02000 Chéry-lès-Pouilly,02180_0064_00019,G,19 RUE VENDOME,
503678757,00017,50367875700017,O,2008-04-01,01,2020,,2022-08-29T09:07:04,true,1,,21,,RUE,VENDOME,02000,CHERY-LES-POUILLY,,,02180,,,,,,,,,,,,,,,,,,,2008-04-01,A,EARL SOPHORA,,,,01.11Z,NAFRev2,O,3.601693,49.657896,0.95,housenumber,21 Rue Vendôme 02000 Chéry-lès-Pouilly,02180_0064_00021,G,21 RUE VENDOME,
504300906,00022,50430090600022,O,2008-05-19,02,2020,2562BZ,2022-08-29T09:08:05,true,1,,5,,RUE,DU CHATEAU,02000,CHERY-LES-POUILLY,,,02180,,,,,,,,,,,,,,,,,,,2008-05-19,A,M.S.I,,,,25.62B,NAFRev2,O,3.604191,49.655657,0.95,housenumber,5 Rue du Château 02000 Chéry-lès-Pouilly,02180_0015_00005,G,5 RUE DU CHATEAU,
504944430,00017,50494443000017,O,2008-06-21,,,,2019-11-14T14:00:12,true,1,,4,,RUE,DU ROUGET,02000,CHERY-LES-POUILLY,,,02180,,,,,,,,,,,,,,,,,,,2008-06-21,A,,,,,68.20B,NAFRev2,N,3.606204,49.658543,0.78,housenumber,4 Rue du Roupet 02000 Chéry-lès-Pouilly,02180_0053_00004,G,4 RUE DU ROUPET,
509378766,00018,50937876600018,O,2009-01-02,,,,2019-11-14T14:00:12,true,2,,1,,RUE,DE CHALANDRY,02000,CHERY-LES-POUILLY,,,02180,,,,,,,,,,,,,,,,,,,2013-12-25,F,BAR DES AMIS,,,,56.30Z,NAFRev2,N,3.606872,49.656697,0.95,housenumber,1 Rue de Chalandry 02000 Chéry-lès-Pouilly,02180_0012_00001,G,1 RUE DE CHALANDRY,
510659006,00017,51065900600017,O,2006-01-01,,,,2019-11-14T14:00:12,true,1,,9,,RUE,DE LA PAYONNE,02000,CHERY-LES-POUILLY,,,02180,,,,,,,,,,,,,,,,,,,2006-01-01,A,,,,,47.78C,NAFRev2,N,3.607813,49.6547,0.95,housenumber,9 Rue de la Payonne 02000 Chéry-lès-Pouilly,02180_0046_00009,G,9 RUE DE LA PAYONNE,
512760224,00026,51276022400026,P,2020-02-01,,,,2021-01-27T08:48:24,false,2,[ND],[ND],[ND],[ND],[ND],[ND],CHERY-LES-POUILLY,,[ND],02180,[ND],[ND],,,[ND],[ND],[ND],[ND],[ND],[ND],,,[ND],,[ND],[ND],,,2021-01-01,F,[ND],[ND],[ND],[ND],93.29Z,NAFRev2,N,,,0,,,,,,
514942945,00015,51494294500015,O,2009-09-21,,,,2022-05-11T03:35:28,false,2,,3,,RUE,DE LA TERRIERE,02000,CHERY-LES-POUILLY,,,02180,,,,,,,,,,,,,,,,,,,2022-05-01,F,,,,,68.20B,NAFRev2,N,3.60376,49.658438,0.95,housenumber,3 Rue de la Terrière 02000 Chéry-lès-Pouilly,02180_0061_00003,G,3 RUE DE LA TERRIERE,
515292050,00017,51529205000017,O,2009-10-06,,,,2019-11-14T14:00:12,true,1,,13,,RUE,DE BARENTON,02000,CHERY-LES-POUILLY,,,02180,,,,,,,,,,,,,,,,,,,2009-10-06,A,,,,,68.20B,NAFRev2,N,3.608012,49.655603,0.95,housenumber,13 Rue de Barenton 02000 Chéry-lès-Pouilly,02180_0006_00013,G,13 RUE DE BARENTON,