siren,nic,siret,statutDiffusionEtablissement,dateCreationEtablissement,trancheEffectifsEtablissement,anneeEffectifsEtablissement,activitePrincipaleRegistreMetiersEtablissement,dateDernierTraitementEtablissement,etablissementSiege,nombrePeriodesEtablissement,complementAdresseEtablissement,numeroVoieEtablissement,indiceRepetitionEtablissement,typeVoieEtablissement,libelleVoieEtablissement,codePostalEtablissement,libelleCommuneEtablissement,libelleCommuneEtrangerEtablissement,distributionSpecialeEtablissement,codeCommuneEtablissement,codeCedexEtablissement,libelleCedexEtablissement,codePaysEtrangerEtablissement,libellePaysEtrangerEtablissement,complementAdresse2Etablissement,numeroVoie2Etablissement,indiceRepetition2Etablissement,typeVoie2Etablissement,libelleVoie2Etablissement,codePostal2Etablissement,libelleCommune2Etablissement,libelleCommuneEtranger2Etablissement,distributionSpeciale2Etablissement,codeCommune2Etablissement,codeCedex2Etablissement,libelleCedex2Etablissement,codePaysEtranger2Etablissement,libellePaysEtranger2Etablissement,dateDebut,etatAdministratifEtablissement,enseigne1Etablissement,enseigne2Etablissement,enseigne3Etablissement,denominationUsuelleEtablissement,activitePrincipaleEtablissement,nomenclatureActivitePrincipaleEtablissement,caractereEmployeurEtablissement,longitude,latitude,geo_score,geo_type,geo_adresse,geo_id,geo_ligne,geo_l4,geo_l5
035480086,00012,03548008600012,O,,NN,,,,true,1,,,,,,21700,COMBLANCHIEN,,,21186,,,,,,,,,,,,,,,,,,,1994-05-20,F,,,,,14.1A,NAF1993,O,,,0,,,,,,
035780238,00016,03578023800016,O,,NN,,,,true,1,,,,,,21700,COMBLANCHIEN,,,21186,,,,,,,,,,,,,,,,,,,,F,,,,,62.30,NAP,N,,,0,,,,,,
035780287,00013,03578028700013,O,,,,,,true,1,,,,,,21700,COMBLANCHIEN,,,21186,,,,,,,,,,,,,,,,,,,1984-12-25,F,,,,,15.03,NAP,N,,,0,,,,,,
035970706,00012,03597070600012,O,,NN,,,,true,1,,,,,,21700,COMBLANCHIEN,,,21186,,,,,,,,,,,,,,,,,,,,F,,,,,21.01,NAP,N,,,0,,,,,,
036380061,00014,03638006100014,O,1900-01-01,NN,,,2008-11-07T00:16:07,false,4,,,,RTE,NATIONALE 74,21700,COMBLANCHIEN,,,21186,,,,,,,,,,,,,,,,,,,2006-04-01,F,,,,,14.1A,NAFRev1,O,4.91788,47.102349,0.84,street,Route Nationale 74 21700 Comblanchien,21186_0400,G,ROUTE NATIONALE 74,
036380061,00048,03638006100048,O,1980-01-01,21,2020,,2023-07-02T20:28:20,true,7,,,,RTE,DE VILLERS LA FAYE,21700,COMBLANCHIEN,,,21186,,,,,,,,,,,,,,,,,,,2020-03-30,A,,,,SOCIETE D'EXTRACTION ET DE TRANSFORMATION DE LA PIERRE/CMC - CARRIERES MARBRERIES DE COMBLANCHIEN,23.70Z,NAFRev2,O,4.911318,47.098112,0.86,street,Route de Villers la Faye 21700 Comblanchien,21186_94uieb,G,ROUTE DE VILLERS LA FAYE,
036380061,00055,03638006100055,O,2001-10-15,NN,,,2013-06-06T10:37:12,false,5,,1,,RUE,JOSEPH BLANC,21700,COMBLANCHIEN,,,21186,,,,,,,,,,,,,,,,,,,2013-04-01,F,,,,,70.10Z,NAFRev2,O,4.924237,47.101486,0.94,housenumber,1 Rue Joseph Blanc 21700 Comblanchien,21186_0300_00001,G,1 RUE JOSEPH BLANC,
036380061,00063,03638006100063,O,2013-04-01,,,,2013-06-07T14:32:21,false,1,,,,RTE,DE VILLERS LA FAYE,21700,COMBLANCHIEN,,,21186,,,,,,,,,,,,,,,,,,,2013-04-01,F,,,,,70.10Z,NAFRev2,O,4.911318,47.098112,0.86,street,Route de Villers la Faye 21700 Comblanchien,21186_94uieb,G,ROUTE DE VILLERS LA FAYE,
036380061,00071,03638006100071,O,2015-04-29,NN,,,2021-03-02T16:13:30,false,3,,42,,RTE,DEPARTEMENTALE 974,21700,COMBLANCHIEN,,,21186,,,,,,,,,,,,,,,,,,,2020-03-30,F,,,,CMC - CARRIERES ET MARBRERIES DE COMBLANCHIEN,23.70Z,NAFRev2,N,4.914307,47.09925,0.91,housenumber,42 Route Departementale 974 21700 Comblanchien,21186_9e45jw_00042,G,42 ROUTE DEPARTEMENTALE 974,
036470250,00030,03647025000030,O,2000-10-16,NN,,,2008-11-07T00:16:07,true,4,,1,,CHE,DES CARRIERES,21700,COMBLANCHIEN,,,21186,,,,,,,,,,,,,,,,,,,2006-10-06,F,,,,,45.4D,NAFRev1,N,4.914065,47.103888,0.75,housenumber,1 Rue des Carrières 21700 Comblanchien,21186_0120_00001,G,1 RUE DES CARRIERES,
036670123,00011,03667012300011,O,,,,,,true,1,,,,,,21700,COMBLANCHIEN,,,21186,,,,,,,,,,,,,,,,,,,1984-12-25,F,,,,,81.21,NAP,N,,,0,,,,,,
036670172,00018,03667017200018,O,,NN,,,,true,1,,,,,,21700,COMBLANCHIEN,,,21186,,,,,,,,,,,,,,,,,,,,F,,,,,67.08,NAP,N,,,0,,,,,,
036980043,00016,03698004300016,O,1969-01-01,,,,,true,1,,,,,,21700,COMBLANCHIEN,,,21186,,,,,,,,,,,,,,,,,,,2001-01-19,F,,,,,51.3J,NAF1993,N,,,0,,,,,,
037370046,00015,03737004600015,O,,,,,,true,1,,,,,,21700,COMBLANCHIEN,,,21186,,,,,,,,,,,,,,,,,,,1984-12-25,F,,,,,67.08,NAP,N,,,0,,,,,,
037380078,00040,03738007800040,O,2021-01-01,,,,2022-12-14T03:43:23,false,2,,,,RTE,NATIONALE 74,21700,COMBLANCHIEN,,,21186,,,,,,,,,,,,,,,,,,,2022-05-05,F,,,,ELIUS ELIUS COLLECTIONS DE VIN ELIUS AUREA ELIUS TERRA ELIUS CANTO JB THEVENIN J.BACHELIER...,46.34Z,NAFRev2,O,4.91788,47.102349,0.84,street,Route Nationale 74 21700 Comblanchien,21186_0400,G,ROUTE NATIONALE 74,
212101869,00015,21210186900015,O,1983-03-01,03,2020,,2022-08-29T09:06:15,true,4,,,,RUE,DE L'EGLISE,21700,COMBLANCHIEN,,,21186,,,,,,,,,,,,,,,,,,,2008-01-01,A,MAIRIE,,,,84.11Z,NAFRev2,O,4.921486,47.102974,0.94,street,Rue de l'Eglise 21700 Comblanchien,21186_0200,G,RUE DE L EGLISE,
212101869,00049,21210186900049,O,1986-09-16,01,2020,,2022-08-29T09:06:15,false,4,,,,PL,DE LA MAIRIE,21700,COMBLANCHIEN,,,21186,,,,,,,,,,,,,,,,,,,2022-05-13,A,ECOLE MATERNELLE,,,,85.10Z,NAFRev2,N,4.911611,47.101585,0.38,street,Chemin de la Brique 21700 Comblanchien,21186_0110,G,CHEMIN DE LA BRIQUE,
212101869,00056,21210186900056,O,1986-09-16,02,2020,,2022-08-29T09:06:15,false,5,,1,,RUE,NOUVELLE,21700,COMBLANCHIEN,,,21186,,,,,,,,,,,,,,,,,,,2022-05-13,A,ECOLE ELEMENTAIRE PUBLIQUE     R.P.I.,,,,85.20Z,NAFRev2,N,4.922317,47.101895,0.95,housenumber,1 Rue Nouvelle 21700 Comblanchien,21186_0420_00001,G,1 RUE NOUVELLE,
212101869,00064,21210186900064,O,1994-12-25,NN,,,2006-10-26T23:40:28,false,2,MAIRIE,,,,,21700,COMBLANCHIEN,,,21186,,,,,,,,,,,,,,,,,,,2005-07-13,F,LOTISSEMENT LE BIEF,,,,70.1C,NAFRev1,N,,,0,,,,,,
212101869,00072,21210186900072,O,1996-12-25,NN,,,2008-04-17T17:54:27,false,2,MAIRIE,,,RUE,DE L'EGLISE,21700,COMBLANCHIEN,,,21186,,,,,,,,,,,,,,,,,,,2008-01-01,A,SERVICE ASSAINISSEMENT,,,,37.00Z,NAFRev2,N,4.921486,47.102974,0.94,street,Rue de l'Eglise 21700 Comblanchien,21186_0200,G,RUE DE L EGLISE,
212101869,00080,21210186900080,O,1997-01-01,NN,,,2017-04-07T14:00:34,false,4,,,,RUE,DE L'EGLISE,21700,COMBLANCHIEN,,,21186,,,,,,,,,,,,,,,,,,,2016-12-31,F,SERVICE BATIMENTS INDUSTRIELS SETP,,,,42.99Z,NAFRev2,N,4.921486,47.102974,0.94,street,Rue de l'Eglise 21700 Comblanchien,21186_0200,G,RUE DE L EGLISE,
212101869,00098,21210186900098,O,2001-12-25,NN,,,2008-04-16T17:53:23,false,3,,,,,,21700,COMBLANCHIEN,,,21186,,,,,,,,,,,,,,,,,,,2008-01-01,F,BA BATIMENT INDUST CYBEO,,,,42.99Z,NAFRev2,N,,,0,,,,,,
212101869,00106,21210186900106,O,2022-01-01,,,,2023-07-06T11:06:41,false,1,MAIRIE,,,RUE,DE L' EGLISE,21700,COMBLANCHIEN,,,21186,,,,,,,,,,,,,,,,,,,2022-01-01,A,LOTISSEMENT LE PONTOT,,,,42.99Z,NAFRev2,N,4.921486,47.102974,0.94,street,Rue de l'Eglise 21700 Comblanchien,21186_0200,G,RUE DE L EGLISE,
262100852,00017,26210085200017,O,1983-03-01,NN,,,2020-10-21T15:26:20,true,5,MAIRIE,,,RUE,DE L'EGLISE,21700,COMBLANCHIEN,,,21186,,,,,,,,,,,,,,,,,,,2020-07-16,F,,,,,88.99B,NAFRev2,N,4.921486,47.102974,0.94,street,Rue de l'Eglise 21700 Comblanchien,21186_0200,G,RUE DE L EGLISE,
272103219,00015,27210321900015,O,1993-01-01,NN,,,,true,1,,,,,MAIRIE,21700,COMBLANCHIEN,,,21186,,,,,,,,,,,,,,,,,,,1998-12-31,F,,,,,90.0A,NAF1993,N,3.0709671,50.6304695,0.92,poi.townhall,Hôtel de Ville Lille,https://osm.org/way/40917078,G,,
292108271,00019,29210827100019,O,1996-01-24,NN,,,,true,1,,,,,MAIRIE,21700,COMBLANCHIEN,,,21186,,,,,,,,,,,,,,,,,,,2002-05-16,F,,,,,70.1C,NAF1993,N,3.0709671,50.6304695,0.92,poi.townhall,Hôtel de Ville Lille,https://osm.org/way/40917078,G,,
300097367,00019,30009736700019,O,,,,,,true,1,,,,,,21700,COMBLANCHIEN,,,21186,,,,,,,,,,,,,,,,,,,1984-12-25,F,,,,,55.73,NAP,N,,,0,,,,,,
302567896,00014,30256789600014,O,1900-01-01,NN,,,2018-07-19T04:13:06,true,4,,,,,,21700,COMBLANCHIEN,,,21186,,,,,,,,,,,,,,,,,,,2018-06-18,F,,,,,01.21Z,NAFRev2,N,,,0,,,,,,
302792353,00013,30279235300013,O,1900-01-01,NN,,,2008-01-04T19:22:17,true,3,,,,,,21700,COMBLANCHIEN,,,21186,,,,,,,,,,,,,,,,,,,2008-01-01,A,,,,,94.99Z,NAFRev2,N,,,0,,,,,,
303563860,00020,30356386000020,O,,NN,,,,true,1,,,,RUE,DU MIROIR,21700,COMBLANCHIEN,,,21186,,,,,,,,,,,,,,,,,,,,F,,,,,64.49,NAP,N,4.919808,47.102565,0.95,street,Rue du Miroir 21700 Comblanchien,21186_0360,G,RUE DU MIROIR,
304579956,00018,30457995600018,O,1975-01-01,NN,,,,true,1,,,,RUE,NOUVELLE,21700,COMBLANCHIEN,,,21186,,,,,,,,,,,,,,,,,,,2000-09-15,F,,,,,26.7Z,NAF1993,O,4.922476,47.101733,0.95,street,Rue Nouvelle 21700 Comblanchien,21186_0420,G,RUE NOUVELLE,
304951965,00223,30495196500223,O,1997-12-22,NN,,,2020-08-25T10:23:00,false,4,USINE ET CARRIERES,,,,,21700,COMBLANCHIEN,,,21186,,,,,,,,,,,,,,,,,,,2018-11-22,F,,,,,08.11Z,NAFRev2,O,4.915991,47.105371,0.51,street,Rue des Carrières 21700 Comblanchien,21186_0120,D,RUE DES CARRIERES,
305530586,00018,30553058600018,O,1900-01-01,,,,2007-08-07T05:46:30,true,3,,,,,,21700,COMBLANCHIEN,,,21186,,,,,,,,,,,,,,,,,,,2000-12-31,F,,,,,01.1G,NAF1993,N,,,0,,,,,,
305635500,00021,30563550000021,O,,NN,,,,true,1,,,,,,21700,COMBLANCHIEN,,,21186,,,,,,,,,,,,,,,,,,,1989-02-24,F,,,,,14.1A,NAF1993,N,,,0,,,,,,
306797986,00016,30679798600016,O,,,,,,true,1,,,,RTE,NATIONALE,21700,COMBLANCHIEN,,,21186,,,,,,,,,,,,,,,,,,,1985-12-25,F,,,,,01.17,NAP,N,4.91788,47.102349,0.81,street,Route Nationale 74 21700 Comblanchien,21186_0400,G,ROUTE NATIONALE 74,
309119709,00025,30911970900025,O,,NN,,,,true,1,,,,,CHATEAU COMMUNAL,21700,COMBLANCHIEN,,,21186,,,,,,,,,,,,,,,,,,,1987-04-22,F,,,,,64.43,NAP,N,4.922088,47.103288,0.3,street,Impasse Jeanne Chapuzot 21700 Comblanchien,21186_0280,G,IMPASSE JEANNE CHAPUZOT,
310867817,00010,31086781700010,O,1900-01-01,NN,,,2010-04-18T03:35:46,true,4,,,,RTE,NATIONALE,21700,COMBLANCHIEN,,,21186,,,,,,,,,,,,,,,,,,,2008-08-31,F,,,,,01.21Z,NAFRev2,N,4.91788,47.102349,0.81,street,Route Nationale 74 21700 Comblanchien,21186_0400,G,ROUTE NATIONALE 74,
310971205,00029,31097120500029,O,1994-11-15,NN,,,,true,1,,,,RUE,DU MIROIR,21700,COMBLANCHIEN,,,21186,,,,,,,,,,,,,,,,,,,2002-12-31,F,,,,,15.8C,NAF1993,O,4.919808,47.102565,0.95,street,Rue du Miroir 21700 Comblanchien,21186_0360,G,RUE DU MIROIR,
312127442,00019,31212744200019,O,1900-01-01,12,2020,,2023-07-02T20:14:05,true,4,LES ESSARTS,,,RTE,DE DIJON,21700,COMBLANCHIEN,,,21186,,,,,,,,,,,,,,,,,,,2008-01-01,A,,,,,23.70Z,NAFRev2,O,4.918071,47.102468,0.41,street,Route Departementale 974 21700 Comblanchien,21186_9e45jw,G,ROUTE DEPARTEMENTALE 974,
314798737,00016,31479873700016,O,,,,,,true,1,,,,,,21700,COMBLANCHIEN,,,21186,,,,,,,,,,,,,,,,,,,1988-06-30,F,,,,,67.01,NAP,N,,,0,,,,,,
317667087,00017,31766708700017,O,1980-01-01,NN,,,2011-01-18T11:42:40,false,4,,,,,LES CAIOTTES,21700,COMBLANCHIEN,,,21186,,,,,,,,,,,,,,,,,,,2009-03-28,F,,,,,68.20B,NAFRev2,N,4.922324,47.102849,0.4,street,Impasse des Violettes 21700 Comblanchien,21186_0620,G,IMPASSE DES VIOLETTES,
317667087,00025,31766708700025,O,2009-03-28,,,,2021-02-23T10:42:32,true,1,,27,,,GRANDE RUE,21700,COMBLANCHIEN,,,21186,,,,,,,,,,,,,,,,,,,2009-03-28,A,,,,,68.20B,NAFRev2,N,4.921913,47.099956,0.95,housenumber,27 Grande Rue 21700 Comblanchien,21186_0260_00027,G,27 GRANDE RUE,
318317310,00015,31831731000015,O,,,,,,true,1,,,,,,21700,COMBLANCHIEN,,,21186,,,,,,,,,,,,,,,,,,,1985-12-25,F,,,,,69.23,NAP,N,,,0,,,,,,
318395605,00021,31839560500021,O,1986-12-01,,,,2012-11-21T14:26:26,true,6,,,,,ZONE ARTISANALE,21700,COMBLANCHIEN,,,21186,,,,,,,,,,,,,,,,,,,2012-08-31,F,,,,,68.20B,NAFRev2,N,2.7640352,42.6301915,0.9,poi.retail,Zone Artisanale (Zone commerciale) Thuir,https://osm.org/way/191039530,G,,
320647753,00013,32064775300013,O,1980-12-15,NN,,,,true,1,,,,,,21700,COMBLANCHIEN,,,21186,,,,,,,,,,,,,,,,,,,1999-08-15,F,,,,,55.3A,NAF1993,O,,,0,,,,,,
321341620,00011,32134162000011,O,,,,,,true,1,,78,,RTE,NATIONALE,21700,COMBLANCHIEN,,,21186,,,,,,,,,,,,,,,,,,,,F,,,,,67.08,NAP,N,4.91788,47.102349,0.67,street,Route Nationale 74 21700 Comblanchien,21186_0400,G,ROUTE NATIONALE 74,
321489429,00043,32148942900043,O,2003-07-16,NN,,,2008-01-04T18:26:34,true,3,LOGEMENT 2,10,,RUE,DU MIROIR,21700,COMBLANCHIEN,,,21186,,,,,,,,,,,,,,,,,,,2008-01-01,A,,,,,47.89Z,NAFRev2,N,4.918875,47.102914,0.95,housenumber,10 Rue du Miroir 21700 Comblanchien,21186_0360_00010,G,10 RUE DU MIROIR,
323892422,00011,32389242200011,O,1979-09-01,NN,,,2008-01-04T18:51:10,true,3,,,,,,21700,COMBLANCHIEN,,,21186,,,,,,,,,,,,,,,,,,,2008-01-01,A,,,,,01.21Z,NAFRev2,N,,,0,,,,,,
324022862,00027,32402286200027,O,1900-01-01,NN,,,2011-04-28T00:20:53,false,3,,,,RUE,DU MIROIR,21700,COMBLANCHIEN,,,21186,,,,,,,,,,,,,,,,,,,1992-01-01,F,,,,,70.3A,NAF1993,N,4.919808,47.102565,0.95,street,Rue du Miroir 21700 Comblanchien,21186_0360,G,RUE DU MIROIR,
324132059,00019,32413205900019,O,,,,,,true,1,,,,,,21700,COMBLANCHIEN,,,21186,,,,,,,,,,,,,,,,,,,1985-12-25,F,,,,,01.17,NAP,N,,,0,,,,,,
324146414,00010,32414641400010,O,1964-11-01,NN,,,,true,1,,,,,,21700,COMBLANCHIEN,,,21186,,,,,,,,,,,,,,,,,,,2002-12-01,F,,,,,01.1G,NAF1993,N,,,0,,,,,,
326100575,00017,32610057500017,O,1982-12-17,02,2020,,2022-08-29T09:19:09,true,4,,,,RTE,NATIONALE,21700,COMBLANCHIEN,,,21186,,,,,,,,,,,,,,,,,,,2010-12-31,A,,,,,01.21Z,NAFRev2,O,4.91788,47.102349,0.81,street,Route Nationale 74 21700 Comblanchien,21186_0400,G,ROUTE NATIONALE 74,
326815214,00019,32681521400019,O,1983-02-12,NN,,,2008-04-05T00:27:15,true,3,,,,RTE,N 74,21700,COMBLANCHIEN,,,21186,,,,,,,,,,,,,,,,,,,2008-01-01,A,,,,,68.32A,NAFRev2,N,4.91788,47.102349,0.53,street,Route Nationale 74 21700 Comblanchien,21186_0400,G,ROUTE NATIONALE 74,
327137071,00012,32713707100012,O,1983-04-06,NN,,,,false,3,,,,,,21700,COMBLANCHIEN,,,21186,,,,,,,,,,,,,,,,,,,1993-03-10,F,,,,,70.3D,NAF1993,N,,,0,,,,,,
327137071,00038,32713707100038,O,2003-05-20,NN,,,2020-03-07T03:52:51,true,4,,,,RTE,NATIONAL 74,21700,COMBLANCHIEN,,,21186,,,,,,,,,,,,,,,,,,,2017-07-21,A,,,,,68.20B,NAFRev2,O,4.91788,47.102349,0.73,street,Route Nationale 74 21700 Comblanchien,21186_0400,G,ROUTE NATIONALE 74,
327808051,00012,32780805100012,O,1983-07-08,NN,,,2010-05-28T05:17:05,true,3,,,,,,21700,COMBLANCHIEN,,,21186,,,,,,,,,,,,,,,,,,,1987-09-30,F,,,,,01.1G,NAF1993,N,,,0,,,,,,
328439575,00015,32843957500015,O,1983-10-17,NN,,,2017-05-04T04:01:02,false,7,,42,,RTE,NATIONALE 74,21700,COMBLANCHIEN,,,21186,,,,,,,,,,,,,,,,,,,2015-04-29,F,,,,,23.70Z,NAFRev2,O,4.914435,47.099305,0.86,housenumber,42 Route Nationale 74 21700 Comblanchien,21186_0400_00042,G,42 ROUTE NATIONALE 74,
329430813,00017,32943081300017,O,,,,,,true,1,,,,,,21700,COMBLANCHIEN,,,21186,,,,,,,,,,,,,,,,,,,1997-02-06,F,,,,,01.17,NAP,N,,,0,,,,,,
330087149,00010,33008714900010,O,1984-06-22,NN,,,,true,3,,,,,,21700,COMBLANCHIEN,,,21186,,,,,,,,,,,,,,,,,,,2003-12-31,F,,,,,01.1G,NAFRev1,N,,,0,,,,,,
330223314,00015,33022331400015,O,1984-07-09,NN,,,2018-02-27T10:32:02,true,4,,,,,,21700,COMBLANCHIEN,,,21186,,,,,,,,,,,,,,,,,,,2017-12-31,F,,,,,01.21Z,NAFRev2,N,,,0,,,,,,
330306069,00015,33030606900015,O,1984-07-19,NN,,,2021-02-23T10:50:49,true,3,,6,,RUE,DES PLATIERES,21700,COMBLANCHIEN,,,21186,,,,,,,,,,,,,,,,,,,2008-01-01,A,,,,,01.11Z,NAFRev2,N,4.919551,47.100661,0.94,housenumber,6 Rue des Platières 21700 Comblanchien,21186_0440_00006,G,6 RUE DES PLATIERES,
330345414,00016,33034541400016,O,1984-07-01,NN,,,2014-10-28T09:04:42,false,6,,,,,RN74,21700,COMBLANCHIEN,,,21186,,,,,,,,,,,,,,,,,,,2014-05-30,F,,,,,01.21Z,NAFRev2,O,,,0,,,,,,
332212083,00023,33221208300023,O,1988-08-01,02,2020,2391ZZ,2022-08-29T09:22:30,true,4,,,,,ZONE ARTISANALE,21700,COMBLANCHIEN,,,21186,,,,,,,,,,,,,,,,,,,2008-01-01,A,,,,,23.91Z,NAFRev2,O,2.7640352,42.6301915,0.9,poi.retail,Zone Artisanale (Zone commerciale) Thuir,https://osm.org/way/191039530,G,,
332308519,00039,33230851900039,P,2009-05-18,,,9511ZZ,2022-04-20T20:01:24,true,4,[ND],[ND],[ND],[ND],[ND],[ND],COMBLANCHIEN,,[ND],21186,[ND],[ND],,,[ND],[ND],[ND],[ND],[ND],[ND],,,[ND],,[ND],[ND],,,2021-03-31,F,[ND],[ND],[ND],[ND],95.11Z,NAFRev2,N,,,0,,,,,,
334133907,00017,33413390700017,O,,NN,,,,true,1,,,,RTE,NATIONALE,21700,COMBLANCHIEN,,,21186,,,,,,,,,,,,,,,,,,,1989-04-29,F,,,,,62.11,NAP,N,4.91788,47.102349,0.81,street,Route Nationale 74 21700 Comblanchien,21186_0400,G,ROUTE NATIONALE 74,
334541075,00019,33454107500019,O,1968-03-28,NN,,,,true,1,,,,,,21700,COMBLANCHIEN,,,21186,,,,,,,,,,,,,,,,,,,1988-11-11,F,,,,,01.1G,NAF1993,N,,,0,,,,,,
337702161,00015,33770216100015,O,,NN,,,,true,1,,,,,RN 74,21700,COMBLANCHIEN,,,21186,,,,,,,,,,,,,,,,,,,1993-06-30,F,,,,,74.8K,NAF1993,N,4.91788,47.102349,0.45,street,Route Nationale 74 21700 Comblanchien,21186_0400,G,ROUTE NATIONALE 74,
338899537,00017,33889953700017,O,1986-07-02,NN,,,,true,4,,78,,RTE,NATIONALE,21700,COMBLANCHIEN,,,21186,,,,,,,,,,,,,,,,,,,2001-12-25,F,,,,,55.1A,NAF1993,O,4.91788,47.102349,0.67,street,Route Nationale 74 21700 Comblanchien,21186_0400,G,ROUTE NATIONALE 74,
338953383,00019,33895338300019,O,1986-09-01,NN,,,,true,4,,,,RTE,N 74,21700,COMBLANCHIEN,,,21186,,,,,,,,,,,,,,,,,,,2003-04-30,F,,,,,01.1G,NAFRev1,N,4.91788,47.102349,0.53,street,Route Nationale 74 21700 Comblanchien,21186_0400,G,ROUTE NATIONALE 74,
339523060,00012,33952306000012,O,,NN,,,,true,1,,,,IMP,DU MOULIN,21700,COMBLANCHIEN,,,21186,,,,,,,,,,,,,,,,,,,1994-06-30,F,,,,,55.1A,NAF1993,N,4.925119,47.099373,0.81,street,Impasse du Moulin 21700 Comblanchien,21186_0380,G,IMPASSE DU MOULIN,
342009479,00011,34200947900011,O,1987-07-01,NN,,,2008-11-07T01:02:58,false,4,,,,,ZONE ARTISANALE,21700,COMBLANCHIEN,,,21186,,,,,,,,,,,,,,,,,,,2000-03-01,F,,,,,29.5N,NAF1993,O,2.7640352,42.6301915,0.9,poi.retail,Zone Artisanale (Zone commerciale) Thuir,https://osm.org/way/191039530,G,,
342021540,00014,34202154000014,O,1987-07-01,NN,,,2014-07-08T00:46:39,true,5,,,,,ZONE ARTISANALE,21700,COMBLANCHIEN,,,21186,,,,,,,,,,,,,,,,,,,2009-10-13,F,,,,,33.12Z,NAFRev2,O,2.7640352,42.6301915,0.9,poi.retail,Zone Artisanale (Zone commerciale) Thuir,https://osm.org/way/191039530,G,,
342275609,00028,34227560900028,O,1987-09-30,02,2020,,2023-08-06T20:18:17,true,7,LES ESSARDS,,,RTE,NATIONALE 74,21700,COMBLANCHIEN,,,21186,,,,,,,,,,,,,,,,,,,2020-12-31,A,,,,,46.18Z,NAFRev2,O,4.91788,47.102349,0.84,street,Route Nationale 74 21700 Comblanchien,21186_0400,G,ROUTE NATIONALE 74,
342483765,00059,34248376500059,O,2014-01-01,,,,2018-08-23T11:17:00,false,2,,18,,,GRANDE RUE,21700,COMBLANCHIEN,,,21186,,,,,,,,,,,,,,,,,,,2018-08-01,F,,,,,85.51Z,NAFRev2,N,4.920874,47.100926,0.95,housenumber,18 Grande Rue 21700 Comblanchien,21186_0260_00018,G,18 GRANDE RUE,
342483765,00067,34248376500067,O,2018-08-01,,,,2021-02-23T10:57:58,true,1,,16,,,GRANDE RUE,21700,COMBLANCHIEN,,,21186,,,,,,,,,,,,,,,,,,,2018-08-01,A,,,,,85.51Z,NAFRev2,N,4.920896,47.10102,0.95,housenumber,16 Grande Rue 21700 Comblanchien,21186_0260_00016,G,16 GRANDE RUE,
342761137,00021,34276113700021,O,2008-06-23,01,2020,,2022-08-29T09:27:49,true,3,,34,,RTE,RN 74,21700,COMBLANCHIEN,,,21186,,,,,,,,,,,,,,,,,,,2020-12-10,F,,,,,46.34Z,NAFRev2,O,4.917058,47.101833,0.53,housenumber,34 Route Departementale 974 21700 Comblanchien,21186_9e45jw_00034,G,34 ROUTE DEPARTEMENTALE 974,
343004933,00028,34300493300028,O,1900-01-01,NN,,,2011-04-28T00:35:52,false,2,,,,,CHE DES CARRIERES,21700,COMBLANCHIEN,,,21186,,,,,,,,,,,,,,,,,,,1995-07-12,F,,,,,,,,4.915991,47.105371,0.78,street,Rue des Carrières 21700 Comblanchien,21186_0120,G,RUE DES CARRIERES,
343072534,00013,34307253400013,O,1987-10-22,NN,,,2008-01-04T22:11:13,true,3,,,,,,21700,COMBLANCHIEN,,,21186,,,,,,,,,,,,,,,,,,,2008-01-01,A,,,,,01.21Z,NAFRev2,N,,,0,,,,,,
343515680,00027,34351568000027,O,2009-06-29,,,,2014-07-31T19:31:07,true,2,,40,,RTE,DEPARTEMENTALE 974,21700,COMBLANCHIEN,,,21186,,,,,,,,,,,,,,,,,,,2011-12-30,F,,,,,46.49Z,NAFRev2,N,4.915675,47.100563,0.91,housenumber,40 Route Departementale 974 21700 Comblanchien,21186_9e45jw_00040,G,40 ROUTE DEPARTEMENTALE 974,
345215974,00014,34521597400014,O,1983-01-01,NN,,,2021-02-23T11:00:06,true,3,,,,,,21700,COMBLANCHIEN,,,21186,,,,,,,,,,,,,,,,,,,2008-01-01,A,,,,,01.21Z,NAFRev2,N,,,0,,,,,,
347710709,00010,34771070900010,O,1988-07-22,01,2020,,2022-08-29T09:30:02,true,4,,,,RTE,N 74,21700,COMBLANCHIEN,,,21186,,,,,,,,,,,,,,,,,,,2008-01-01,A,,,,,56.10A,NAFRev2,O,4.91788,47.102349,0.53,street,Route Nationale 74 21700 Comblanchien,21186_0400,G,ROUTE NATIONALE 74,
349364687,00021,34936468700021,O,1995-01-01,NN,,,2006-11-25T11:01:38,true,2,ZONE ARTISANALE,,,CHE,DES CARRIERES,21700,COMBLANCHIEN,,,21186,,,,,,,,,,,,,,,,,,,1995-01-02,F,,,,,,,,4.915991,47.105371,0.78,street,Rue des Carrières 21700 Comblanchien,21186_0120,G,RUE DES CARRIERES,
351669445,00014,35166944500014,O,1989-07-04,NN,,9602AA,2023-08-04T19:34:07,true,4,,31,,RTE,N 74,21700,COMBLANCHIEN,,,21186,,,,,,,,,,,,,,,,,,,2023-07-04,F,,,,,96.02A,NAFRev2,N,4.918782,47.102998,0.64,housenumber,31 Route Nationale 74 21700 Comblanchien,21186_0400_00031,G,31 ROUTE NATIONALE 74,
351669734,00011,35166973400011,O,1989-06-21,NN,,,2006-10-27T23:49:24,false,3,,,,RUE,MIROIR,21700,COMBLANCHIEN,,,21186,,,,,,,,,,,,,,,,,,,2006-01-20,F,,,,,70.2C,NAFRev1,N,4.919808,47.102565,0.86,street,Rue du Miroir 21700 Comblanchien,21186_0360,G,RUE DU MIROIR,
356000265,01805,35600026501805,O,1991-01-01,NN,,,2007-10-15T14:18:32,false,3,,,,,VILLAGE,21700,COMBLANCHIEN,,,21186,,,,,,,,,,,,,,,,,,,2007-10-09,F,BUREAU DE POSTE,,,,64.1A,NAFRev1,N,4.911318,47.098112,0.46,street,Route de Villers la Faye 21700 Comblanchien,21186_94uieb,G,ROUTE DE VILLERS LA FAYE,
379239130,00014,37923913000014,O,1974-01-01,NN,,,2007-01-18T09:28:54,true,3,,,,,,21700,COMBLANCHIEN,,,21186,,,,,,,,,,,,,,,,,,,2001-12-25,F,,,,,01.1G,NAF1993,N,,,0,,,,,,
380073890,00051,38007389000051,O,1990-12-30,NN,,,2008-01-04T21:37:18,false,3,,,,,ZA DU CHAMP DES CANNES,21700,COMBLANCHIEN,,,21186,,,,,,,,,,,,,,,,,,,2008-01-01,A,,,,,43.12A,NAFRev2,N,,,0,,,,,,
381125582,00019,38112558200019,O,1991-02-28,NN,,,2008-01-05T19:51:46,true,3,,,,,,21700,COMBLANCHIEN,,,21186,,,,,,,,,,,,,,,,,,,2008-01-01,A,,,,,68.20B,NAFRev2,N,,,0,,,,,,
381454743,00034,38145474300034,O,,NN,,,,true,1,,5,,RUE,NOUVELLE,21700,COMBLANCHIEN,,,21186,,,,,,,,,,,,,,,,,,,1997-08-31,F,,,,,45.4D,NAF1993,O,4.92281,47.101602,0.95,housenumber,5 Rue Nouvelle 21700 Comblanchien,21186_0420_00005,G,5 RUE NOUVELLE,
381520345,00012,38152034500012,P,1900-01-01,NN,,,2011-04-28T00:47:37,false,3,[ND],[ND],[ND],[ND],[ND],[ND],COMBLANCHIEN,,[ND],21186,[ND],[ND],,,[ND],[ND],[ND],[ND],[ND],[ND],,,[ND],,[ND],[ND],,,1995-12-31,F,[ND],[ND],[ND],[ND],01.1G,NAF1993,N,,,0,,,,,,
381520345,00020,38152034500020,P,1996-05-01,NN,,,2022-11-02T17:17:01,true,3,[ND],[ND],[ND],[ND],[ND],[ND],COMBLANCHIEN,,[ND],21186,[ND],[ND],,,[ND],[ND],[ND],[ND],[ND],[ND],,,[ND],,[ND],[ND],,,2008-01-01,A,[ND],[ND],[ND],[ND],68.20B,NAFRev2,N,,,0,,,,,,
382759173,00018,38275917300018,O,,NN,,,,true,1,,,,RUE,DU MIROIR,21700,COMBLANCHIEN,,,21186,,,,,,,,,,,,,,,,,,,1994-07-13,F,,,,,15.8C,NAF1993,O,4.919808,47.102565,0.95,street,Rue du Miroir 21700 Comblanchien,21186_0360,G,RUE DU MIROIR,
384407839,00024,38440783900024,O,2002-03-01,NN,,,2018-09-29T12:13:28,false,4,,42,,RTE,NATIONALE 74,21700,COMBLANCHIEN,,,21186,,,,,,,,,,,,,,,,,,,2015-04-29,F,,,,,08.11Z,NAFRev2,N,4.914435,47.099305,0.86,housenumber,42 Route Nationale 74 21700 Comblanchien,21186_0400_00042,G,42 ROUTE NATIONALE 74,
385298377,00016,38529837700016,O,,NN,,,,true,1,,,,,LE CHEMIN DU MAUPAS,21700,COMBLANCHIEN,,,21186,,,,,,,,,,,,,,,,,,,1992-12-31,F,,,,,29.3C,NAF1993,N,4.926187,47.09467,0.81,street,Chemin du Maupas 21700 Comblanchien,21186_0325,G,CHEMIN DU MAUPAS,
388179772,00016,38817977200016,O,1992-01-01,NN,,,2021-05-19T03:40:41,true,3,,,,,GDE RUE,21700,COMBLANCHIEN,,,21186,,,,,,,,,,,,,,,,,,,2008-01-01,A,,,,,01.21Z,NAFRev2,N,4.921499,47.100843,0.71,street,Grande Rue 21700 Comblanchien,21186_0260,G,GRANDE RUE,
388978132,00016,38897813200016,O,1992-10-07,NN,,,2008-01-04T23:17:26,true,3,,,,,,21700,COMBLANCHIEN,,,21186,,,,,,,,,,,,,,,,,,,2008-01-01,A,,,,,64.20Z,NAFRev2,N,,,0,,,,,,