siren,nic,siret,statutDiffusionEtablissement,dateCreationEtablissement,trancheEffectifsEtablissement,anneeEffectifsEtablissement,activitePrincipaleRegistreMetiersEtablissement,dateDernierTraitementEtablissement,etablissementSiege,nombrePeriodesEtablissement,complementAdresseEtablissement,numeroVoieEtablissement,indiceRepetitionEtablissement,typeVoieEtablissement,libelleVoieEtablissement,codePostalEtablissement,libelleCommuneEtablissement,libelleCommuneEtrangerEtablissement,distributionSpecialeEtablissement,codeCommuneEtablissement,codeCedexEtablissement,libelleCedexEtablissement,codePaysEtrangerEtablissement,libellePaysEtrangerEtablissement,complementAdresse2Etablissement,numeroVoie2Etablissement,indiceRepetition2Etablissement,typeVoie2Etablissement,libelleVoie2Etablissement,codePostal2Etablissement,libelleCommune2Etablissement,libelleCommuneEtranger2Etablissement,distributionSpeciale2Etablissement,codeCommune2Etablissement,codeCedex2Etablissement,libelleCedex2Etablissement,codePaysEtranger2Etablissement,libellePaysEtranger2Etablissement,dateDebut,etatAdministratifEtablissement,enseigne1Etablissement,enseigne2Etablissement,enseigne3Etablissement,denominationUsuelleEtablissement,activitePrincipaleEtablissement,nomenclatureActivitePrincipaleEtablissement,caractereEmployeurEtablissement,longitude,latitude,geo_score,geo_type,geo_adresse,geo_id,geo_ligne,geo_l4,geo_l5
200019701,00016,20001970100016,O,2009-02-24,,,,2009-04-17T11:45:55,true,1,MAIRIE,1,,RUE,DE LA MAIRIE,25390,LORAY,,,25349,,,,,,,,,,,,,,,,,,,2009-02-24,A,,,,,84.12Z,NAFRev2,N,6.49714,47.15317,0.94,housenumber,1 Rue de la Mairie 25390 Loray,25349_0054_00001,G,1 RUE DE LA MAIRIE,
212503494,00016,21250349400016,O,1983-03-01,02,2020,,2022-08-29T09:06:27,true,4,,1,,RUE,MAIRIE,25390,LORAY,,,25349,,,,,,,,,,,,,,,,,,,2008-01-01,A,MAIRIE,,,,84.11Z,NAFRev2,O,6.49714,47.15317,0.86,housenumber,1 Rue de la Mairie 25390 Loray,25349_0054_00001,G,1 RUE DE LA MAIRIE,
212503494,00024,21250349400024,O,1983-12-21,02,2020,,2022-08-29T09:06:27,false,3,,,,RUE,DE LA FONTAINE RONDE,25390,LORAY,,,25349,,,,,,,,,,,,,,,,,,,2008-01-01,A,ECOLE PRIMAIRE PUBLIQUE,,,,85.20Z,NAFRev2,N,6.496103,47.15321,0.94,street,Rue de la Fontaine Ronde 25390 Loray,25349_0039,G,RUE DE LA FONTAINE RONDE,
212503494,00040,21250349400040,O,1997-01-01,NN,,,2008-01-04T18:29:11,false,3,MAIRIE,1,,RUE,DE LA MAIRIE,25390,LORAY,,,25349,,,,,,,,,,,,,,,,,,,2008-01-01,A,SERVICE EAU,,,,36.00Z,NAFRev2,N,6.49714,47.15317,0.94,housenumber,1 Rue de la Mairie 25390 Loray,25349_0054_00001,G,1 RUE DE LA MAIRIE,
212503494,00057,21250349400057,O,1997-01-01,NN,,,2022-07-25T08:48:47,false,4,MAIRIE,1,,RUE,DE LA MAIRIE,25390,LORAY,,,25349,,,,,,,,,,,,,,,,,,,2021-06-30,F,SERVICE ASSAINISSEMENT,,,,37.00Z,NAFRev2,N,6.49714,47.15317,0.94,housenumber,1 Rue de la Mairie 25390 Loray,25349_0054_00001,G,1 RUE DE LA MAIRIE,
212503494,00065,21250349400065,O,1997-01-01,NN,,,2006-10-26T23:40:35,false,3,MAIRIE,,,,,25390,LORAY,,,25349,,,,,,,,,,,,,,,,,,,2004-12-31,F,SERVICE LOTISSEMENT CHAMP MACHOT,,,,70.1C,NAFRev1,N,6.497653,47.153384,0.91,street,Rue de la Mairie 25390 Loray,25349_0054,D,RUE DE LA MAIRIE,
212503494,00073,21250349400073,O,1997-01-01,NN,,,,false,4,MAIRIE,,,,,25390,LORAY,,,25349,,,,,,,,,,,,,,,,,,,2002-03-21,F,SERVICE POMPES FUNEBRES,,,,93.0H,NAF1993,N,6.497653,47.153384,0.91,street,Rue de la Mairie 25390 Loray,25349_0054,D,RUE DE LA MAIRIE,
212503494,00081,21250349400081,O,1997-01-01,NN,,,2016-01-12T00:10:26,false,3,MAIRIE,1,,RUE,DE LA MAIRIE,25390,LORAY,,,25349,,,,,,,,,,,,,,,,,,,2008-01-01,A,SERVICE BOIS,,,,02.20Z,NAFRev2,N,6.49714,47.15317,0.94,housenumber,1 Rue de la Mairie 25390 Loray,25349_0054_00001,G,1 RUE DE LA MAIRIE,
212503494,00099,21250349400099,O,1997-01-01,NN,,,,false,4,MAIRIE,,,,,25390,LORAY,,,25349,,,,,,,,,,,,,,,,,,,1998-01-01,F,SERVICE ORDURES MENAGERES,,,,90.0B,NAF1993,N,6.497653,47.153384,0.91,street,Rue de la Mairie 25390 Loray,25349_0054,D,RUE DE LA MAIRIE,
212503494,00107,21250349400107,O,2000-01-01,NN,,,,false,3,,,,,MAIRIE,25390,LORAY,,,25349,,,,,,,,,,,,,,,,,,,2001-12-31,F,ZONE ARTISANALE LORAY,,,,70.1C,NAF1993,N,6.497653,47.153384,0.91,street,Rue de la Mairie 25390 Loray,25349_0054,G,RUE DE LA MAIRIE,
212503494,00115,21250349400115,O,2002-01-01,NN,,,,false,3,,1,,RUE,DE LA MAIRIE,25390,LORAY,,,25349,,,,,,,,,,,,,,,,,,,2003-12-31,F,LOTISSEMENT RUE DU LAVOIR LORAY,,,,70.1C,NAFRev1,N,6.49714,47.15317,0.94,housenumber,1 Rue de la Mairie 25390 Loray,25349_0054_00001,G,1 RUE DE LA MAIRIE,
212503494,00123,21250349400123,O,2002-01-01,NN,,,2006-10-26T23:40:35,false,3,,1,,RUE,DE LA MAIRIE,25390,LORAY,,,25349,,,,,,,,,,,,,,,,,,,2005-12-31,F,LOTISSEMENT ROCHE BARCHEY LORAY,,,,70.1C,NAFRev1,N,6.49714,47.15317,0.94,housenumber,1 Rue de la Mairie 25390 Loray,25349_0054_00001,G,1 RUE DE LA MAIRIE,
262504186,00012,26250418600012,O,1986-01-01,NN,,,2017-08-06T14:09:43,true,4,MAIRIE,,,,,25390,LORAY,,,25349,,,,,,,,,,,,,,,,,,,2017-08-01,F,CCAS,,,,88.99B,NAFRev2,N,6.497653,47.153384,0.91,street,Rue de la Mairie 25390 Loray,25349_0054,D,RUE DE LA MAIRIE,
292500543,00015,29250054300015,O,1985-12-10,NN,,,2006-10-26T23:46:16,true,3,,,,,MAIRIE,25390,LORAY,,,25349,,,,,,,,,,,,,,,,,,,2004-12-31,F,,,,,70.1C,NAFRev1,N,6.497653,47.153384,0.91,street,Rue de la Mairie 25390 Loray,25349_0054,G,RUE DE LA MAIRIE,
292501889,00011,29250188900011,O,1992-07-08,NN,,,2006-11-25T09:10:31,true,1,,,,,MAIRIE,25390,LORAY,,,25349,,,,,,,,,,,,,,,,,,,2002-04-15,F,,,,,70.1C,NAF1993,N,6.497653,47.153384,0.91,street,Rue de la Mairie 25390 Loray,25349_0054,G,RUE DE LA MAIRIE,
302101753,00010,30210175300010,O,,,,,,true,1,,,,,,25390,LORAY,,,25349,,,,,,,,,,,,,,,,,,,1984-12-25,F,,,,,55.71,NAP,N,,,0,,,,,,
302167283,00019,30216728300019,O,,NN,,,,true,1,,,,,,25390,LORAY,,,25349,,,,,,,,,,,,,,,,,,,1993-05-31,F,,,,,55.1A,NAF1993,N,,,0,,,,,,
306893231,00036,30689323100036,O,,NN,,,,true,1,,,,,CHALET LES FOURNEX,25390,LORAY,,,25349,,,,,,,,,,,,,,,,,,,1991-06-30,F,,,,,51.1A,NAF1993,N,6.492804,47.14911,0.33,street,Rue du Fourney 25390 Loray,25349_0040,G,RUE DU FOURNEY,
310338835,00013,31033883500013,O,,NN,,,,true,1,,,,,,25390,LORAY,,,25349,,,,,,,,,,,,,,,,,,,1988-04-01,F,,,,,02.20,NAP,N,,,0,,,,,,
311639058,00016,31163905800016,O,,,,,,true,1,,,,,,25390,LORAY,,,25349,,,,,,,,,,,,,,,,,,,1988-03-31,F,,,,,02.20,NAP,N,,,0,,,,,,
312010945,00011,31201094500011,O,1964-01-01,NN,,,2017-04-12T10:49:40,false,4,,5,B,RUE,DES AGES,25390,LORAY,,,25349,,,,,,,,,,,,,,,,,,,2010-01-01,A,,,,,02.20Z,NAFRev2,N,6.498455,47.145416,0.83,housenumber,5bis Rue des Ages 25390 Loray,25349_0008_00005_bis,G,5BIS RUE DES AGES,
312010945,00037,31201094500037,O,2017-03-01,,,,2022-10-03T15:15:53,false,2,,5,,RUE,DES AGES,25390,LORAY,,,25349,,,,,,,,,,,,,,,,,,,2022-08-31,F,,,,,68.10Z,NAFRev2,N,6.498328,47.145759,0.95,housenumber,5 Rue des Ages 25390 Loray,25349_0008_00005,G,5 RUE DES AGES,
312010945,00045,31201094500045,O,2017-01-01,,,,2022-12-17T02:23:50,true,1,,5,,RUE,DES AGES,25390,LORAY,,,25349,,,,,,,,,,,,,,,,,,,2017-01-01,A,,,,,01.49Z,NAFRev2,N,6.498328,47.145759,0.95,housenumber,5 Rue des Ages 25390 Loray,25349_0008_00005,G,5 RUE DES AGES,
312573231,00015,31257323100015,O,1978-01-01,,,,,true,1,,,,,,25390,LORAY,,,25349,,,,,,,,,,,,,,,,,,,2002-12-30,F,,,,,01.2E,NAF1993,N,,,0,,,,,,
312651003,00013,31265100300013,O,,NN,,,,true,1,,,,,,25390,LORAY,,,25349,,,,,,,,,,,,,,,,,,,1995-03-31,F,,,,,20.1A,NAF1993,N,,,0,,,,,,
316566868,00014,31656686800014,O,,NN,,,,true,1,,,,,,25390,LORAY,,,25349,,,,,,,,,,,,,,,,,,,1995-04-24,F,,,,,64.49,NAP,N,,,0,,,,,,
317844934,00016,31784493400016,O,1980-01-01,NN,,,2014-07-08T00:21:28,true,4,,,,LD,DERRIERE LES ROCHES,25390,LORAY,,,25349,,,,,,,,,,,,,,,,,,,2009-11-30,F,,,,,43.22B,NAFRev2,N,6.490436,47.14961,0.49,street,Rue des Roches 25390 Loray,25349_0065,G,RUE DES ROCHES,
319119459,00018,31911945900018,O,,NN,,,,true,1,,,,,,25390,LORAY,,,25349,,,,,,,,,,,,,,,,,,,1982-06-14,F,,,,,48.01,NAP,N,,,0,,,,,,
319783270,00014,31978327000014,O,,NN,,,,true,1,,,,HAM,LES AGES DE LORAY,25390,LORAY,,,25349,,,,,,,,,,,,,,,,,,,1995-12-25,F,,,,,55.4B,NAF1993,N,6.498401,47.145623,0.83,street,Rue des Ages de Loray 25390 Loray,25349_0005,G,RUE DES AGES DE LORAY,
322239708,00017,32223970800017,O,1981-09-01,NN,,,2014-07-08T00:26:45,false,5,,,,,,25390,LORAY,,,25349,,,,,,,,,,,,,,,,,,,2011-11-15,F,,,,,16.10A,NAFRev2,O,,,0,,,,,,
324218692,00014,32421869200014,O,,,,,,true,1,,,,,,25390,LORAY,,,25349,,,,,,,,,,,,,,,,,,,1985-12-25,F,,,,,55.60,NAP,N,,,0,,,,,,
325111276,00011,32511127600011,O,1982-07-01,03,2020,5610CQ,2022-08-29T09:18:43,true,5,,,,,GRANDE RUE,25390,LORAY,,,25349,,,,,,,,,,,,,,,,,,,2008-12-31,A,,,,,56.10A,NAFRev2,O,6.494095,47.152119,0.95,street,Grande Rue 25390 Loray,25349_0050,G,GRANDE RUE,
325763662,00104,32576366200104,O,1987-10-01,NN,,,,false,3,,,,,,25390,LORAY,,,25349,,,,,,,,,,,,,,,,,,,1992-12-31,F,,,,,63.1E,NAF1993,,,,0,,,,,,
326159753,00010,32615975300010,O,1983-01-01,NN,,,2017-05-04T03:45:59,true,5,,32,,,GRANDE RUE,25390,LORAY,,,25349,,,,,,,,,,,,,,,,,,,2012-12-31,A,,,,,01.50Z,NAFRev2,O,6.492577,47.151325,0.95,housenumber,32 Grande Rue 25390 Loray,25349_0050_00032,G,32 GRANDE RUE,
326174711,00019,32617471100019,O,1983-01-01,NN,,,2016-01-07T08:47:54,false,5,,,,,,25390,LORAY,,,25349,,,,,,,,,,,,,,,,,,,2011-08-11,F,,,,,68.20B,NAFRev2,N,,,0,,,,,,
326174711,00035,32617471100035,O,2016-01-04,,,4339ZZ,2021-02-10T09:06:01,true,2,,13,B,RUE,DES ROCHES,25390,LORAY,,,25349,,,,,,,,,,,,,,,,,,,2021-01-30,F,,,,,81.21Z,NAFRev2,N,6.489202,47.149249,0.85,housenumber,13bis Rue des Roches 25390 Loray,25349_0065_00013_bis,G,13BIS RUE DES ROCHES,
326335403,00019,32633540300019,O,,NN,,,,true,1,,,,,,25390,LORAY,,,25349,,,,,,,,,,,,,,,,,,,1988-12-31,F,,,,,55.60,NAP,N,,,0,,,,,,
327023545,00012,32702354500012,P,1983-04-11,NN,,4332AA,2018-10-03T10:59:20,true,6,[ND],[ND],[ND],[ND],[ND],[ND],LORAY,,[ND],25349,[ND],[ND],,,[ND],[ND],[ND],[ND],[ND],[ND],,,[ND],,[ND],[ND],,,2011-01-03,A,[ND],[ND],[ND],[ND],43.32A,NAFRev2,N,,,0,,,,,,
327023545,00020,32702354500020,P,2011-01-03,,,,2013-09-12T00:10:24,false,2,[ND],[ND],[ND],[ND],[ND],[ND],LORAY,,[ND],25349,[ND],[ND],,,[ND],[ND],[ND],[ND],[ND],[ND],,,[ND],,[ND],[ND],,,2011-01-03,F,[ND],[ND],[ND],[ND],43.32A,NAFRev2,N,,,0,,,,,,
327450490,00013,32745049000013,P,1983-06-05,NN,,,2023-09-12T07:54:33,true,5,[ND],[ND],[ND],[ND],[ND],[ND],LORAY,,[ND],25349,[ND],[ND],,,[ND],[ND],[ND],[ND],[ND],[ND],,,[ND],,[ND],[ND],,,2023-01-01,A,[ND],[ND],[ND],[ND],02.10Z,NAFRev2,N,,,0,,,,,,
329478911,00012,32947891100012,O,1984-02-01,NN,,,2007-01-18T09:18:50,true,3,,,,,,25390,LORAY,,,25349,,,,,,,,,,,,,,,,,,,1992-12-25,F,,,,,01.2E,NAF1993,N,,,0,,,,,,
332857549,00015,33285754900015,O,1985-05-01,NN,,,,true,1,,,,,,25390,LORAY,,,25349,,,,,,,,,,,,,,,,,,,2000-10-02,F,,,,,50.1Z,NAF1993,N,,,0,,,,,,
342028032,00031,34202803200031,O,1995-10-02,NN,,,2011-04-28T00:34:18,false,4,,5,,RUE,DE L'ABBE LANDRY,25390,LORAY,,,25349,,,,,,,,,,,,,,,,,,,1999-09-30,F,,,,,01.4D,NAF1993,N,6.496758,47.151576,0.95,housenumber,5 Rue de l'Abbé Landry 25390 Loray,25349_0002_00005,G,5 RUE DE L ABBE LANDRY,
342028032,00049,34202803200049,O,2008-10-16,,,4312AZ,2016-02-05T03:43:40,true,3,,3,,RUE,DE LA MAIRIE,25390,LORAY,,,25349,,,,,,,,,,,,,,,,,,,2015-12-31,F,,,,,42.99Z,NAFRev2,N,6.497961,47.153468,0.94,housenumber,3 Rue de la Mairie 25390 Loray,25349_0054_00003,G,3 RUE DE LA MAIRIE,
343513073,00050,34351307300050,O,2016-04-01,00,2020,,2022-08-29T09:28:25,true,2,,35,,,GRANDE RUE,25390,LORAY,,,25349,,,,,,,,,,,,,,,,,,,2020-10-01,A,,,,,43.33Z,NAFRev2,O,6.493613,47.149489,0.95,housenumber,35 Grande Rue 25390 Loray,25349_0050_00035,G,35 GRANDE RUE,
343757159,00011,34375715900011,O,1988-02-05,NN,,,2006-11-25T10:49:09,true,2,,2,,RUE,DU CALVAIRE,25390,LORAY,,,25349,,,,,,,,,,,,,,,,,,,1991-01-15,F,,,,,,,,6.497439,47.152074,0.94,housenumber,2 Rue du Calvaire 25390 Loray,25349_0013_00002,G,2 RUE DU CALVAIRE,
347575946,00053,34757594600053,P,2018-01-01,,,,2021-09-04T11:57:56,false,1,[ND],[ND],[ND],[ND],[ND],[ND],LORAY,,[ND],25349,[ND],[ND],,,[ND],[ND],[ND],[ND],[ND],[ND],,,[ND],,[ND],[ND],,,2018-01-01,A,[ND],[ND],[ND],[ND],02.10Z,NAFRev2,N,,,0,,,,,,
350386173,00016,35038617300016,O,1988-04-01,NN,,,2021-02-23T11:03:08,true,7,,,,LD,NIELLANS,25390,LORAY,,,25349,,,,,,,,,,,,,,,,,,,2013-09-19,A,,,,,01.43Z,NAFRev2,N,6.4733,47.16255,0.95,street,Niellans 25390 Loray,25349_b0w3oz,G,NIELLANS,
387680739,00019,38768073900019,O,1992-04-01,NN,,,2008-02-27T05:23:11,true,3,,,,,NIELLANS,25390,LORAY,,,25349,,,,,,,,,,,,,,,,,,,2008-01-01,A,,,,,01.41Z,NAFRev2,N,6.4733,47.16255,0.95,street,Niellans 25390 Loray,25349_b0w3oz,G,NIELLANS,
389846098,00017,38984609800017,O,1992-12-28,NN,,,2018-10-23T09:45:34,false,3,,,,,,25390,LORAY,,,25349,,,,,,,,,,,,,,,,,,,2008-01-01,A,,,,,02.40Z,NAFRev2,N,,,0,,,,,,
390194256,00017,39019425600017,O,1983-04-01,NN,,,2006-10-28T01:35:21,true,3,NIELLANS,,,,,25390,LORAY,,,25349,,,,,,,,,,,,,,,,,,,2005-12-31,F,,,,,01.2A,NAFRev1,N,6.4733,47.16255,0.95,street,Niellans 25390 Loray,25349_b0w3oz,D,NIELLANS,
390194355,00017,39019435500017,O,1968-01-01,NN,,,,true,3,,,,,,25390,LORAY,,,25349,,,,,,,,,,,,,,,,,,,2000-01-31,F,,,,,70.2B,NAF1993,N,,,0,,,,,,
390444792,00019,39044479200019,O,,,,,,true,1,,,,,,25390,LORAY,,,25349,,,,,,,,,,,,,,,,,,,1994-12-31,F,,,,,01.3Z,NAF1993,N,,,0,,,,,,
390444925,00015,39044492500015,O,1983-01-01,NN,,,2008-01-04T23:40:13,true,4,,15,B,,GRANDE RUE,25390,LORAY,,,25349,,,,,,,,,,,,,,,,,,,2008-01-01,A,,,,,68.20B,NAFRev2,N,6.496537,47.153637,0.83,housenumber,15bis Grande Rue 25390 Loray,25349_0050_00015_bis,G,15BIS GRANDE RUE,
390445294,00015,39044529400015,O,1978-05-01,NN,,,2010-05-14T05:53:28,true,4,,,,,,25390,LORAY,,,25349,,,,,,,,,,,,,,,,,,,2010-04-30,F,,,,,01.41Z,NAFRev2,N,,,0,,,,,,
390445591,00014,39044559100014,O,1987-06-01,NN,,,2006-10-28T01:37:02,true,3,,1,,,GRANDE RUE,25390,LORAY,,,25349,,,,,,,,,,,,,,,,,,,2006-03-31,F,,,,,01.2A,NAFRev1,N,6.490089,47.156475,0.95,housenumber,1 Grande Rue 25390 Loray,25349_0050_00001,G,1 GRANDE RUE,
391762705,00013,39176270500013,O,,NN,,,,true,1,,46,,,GRANDE RUE,25390,LORAY,,,25349,,,,,,,,,,,,,,,,,,,1995-06-30,F,,,,,36.1G,NAF1993,N,6.495345,47.148847,0.95,housenumber,46 Grande Rue 25390 Loray,25349_0050_00046,G,46 GRANDE RUE,
392933164,00015,39293316400015,O,1976-03-26,NN,,,,true,1,,,,,,25390,LORAY,,,25349,,,,,,,,,,,,,,,,,,,2001-05-01,F,,,,,01.2A,NAF1993,N,,,0,,,,,,
393286158,00018,39328615800018,O,1984-01-01,NN,,,2008-01-05T00:14:24,true,3,,,,,,25390,LORAY,,,25349,,,,,,,,,,,,,,,,,,,2008-01-01,A,,,,,01.41Z,NAFRev2,N,,,0,,,,,,
397732389,00010,39773238900010,P,1994-08-01,NN,,,,false,4,[ND],[ND],[ND],[ND],[ND],[ND],LORAY,,[ND],25349,[ND],[ND],,,[ND],[ND],[ND],[ND],[ND],[ND],,,[ND],,[ND],[ND],,,1998-09-01,F,[ND],[ND],[ND],[ND],85.1G,NAF1993,N,,,0,,,,,,
399929058,00010,39992905800010,O,1995-01-01,NN,,,,true,1,,5,,,GRANDE RUE,25390,LORAY,,,25349,,,,,,,,,,,,,,,,,,,1998-03-31,F,,,,,01.2A,NAF1993,N,6.492482,47.156081,0.95,housenumber,5 Grande Rue 25390 Loray,25349_0050_00005,G,5 GRANDE RUE,
400523262,00014,40052326200014,O,1995-02-01,NN,,,,false,4,,28,,,GRANDE RUE,25390,LORAY,,,25349,,,,,,,,,,,,,,,,,,,2002-10-01,F,,,,,01.2A,NAF1993,N,6.49393,47.15218,0.95,housenumber,28 Grande Rue 25390 Loray,25349_0050_00028,G,28 GRANDE RUE,
400523262,00022,40052326200022,O,2002-10-01,NN,,,2008-12-11T04:58:33,true,3,,,,RUE,DES ROCHES,25390,LORAY,,,25349,,,,,,,,,,,,,,,,,,,2008-01-01,A,,,,,01.41Z,NAFRev2,N,6.490436,47.14961,0.95,street,Rue des Roches 25390 Loray,25349_0065,G,RUE DES ROCHES,
401419957,00014,40141995700014,O,1995-06-07,,,,2009-02-04T00:20:18,true,3,LES AGES - NÂ° 10,,,,,25390,LORAY,,,25349,,,,,,,,,,,,,,,,,,,2008-01-01,A,,,,,68.20B,NAFRev2,N,6.500412,47.144927,0.36,street,Rue des Ages 25390 Loray,25349_0008,D,RUE DES AGES,
401602750,00010,40160275000010,O,1995-07-01,NN,,,2017-05-04T05:08:34,false,5,,10,,LD,LES AGES,25390,LORAY,,,25349,,,,,,,,,,,,,,,,,,,2015-07-01,A,,,,,68.20B,NAFRev2,N,6.497848,47.144641,0.76,housenumber,10 Rue des Ages 25390 Loray,25349_0008_00010,G,10 RUE DES AGES,
401684253,00016,40168425300016,O,1995-07-01,NN,,,2008-11-08T01:11:50,false,4,,46,,,GRANDE RUE,25390,LORAY,,,25349,,,,,,,,,,,,,,,,,,,2002-07-01,F,,,,,36.1G,NAF1993,O,6.495345,47.148847,0.95,housenumber,46 Grande Rue 25390 Loray,25349_0050_00046,G,46 GRANDE RUE,
401684253,00024,40168425300024,O,2002-07-01,NN,,3109BA,2015-03-17T00:44:51,false,5,,2,,RUE,DU BAS DES AGES,25390,LORAY,,,25349,,,,,,,,,,,,,,,,,,,2012-08-27,F,,,,,31.01Z,NAFRev2,O,6.498097,47.146191,0.68,housenumber,2 Rue des Ages 25390 Loray,25349_0008_00002,G,2 RUE DES AGES,
402901946,00028,40290194600028,O,1999-02-01,NN,,,2015-07-29T14:41:17,true,4,,38,,,GRANDE RUE,25390,LORAY,,BP 2,25349,,,,,,,,,,,,,,,,,,,2012-08-16,F,,,,,81.30Z,NAFRev2,N,6.493806,47.149308,0.95,housenumber,38 Grande Rue 25390 Loray,25349_0050_00038,G,38 GRANDE RUE,
404190498,00018,40419049800018,O,1995-01-01,NN,,,,true,3,,,,,,25390,LORAY,,,25349,,,,,,,,,,,,,,,,,,,1998-12-25,F,,,,,02.0B,NAF1993,N,,,0,,,,,,
404213167,00020,40421316700020,O,2014-04-14,,,,2021-02-23T11:28:35,true,1,,5,,RUE,DES ROCHES,25390,LORAY,,,25349,,,,,,,,,,,,,,,,,,,2014-04-14,A,,,,,01.49Z,NAFRev2,N,6.49101,47.149526,0.95,housenumber,5 Rue des Roches 25390 Loray,25349_0065_00005,G,5 RUE DES ROCHES,
404964868,00016,40496486800016,O,1996-04-01,NN,,,2008-11-08T01:18:03,false,3,,5,B,RUE,DES AGES,25390,LORAY,,,25349,,,,,,,,,,,,,,,,,,,2004-04-01,F,,,,,45.2V,NAFRev1,O,6.498455,47.145416,0.83,housenumber,5bis Rue des Ages 25390 Loray,25349_0008_00005_bis,G,5BIS RUE DES AGES,
411280027,00029,41128002700029,O,1996-01-01,NN,,,2008-01-04T21:56:26,false,3,,,,,,25390,LORAY,,,25349,,,,,,,,,,,,,,,,,,,2008-01-01,A,,,,,02.20Z,NAFRev2,N,,,0,,,,,,
411352586,00035,41135258600035,O,2008-10-14,,,,2017-04-19T10:36:51,false,2,,50,,,GRANDE RUE,25390,LORAY,,,25349,,,,,,,,,,,,,,,,,,,2017-02-14,F,,,,,68.20B,NAFRev2,N,6.498354,47.147673,0.95,housenumber,50 Grande Rue 25390 Loray,25349_0050_00050,G,50 GRANDE RUE,
413161662,00015,41316166200015,O,1997-08-01,NN,,,2008-11-08T01:28:09,true,3,,9,,RUE,DES CHAMPS MACHOTS,25390,LORAY,,,25349,,,,,,,,,,,,,,,,,,,2004-02-29,F,,,,,52.7F,NAFRev1,N,6.496982,47.150534,0.95,housenumber,9 Rue des Champs Machots 25390 Loray,25349_0014_00009,G,9 RUE DES CHAMPS MACHOTS,
415042837,00013,41504283700013,O,1998-01-01,03,2020,4332AA,2023-04-01T13:36:50,true,6,,13,,RUE,DES AGES,25390,LORAY,,,25349,,,,,,,,,,,,,,,,,,,2011-05-03,A,,,,G.G.M. EURL,43.32A,NAFRev2,O,6.502028,47.144925,0.95,housenumber,13 Rue des Ages 25390 Loray,25349_0008_00013,G,13 RUE DES AGES,
418012621,00011,41801262100011,O,1998-02-03,NN,,,2010-12-15T09:05:49,false,4,CHEZ MME MARIELLE DUCHENE,3,,RUE,DE LA MAIRIE,25390,LORAY,,,25349,,,,,,,,,,,,,,,,,,,2010-11-10,F,,,,,68.20B,NAFRev2,N,6.497961,47.153468,0.94,housenumber,3 Rue de la Mairie 25390 Loray,25349_0054_00003,G,3 RUE DE LA MAIRIE,
418479713,00012,41847971300012,O,1998-04-08,NN,,,2012-07-10T05:05:27,true,3,AUX FOURNETS,,,,GRANDE RUE,25390,LORAY,,,25349,,,,,,,,,,,,,,,,,,,2008-01-01,A,,,,,68.20B,NAFRev2,N,6.494095,47.152119,0.95,street,Grande Rue 25390 Loray,25349_0050,G,GRANDE RUE,
418766887,00032,41876688700032,O,2008-08-04,NN,,4399DC,2021-02-23T11:39:31,true,1,,9,B,RUE,DES AGES,25390,LORAY,,,25349,,,,,,,,,,,,,,,,,,,2008-08-04,A,,,,,81.30Z,NAFRev2,O,6.500261,47.145469,0.83,housenumber,9bis Rue des Ages 25390 Loray,25349_0008_00009_bis,G,9BIS RUE DES AGES,
422030478,00024,42203047800024,O,2016-11-18,,,,2016-11-24T09:29:17,false,1,,12,,RUE,DE L'EGLISE,25390,LORAY,,,25349,,,,,,,,,,,,,,,,,,,2016-11-18,A,,,,,01.49Z,NAFRev2,N,6.496808,47.15255,0.94,housenumber,12 Rue de l'Eglise 25390 Loray,25349_0030_00012,G,12 RUE DE L EGLISE,
423435015,00015,42343501500015,O,1999-06-04,NN,,,2014-01-30T14:14:16,false,4,,13,,,GRANDE RUE,25390,LORAY,,,25349,,,,,,,,,,,,,,,,,,,2014-01-01,F,,,,,68.20B,NAFRev2,N,6.495322,47.153884,0.95,housenumber,13 Grande Rue 25390 Loray,25349_0050_00013,G,13 GRANDE RUE,
423509181,00016,42350918100016,O,1998-01-01,NN,,,2016-01-12T00:21:06,true,3,,,,,,25390,LORAY,,,25349,,,,,,,,,,,,,,,,,,,2008-01-01,A,,,,,02.20Z,NAFRev2,N,,,0,,,,,,
428693436,00019,42869343600019,O,1998-01-01,NN,,,2008-08-12T03:53:12,true,3,,,,,LA COTE,25390,LORAY,,,25349,,,,,,,,,,,,,,,,,,,2007-12-31,F,,,,,02.0B,NAFRev1,N,6.496973,47.149226,0.34,street,Rue de la Joux 25390 Loray,25349_0060,G,RUE DE LA JOUX,
430610162,00017,43061016200017,O,1993-01-01,NN,,,2012-07-28T17:35:18,true,4,,,,,,25390,LORAY,,,25349,,,,,,,,,,,,,,,,,,,2008-01-01,F,,,,,01.41Z,NAFRev2,N,,,0,,,,,,
430610253,00014,43061025300014,O,1999-01-01,NN,,,,true,3,,38,,,GRANDE RUE,25390,LORAY,,,25349,,,,,,,,,,,,,,,,,,,2003-01-01,F,,,,,70.2A,NAF1993,N,6.493806,47.149308,0.95,housenumber,38 Grande Rue 25390 Loray,25349_0050_00038,G,38 GRANDE RUE,
434254207,00021,43425420700021,O,2009-10-20,,,,2012-11-09T01:18:38,true,2,,50,,,GRANDE RUE,25390,LORAY,,,25349,,,,,,,,,,,,,,,,,,,2011-03-31,F,CDC CONVOYAGE,,,,82.99Z,NAFRev2,N,6.498354,47.147673,0.95,housenumber,50 Grande Rue 25390 Loray,25349_0050_00050,G,50 GRANDE RUE,
434970224,00011,43497022400011,O,2001-03-08,NN,,,2006-10-31T01:51:41,false,3,M. MME CLIVIO LOUIS,5,B,RUE,DES AGES,25390,LORAY,,,25349,,,,,,,,,,,,,,,,,,,2006-09-02,F,,,,,70.2C,NAFRev1,N,6.498455,47.145416,0.83,housenumber,5bis Rue des Ages 25390 Loray,25349_0008_00005_bis,G,5BIS RUE DES AGES,
437969900,00012,43796990000012,O,2001-05-01,NN,,,2015-02-11T08:33:59,false,4,,4,,RUE,DES ROCHES,25390,LORAY,,,25349,,,,,,,,,,,,,,,,,,,2015-02-01,F,,,,,01.41Z,NAFRev2,N,6.491535,47.15032,0.95,housenumber,4 Rue des Roches 25390 Loray,25349_0065_00004,G,4 RUE DES ROCHES,
437969900,00020,43796990000020,O,2015-02-01,,,,2021-07-29T10:20:21,true,1,,31,,,GRANDE RUE,25390,LORAY,,,25349,,,,,,,,,,,,,,,,,,,2015-02-01,A,,,,,01.41Z,NAFRev2,N,6.493123,47.151693,0.95,housenumber,31 Grande Rue 25390 Loray,25349_0050_00031,G,31 GRANDE RUE,
437969900,00038,43796990000038,O,2021-05-21,,,,2021-06-03T10:01:03,false,1,LIEU DIT RATIER,2,,RUE,DES ROCHES,25390,LORAY,,,25349,,,,,,,,,,,,,,,,,,,2021-05-21,A,,,,,35.11Z,NAFRev2,N,6.490913,47.149573,0.95,housenumber,2 Rue des Roches 25390 Loray,25349_0065_00002,G,2 RUE DES ROCHES,
438270480,00017,43827048000017,O,2001-04-01,NN,,,2011-02-15T10:39:49,true,4,FROMAGERIE DE LORAY,18,,,GRANDE RUE,25390,LORAY,,,25349,,,,,,,,,,,,,,,,,,,2010-07-12,F,,,,,78.30Z,NAFRev2,N,6.495365,47.152991,0.95,housenumber,18 Grande Rue 25390 Loray,25349_0050_00018,G,18 GRANDE RUE,
440785756,00014,44078575600014,O,2002-02-01,NN,,,2017-05-04T04:44:34,true,4,,11,,RUE,DE L'ABBE LANDRY,25390,LORAY,,,25349,,,,,,,,,,,,,,,,,,,2015-03-31,F,,,,,82.99Z,NAFRev2,O,6.496283,47.151384,0.95,housenumber,11 Rue de l'Abbé Landry 25390 Loray,25349_0002_00011,G,11 RUE DE L ABBE LANDRY,
442854576,00018,44285457600018,O,2002-07-11,NN,,,2013-06-05T09:43:20,false,4,,2,,RUE,DU BAS DES AGES,25390,LORAY,,,25349,,,,,,,,,,,,,,,,,,,2013-05-02,F,,,,,68.20B,NAFRev2,N,6.498097,47.146191,0.68,housenumber,2 Rue des Ages 25390 Loray,25349_0008_00002,G,2 RUE DES AGES,
443354428,00015,44335442800015,O,2001-03-01,,,,,true,1,,8,,RUE,DU CALVAIRE,25390,LORAY,,,25349,,,,,,,,,,,,,,,,,,,2001-03-30,F,,,,,74.1G,NAF1993,N,6.497439,47.152074,0.94,housenumber,8 Rue du Calvaire 25390 Loray,25349_0013_00008,G,8 RUE DU CALVAIRE,
447968066,00012,44796806600012,O,2002-09-18,NN,,,2006-11-25T18:26:14,true,3,,1,,RUE,DU CALVAIRE,25390,LORAY,,,25349,,,,,,,,,,,,,,,,,,,2004-12-31,F,,,,,52.6G,NAFRev1,N,6.497207,47.152333,0.94,housenumber,1 Rue du Calvaire 25390 Loray,25349_0013_00001,G,1 RUE DU CALVAIRE,
448325373,00018,44832537300018,O,2003-01-01,02,2020,,2022-08-29T09:02:35,true,3,,2,,HAM,DE NIELLANS,25390,LORAY,,,25349,,,,,,,,,,,,,,,,,,,2008-01-01,A,,,,,94.99Z,NAFRev2,O,6.47773,47.161335,0.7,housenumber,2 Niellans 25390 Loray,25349_b0w3oz_00002,G,2 NIELLANS,
453923385,00018,45392338500018,O,2004-06-01,,,,2018-07-23T14:57:42,true,4,,15,B,,GRANDE RUE,25390,LORAY,,,25349,,,,,,,,,,,,,,,,,,,2011-12-29,F,,,,,01.41Z,NAFRev2,N,6.496537,47.153637,0.83,housenumber,15bis Grande Rue 25390 Loray,25349_0050_00015_bis,G,15BIS GRANDE RUE,