siren,nic,siret,statutDiffusionEtablissement,dateCreationEtablissement,trancheEffectifsEtablissement,anneeEffectifsEtablissement,activitePrincipaleRegistreMetiersEtablissement,dateDernierTraitementEtablissement,etablissementSiege,nombrePeriodesEtablissement,complementAdresseEtablissement,numeroVoieEtablissement,indiceRepetitionEtablissement,typeVoieEtablissement,libelleVoieEtablissement,codePostalEtablissement,libelleCommuneEtablissement,libelleCommuneEtrangerEtablissement,distributionSpecialeEtablissement,codeCommuneEtablissement,codeCedexEtablissement,libelleCedexEtablissement,codePaysEtrangerEtablissement,libellePaysEtrangerEtablissement,complementAdresse2Etablissement,numeroVoie2Etablissement,indiceRepetition2Etablissement,typeVoie2Etablissement,libelleVoie2Etablissement,codePostal2Etablissement,libelleCommune2Etablissement,libelleCommuneEtranger2Etablissement,distributionSpeciale2Etablissement,codeCommune2Etablissement,codeCedex2Etablissement,libelleCedex2Etablissement,codePaysEtranger2Etablissement,libellePaysEtranger2Etablissement,dateDebut,etatAdministratifEtablissement,enseigne1Etablissement,enseigne2Etablissement,enseigne3Etablissement,denominationUsuelleEtablissement,activitePrincipaleEtablissement,nomenclatureActivitePrincipaleEtablissement,caractereEmployeurEtablissement,longitude,latitude,geo_score,geo_type,geo_adresse,geo_id,geo_ligne,geo_l4,geo_l5
213403025,00017,21340302500017,O,1983-03-01,11,2020,,2022-08-29T09:06:56,true,4,,,,PL,DE LA MAIRIE,34210,SIRAN,,,34302,,,,,,,,,,,,,,,,,,,2008-01-01,A,MAIRIE,,,,84.11Z,NAFRev2,O,2.660147,43.313424,0.6,street,Rue de l'Ancienne Mairie 34210 Siran,34302_0150,G,RUE DE L ANCIENNE MAIRIE,
213403025,00025,21340302500025,O,1983-12-21,01,2020,,2022-08-29T09:06:56,false,3,,,,AV,DES ECOLES,34210,SIRAN,,,34302,,,,,,,,,,,,,,,,,,,2008-01-01,A,ECOLE PRIMAIRE PUBLIQUE,,,,85.20Z,NAFRev2,N,2.661585,43.31418,0.8,street,Avenue des Ecoles 34210 Siran,34302_0110,G,AVENUE DES ECOLES,
213403025,00033,21340302500033,O,1997-01-01,NN,,,2008-01-04T18:31:44,false,3,MAIRIE,,,PL,DE LA  MAIRIE,34210,SIRAN,,,34302,,,,,,,,,,,,,,,,,,,2008-01-01,A,EAU ASSAINISSEMENT,,,,36.00Z,NAFRev2,N,2.660147,43.313424,0.6,street,Rue de l'Ancienne Mairie 34210 Siran,34302_0150,G,RUE DE L ANCIENNE MAIRIE,
213403025,00041,21340302500041,O,1998-08-05,NN,,,2008-01-04T18:31:44,false,3,MAIRIE,,,PL,DE LA MAIRIE,34210,SIRAN,,,34302,,,,,,,,,,,,,,,,,,,2008-01-01,A,SERVICE FUNERAIRE,,,,96.03Z,NAFRev2,N,2.660147,43.313424,0.6,street,Rue de l'Ancienne Mairie 34210 Siran,34302_0150,G,RUE DE L ANCIENNE MAIRIE,
213403025,00058,21340302500058,O,2003-04-01,NN,,,2010-09-07T10:31:38,false,4,MAIRIE,,,PL,DE LA MAIRIE,34210,SIRAN,,,34302,,,,,,,,,,,,,,,,,,,2009-03-05,F,LOTISSEMENT COMMUNAL,,,,42.99Z,NAFRev2,N,2.660147,43.313424,0.6,street,Rue de l'Ancienne Mairie 34210 Siran,34302_0150,G,RUE DE L ANCIENNE MAIRIE,
253401418,00012,25340141800012,O,,NN,,,,true,1,,,,,,34210,SIRAN,,,34302,,,,,,,,,,,,,,,,,,,1990-05-21,F,,,,,87.05,NAP,N,,,0,,,,,,
253403596,00013,25340359600013,O,2005-09-12,NN,,,2019-03-13T04:17:18,true,3,MAIRIE,,,PL,DE LA MAIRIE,34210,SIRAN,,,34302,,,,,,,,,,,,,,,,,,,2019-03-15,F,,,,,84.12Z,NAFRev2,N,2.660147,43.313424,0.6,street,Rue de l'Ancienne Mairie 34210 Siran,34302_0150,G,RUE DE L ANCIENNE MAIRIE,
263403388,00014,26340338800014,O,1995-12-25,,,,2010-06-26T03:08:50,true,2,,,,PL,DE LA MAIRIE,34210,SIRAN,,,34302,,,,,,,,,,,,,,,,,,,2008-01-01,A,CCAS,,,,88.99B,NAFRev2,N,2.660147,43.313424,0.6,street,Rue de l'Ancienne Mairie 34210 Siran,34302_0150,G,RUE DE L ANCIENNE MAIRIE,
293400776,00010,29340077600010,O,1983-09-14,NN,,,2018-09-29T12:08:56,true,3,MAIRIE,,,PL,DE LA MAIRIE,34210,SIRAN,,,34302,,,,,,,,,,,,,,,,,,,2008-01-01,A,,,,,42.99Z,NAFRev2,N,2.660147,43.313424,0.6,street,Rue de l'Ancienne Mairie 34210 Siran,34302_0150,G,RUE DE L ANCIENNE MAIRIE,
293401626,00016,29340162600016,O,1987-07-03,NN,,,2008-01-04T19:06:32,true,4,PRESIDENT RENE CHABBERT,,,,MAIRIE,34210,SIRAN,,,34302,,,,,,,,,,,,,,,,,,,2008-01-01,A,,,,,42.99Z,NAFRev2,N,2.660147,43.313424,0.91,street,Rue de l'Ancienne Mairie 34210 Siran,34302_0150,G,RUE DE L ANCIENNE MAIRIE,
293401642,00013,29340164200013,O,1985-07-24,NN,,,2008-01-04T19:06:32,true,3,,,,,MAIRIE,34210,SIRAN,,,34302,,,,,,,,,,,,,,,,,,,2008-01-01,A,,,,,42.99Z,NAFRev2,N,2.660147,43.313424,0.91,street,Rue de l'Ancienne Mairie 34210 Siran,34302_0150,G,RUE DE L ANCIENNE MAIRIE,
300191053,00010,30019105300010,O,,NN,,,,true,1,,,,,,34210,SIRAN,,,34302,,,,,,,,,,,,,,,,,,,1993-12-31,F,,,,,45.2V,NAF1993,O,,,0,,,,,,
300831468,00016,30083146800016,O,1977-01-01,NN,,,,true,1,,,,,,34210,SIRAN,,,34302,,,,,,,,,,,,,,,,,,,2000-03-31,F,,,,,52.1B,NAF1993,N,,,0,,,,,,
300831476,00019,30083147600019,O,1961-01-01,NN,,,,true,1,,,,AV,DU CHATEAU,34210,SIRAN,,,34302,,,,,,,,,,,,,,,,,,,2000-03-31,F,,,,,52.1B,NAF1993,N,2.662351,43.312858,0.81,street,Avenue du Château 34210 Siran,34302_0060,G,AVENUE DU CHATEAU,
301701637,00011,30170163700011,O,,NN,,,,true,1,,,,,,34210,SIRAN,,,34302,,,,,,,,,,,,,,,,,,,1992-03-31,F,,,,,52.4N,NAF1993,N,,,0,,,,,,
302368311,00015,30236831100015,O,,NN,,,,true,1,,,,,,34210,SIRAN,,,34302,,,,,,,,,,,,,,,,,,,1986-03-31,F,,,,,55.71,NAP,N,,,0,,,,,,
302382114,00015,30238211400015,O,,NN,,,,true,1,,,,,,34210,SIRAN,,,34302,,,,,,,,,,,,,,,,,,,,F,,,,,55.71,NAP,N,,,0,,,,,,
303268593,00017,30326859300017,O,,NN,,,,true,1,,,,PL,PUBLIQUE,34210,SIRAN,,,34302,,,,,,,,,,,,,,,,,,,1990-12-31,F,,,,,62.11,NAP,N,3.6018073,49.6141328,0.75,poi.park,Place Publique (Parc) Aulnois-sous-Laon,https://osm.org/way/175146704,G,,
304256308,00012,30425630800012,O,,NN,,,,true,1,,,,RUE,DU PORCHE,34210,SIRAN,,,34302,,,,,,,,,,,,,,,,,,,1989-03-01,F,,,,,38.40,NAP,N,2.661462,43.312603,0.94,street,Rue du Porche 34210 Siran,34302_0197,G,RUE DU PORCHE,
305340556,00011,30534055600011,O,,NN,,,,true,1,,,,,,34210,SIRAN,,,34302,,,,,,,,,,,,,,,,,,,1993-08-15,F,,,,,45.3E,NAF1993,N,,,0,,,,,,
308997311,00060,30899731100060,O,2006-01-01,,,,2008-05-19T13:59:42,false,2,,,,,,34210,SIRAN,,,34302,,,,,,,,,,,,,,,,,,,2007-11-14,F,,,,,01.1G,NAFRev1,N,,,0,,,,,,
312728470,00021,31272847000021,O,2018-01-01,,,,2021-02-23T10:39:50,true,1,,10,,RUE,DE LA CONDAMINE,34210,SIRAN,,,34302,,,,,,,,,,,,,,,,,,,2018-01-01,A,,,,,01.21Z,NAFRev2,N,2.661282,43.310009,0.95,housenumber,10 Rue de la Condamine 34210 Siran,34302_0095_00010,G,10 RUE DE LA CONDAMINE,
315009639,00016,31500963900016,O,1979-01-01,NN,,,2019-06-24T13:18:39,false,5,,,,RUE,DE LA POSTE,34210,SIRAN,,,34302,,,,,,,,,,,,,,,,,,,2017-12-31,F,,,,,47.11B,NAFRev2,O,2.661033,43.313532,0.66,street,Rue de la Cité 34210 Siran,34302_0080,G,RUE DE LA CITE,
317731909,00014,31773190900014,O,1980-01-01,NN,,,,true,1,,,,LOT,LA CONDAMINE,34210,SIRAN,,,34302,,,,,,,,,,,,,,,,,,,1999-03-31,F,,,,,45.3A,NAF1993,O,2.661226,43.310134,0.72,street,Rue de la Condamine 34210 Siran,34302_0095,G,RUE DE LA CONDAMINE,
318647591,00011,31864759100011,O,,NN,,,,true,1,,,,RUE,DU COMMERCE,34210,SIRAN,,,34302,,,,,,,,,,,,,,,,,,,1989-04-22,F,,,,,55.72,NAP,N,2.660711,43.313273,0.95,street,Rue du Commerce 34210 Siran,34302_0090,G,RUE DU COMMERCE,
318775616,00010,31877561600010,O,1980-01-01,NN,,,2014-07-08T00:22:30,true,2,,,,RUE,PETIT SOLEIL,34210,SIRAN,,,34302,,,,,,,,,,,,,,,,,,,1995-12-31,F,,,,,,,,2.658597,43.31339,0.78,street,Avenue du Petit Soleil 34210 Siran,34302_0188,G,AVENUE DU PETIT SOLEIL,
318775632,00017,31877563200017,O,1980-01-01,NN,,,2023-07-03T20:14:10,true,5,,,,CHE,AIRES,34210,SIRAN,,,34302,,,,,,,,,,,,,,,,,,,2017-12-25,F,,,,,01.21Z,NAFRev2,N,2.659129,43.314792,0.75,street,Chemin des Aires 34210 Siran,34302_0030,G,CHEMIN DES AIRES,
318775640,00010,31877564000010,O,,,,,,true,1,,,,,,34210,SIRAN,,,34302,,,,,,,,,,,,,,,,,,,1984-12-25,F,,,,,00.10,NAP,N,,,0,,,,,,
318802535,00035,31880253500035,O,1994-08-03,NN,,,2007-02-01T17:26:33,false,3,,,,RUE,DES ECOLES,34210,SIRAN,,,34302,,,,,,,,,,,,,,,,,,,2005-10-02,F,,,,,01.1G,NAFRev1,N,2.661585,43.31418,0.81,street,Avenue des Ecoles 34210 Siran,34302_0110,G,AVENUE DES ECOLES,
319688511,00025,31968851100025,O,1993-12-10,NN,,,2008-01-04T18:05:21,true,3,,,,AV,DU CHATEAU,34210,SIRAN,,,34302,,,,,,,,,,,,,,,,,,,2008-01-01,A,,,,,68.20B,NAFRev2,N,2.662351,43.312858,0.81,street,Avenue du Château 34210 Siran,34302_0060,G,AVENUE DU CHATEAU,
321112310,00016,32111231000016,O,1980-10-01,NN,,,2021-01-25T17:53:38,true,4,5-7-9,,,RUE,DE L ANCIENNE MAIRIE,34210,SIRAN,,,34302,,,,,,,,,,,,,,,,,,,2021-01-01,A,,,,,01.21Z,NAFRev2,N,2.660147,43.313424,0.95,street,Rue de l'Ancienne Mairie 34210 Siran,34302_0150,G,RUE DE L ANCIENNE MAIRIE,
321999989,00023,32199998900023,O,2005-03-01,,,,2013-03-01T04:32:31,true,4,PLACE DE LA MAIRIE,,,PL,DE LA MAIRIE,34210,SIRAN,,,34302,,,,,,,,,,,,,,,,,,,2013-01-01,F,,,,,90.03B,NAFRev2,N,2.660147,43.313424,0.6,street,Rue de l'Ancienne Mairie 34210 Siran,34302_0150,G,RUE DE L ANCIENNE MAIRIE,
323765016,00015,32376501600015,O,1982-01-25,NN,,,2008-11-07T00:40:32,true,4,,,,AV,DU POINT DU JOUR,34210,SIRAN,,,34302,,,,,,,,,,,,,,,,,,,2004-08-31,F,,,,,45.2V,NAFRev1,O,2.661735,43.311032,0.84,street,Avenue du Point du Jour 34210 Siran,34302_0195,G,AVENUE DU POINT DU JOUR,
323987404,00015,32398740400015,O,1982-01-05,NN,,,,false,4,,,,AV,DE LA MAIRIE,34210,SIRAN,,,34302,,,,,,,,,,,,,,,,,,,1998-11-05,F,,,,,74.1A,NAF1993,N,2.660147,43.313424,0.6,street,Rue de l'Ancienne Mairie 34210 Siran,34302_0150,G,RUE DE L ANCIENNE MAIRIE,
324827765,00011,32482776500011,O,1987-12-31,NN,,,2022-12-21T04:00:14,true,3,,,,RUE,NEUVE DES GARRIGUES,34210,SIRAN,,,34302,,,,,,,,,,,,,,,,,,,2008-01-01,A,,,,,01.21Z,NAFRev2,N,2.658706,43.31416,0.95,street,Rue Neuve des Garrigues 34210 Siran,34302_0180,G,RUE NEUVE DES GARRIGUES,
324827765,00029,32482776500029,O,2005-09-01,,,,2008-01-04T19:00:52,false,2,,,,CHE,DES AIRES,34210,SIRAN,,,34302,,,,,,,,,,,,,,,,,,,2007-12-03,F,LES AIRES 34,,,,60.2A,NAFRev1,N,2.659129,43.314792,0.8,street,Chemin des Aires 34210 Siran,34302_0030,G,CHEMIN DES AIRES,
324827765,00037,32482776500037,O,2008-01-15,,,,2014-07-08T00:29:22,false,2,,,,CHE,DES AIRES,34210,SIRAN,,,34302,,,,,,,,,,,,,,,,,,,2009-04-28,F,,,,,49.39B,NAFRev2,N,2.659129,43.314792,0.8,street,Chemin des Aires 34210 Siran,34302_0030,G,CHEMIN DES AIRES,
325552164,00023,32555216400023,O,2012-10-15,NN,,,2017-05-04T03:41:06,true,2,,13,,AV,DU MIDI,34210,SIRAN,,,34302,,,,,,,,,,,,,,,,,,,2016-05-01,F,,,,,01.21Z,NAFRev2,N,2.660876,43.311141,0.81,housenumber,13 Avenue du Midi 34210 Siran,34302_0155_00013,G,13 AVENUE DU MIDI,
326568854,00011,32656885400011,O,1981-01-01,NN,,,2022-11-10T04:02:48,true,3,,,,AV,DU PETIT SOLEIL,34210,SIRAN,,,34302,,,,,,,,,,,,,,,,,,,2008-01-01,A,,,,,01.21Z,NAFRev2,N,2.658597,43.31339,0.85,street,Avenue du Petit Soleil 34210 Siran,34302_0188,G,AVENUE DU PETIT SOLEIL,
326768124,00017,32676812400017,O,1983-01-01,,,,2007-01-18T09:17:35,true,3,,,,,,34210,SIRAN,,,34302,,,,,,,,,,,,,,,,,,,1992-12-25,F,,,,,01.1G,NAF1993,N,,,0,,,,,,
327425054,00019,32742505400019,O,1983-01-01,NN,,,2007-01-18T09:17:51,true,3,,,,,,34210,SIRAN,,,34302,,,,,,,,,,,,,,,,,,,1993-12-25,F,,,,,01.1G,NAF1993,N,,,0,,,,,,
328084967,00038,32808496700038,P,2001-02-27,NN,,,2006-12-15T00:24:06,false,4,[ND],[ND],[ND],[ND],[ND],[ND],SIRAN,,[ND],34302,[ND],[ND],,,[ND],[ND],[ND],[ND],[ND],[ND],,,[ND],,[ND],[ND],,,2002-07-31,F,[ND],[ND],[ND],[ND],74.1J,NAF1993,N,,,0,,,,,,
328901087,00010,32890108700010,O,1984-01-18,NN,,,2010-07-05T08:22:48,true,3,,,,AV,DE LA MAIRIE,34210,SIRAN,,,34302,,,,,,,,,,,,,,,,,,,1998-12-25,F,,,,,01.1G,NAF1993,N,2.660147,43.313424,0.6,street,Rue de l'Ancienne Mairie 34210 Siran,34302_0150,G,RUE DE L ANCIENNE MAIRIE,
328990239,00019,32899023900019,O,,NN,,,,true,1,,,,,,34210,SIRAN,,,34302,,,,,,,,,,,,,,,,,,,,F,,,,,67.05,NAP,N,,,0,,,,,,
329574016,00013,32957401600013,O,1984-01-01,NN,,,2010-06-27T04:29:38,true,5,,,,AV,DU STADE,34210,SIRAN,,,34302,,,,,,,,,,,,,,,,,,,2009-12-31,F,,,,,01.21Z,NAFRev2,N,2.658105,43.315535,0.79,street,Avenue du Stade 34210 Siran,34302_0220,G,AVENUE DU STADE,
329574024,00017,32957402400017,O,1984-01-01,NN,,,2008-06-29T12:08:37,true,5,,,,CHE,AIRES,34210,SIRAN,,,34302,,,,,,,,,,,,,,,,,,,2008-01-01,A,,,,,01.61Z,NAFRev2,N,2.659129,43.314792,0.75,street,Chemin des Aires 34210 Siran,34302_0030,G,CHEMIN DES AIRES,
330765900,00023,33076590000023,O,1995-10-30,NN,,,2015-03-20T08:22:52,true,4,,,,RUE,DE LA MAIRIE,34210,SIRAN,,,34302,,,,,,,,,,,,,,,,,,,2014-07-08,F,,,,,69.10Z,NAFRev2,N,2.660147,43.313424,0.78,street,Rue de l'Ancienne Mairie 34210 Siran,34302_0150,G,RUE DE L ANCIENNE MAIRIE,
331118315,00018,33111831500018,O,1984-08-01,NN,,,2007-05-19T09:36:10,true,4,,,,,MAIRIE DE SIRAN,34210,SIRAN,,,34302,,,,,,,,,,,,,,,,,,,2005-12-31,F,,,,,91.3E,NAFRev1,O,2.660147,43.313424,0.91,street,Rue de l'Ancienne Mairie 34210 Siran,34302_0150,G,RUE DE L ANCIENNE MAIRIE,
331584268,00022,33158426800022,O,1992-01-01,NN,,,2008-01-04T20:14:45,false,3,,,,,,34210,SIRAN,,,34302,,,,,,,,,,,,,,,,,,,2008-01-01,A,,,,,01.21Z,NAFRev2,N,,,0,,,,,,
334190386,00014,33419038600014,O,1985-11-21,,,,,false,3,,,,,,34210,SIRAN,,,34302,,,,,,,,,,,,,,,,,,,2000-02-15,F,,,,,01.4A,NAF1993,N,,,0,,,,,,
334768454,00012,33476845400012,O,1986-01-24,NN,,,2008-01-04T20:54:26,true,3,,,,,,34210,SIRAN,,,34302,,,,,,,,,,,,,,,,,,,2008-01-01,A,,,,,43.12A,NAFRev2,N,,,0,,,,,,
334939071,00042,33493907100042,O,2006-09-01,,,,2019-03-04T08:34:32,true,2,,,,DOM,DE FONTBERTIERE,34210,SIRAN,,,34302,,,,,,,,,,,,,,,,,,,2008-01-01,A,DOMAINE DE FONTBERTIERE,,,,01.21Z,NAFRev2,N,2.668222,43.331236,0.65,locality,Fontbertière 34210 Siran,34302_zs9qwt,G,FONTBERTIERE,
337751739,00034,33775173900034,O,1993-12-01,NN,,,2009-06-27T05:11:47,true,4,,,,RTE,DE CESSERAS,34210,SIRAN,,,34302,,,,,,,,,,,,,,,,,,,2007-12-31,F,,,,,45.2V,NAFRev1,O,2.664584,43.314726,0.83,street,Route de Cesseras 34210 Siran,34302_0062,G,ROUTE DE CESSERAS,
337801450,00012,33780145000012,O,,NN,,,,true,1,,,,AV,DU MIDI,34210,SIRAN,,,34302,,,,,,,,,,,,,,,,,,,1992-02-12,F,,,,,36.1G,NAF1993,N,2.660781,43.311265,0.77,street,Avenue du Midi 34210 Siran,34302_0155,G,AVENUE DU MIDI,
337883623,00015,33788362300015,O,,NN,,,,true,1,,,,,,34210,SIRAN,,,34302,,,,,,,,,,,,,,,,,,,1993-04-26,F,,,,,55.4B,NAF1993,N,,,0,,,,,,
337885099,00016,33788509900016,O,,NN,,,,true,1,,,,AV,DU MIDI,34210,SIRAN,,,34302,,,,,,,,,,,,,,,,,,,1995-10-30,F,,,,,70.2C,NAF1993,N,2.660781,43.311265,0.77,street,Avenue du Midi 34210 Siran,34302_0155,G,AVENUE DU MIDI,
340843663,00014,34084366300014,O,1987-01-01,NN,,,2017-07-11T09:02:06,false,4,CAVE PAUL-LOUIS-EUGENE,,,,,34210,SIRAN,,,34302,,,,,,,,,,,,,,,,,,,2017-06-30,F,,,,,01.21Z,NAFRev2,N,,,0,,,,,,
340843663,00022,34084366300022,O,1996-10-01,NN,,,2017-11-13T16:52:19,true,4,,,,AV,DU MIDI,34210,SIRAN,,,34302,,,,,,,,,,,,,,,,,,,2017-06-30,F,,,,,46.34Z,NAFRev2,N,2.660781,43.311265,0.77,street,Avenue du Midi 34210 Siran,34302_0155,G,AVENUE DU MIDI,
343022372,00019,34302237200019,O,,NN,,,,true,1,,,,,,34210,SIRAN,,,34302,,,,,,,,,,,,,,,,,,,1988-02-15,F,,,,,77.08,NAP,N,,,0,,,,,,
345164628,00025,34516462800025,O,1993-01-01,NN,,,2021-02-23T11:00:03,true,3,,12,,AV,DU STADE,34210,SIRAN,,,34302,,,,,,,,,,,,,,,,,,,2008-01-01,A,,,,,01.21Z,NAFRev2,N,2.657988,43.315509,0.82,housenumber,12 Avenue du Stade 34210 Siran,34302_0220_00012,G,12 AVENUE DU STADE,
347868952,00016,34786895200016,O,1988-01-01,NN,,,2008-01-04T22:45:25,true,3,,,,CHE,DES AIRES,34210,SIRAN,,,34302,,,,,,,,,,,,,,,,,,,2008-01-01,A,,,,,90.02Z,NAFRev2,O,2.659129,43.314792,0.8,street,Chemin des Aires 34210 Siran,34302_0030,G,CHEMIN DES AIRES,
348581240,00028,34858124000028,O,2007-10-01,,,,2008-09-19T04:51:41,true,3,,,,RUE,QUARTIER DU PORTAIL HAUT,34210,SIRAN,,,34302,,,,,,,,,,,,,,,,,,,2008-09-30,F,,,,,47.91A,NAFRev2,N,2.66032,43.314314,0.83,street,Quartier du Portail Haut 34210 Siran,34302_fpobxw,G,QUARTIER DU PORTAIL HAUT,
349125666,00017,34912566600017,O,1989-01-01,NN,,,2008-11-08T00:23:50,true,3,,,,RUE,DES ECOLES,34210,SIRAN,,,34302,,,,,,,,,,,,,,,,,,,2006-12-31,F,,,,,28.5D,NAFRev1,N,2.661585,43.31418,0.81,street,Avenue des Ecoles 34210 Siran,34302_0110,G,AVENUE DES ECOLES,
349177774,00016,34917777400016,O,1988-12-15,NN,,,2016-05-13T04:24:28,true,4,,,,AV,DU MIDI,34210,SIRAN,,,34302,,,,,,,,,,,,,,,,,,,2010-01-01,F,,,,,11.02B,NAFRev2,N,2.660781,43.311265,0.77,street,Avenue du Midi 34210 Siran,34302_0155,G,AVENUE DU MIDI,
350350427,00018,35035042700018,O,1900-01-01,NN,,4399CZ,2017-05-23T13:38:04,true,6,,41,,RUE,DE L HORLOGE,34210,SIRAN,,,34302,,,,,,,,,,,,,,,,,,,2017-05-22,A,,,,,43.99C,NAFRev2,N,2.661099,43.313177,0.82,street,Rue de l'Horloge 34210 Siran,34302_0140,G,RUE DE L HORLOGE,
350489662,00014,35048966200014,O,,,,,,true,1,,,,AV,DU STADE,34210,SIRAN,,,34302,,,,,,,,,,,,,,,,,,,1991-05-29,F,,,,,55.73,NAP,N,2.658105,43.315535,0.79,street,Avenue du Stade 34210 Siran,34302_0220,G,AVENUE DU STADE,
350586186,00016,35058618600016,O,1989-03-01,NN,,1071CB,2017-05-18T10:47:48,false,4,,,,,,34210,SIRAN,,,34302,,,,,,,,,,,,,,,,,,,2017-03-30,F,,,,,10.71C,NAFRev2,N,,,0,,,,,,
353736986,00012,35373698600012,O,1990-02-01,NN,,,2022-02-22T11:33:05,true,3,,2,,RUE,NEUVE DES GARRIGUES,34210,SIRAN,,,34302,,,,,,,,,,,,,,,,,,,2008-01-01,A,,,,,01.21Z,NAFRev2,N,2.658664,43.313796,0.95,housenumber,2 Rue Neuve des Garrigues 34210 Siran,34302_0180_00002,G,2 RUE NEUVE DES GARRIGUES,
356000000,20356,35600000020356,O,2012-01-01,,,,2014-05-26T14:46:34,false,3,,5011,,RUE,DE LA PROMENADE,34210,SIRAN,,,34302,,,,,,,,,,,,,,,,,,,2014-01-10,F,LA POSTE,,,,53.10Z,NAFRev2,N,2.661158,43.312495,0.77,street,Rue de la Promenade 34210 Siran,34302_0213,G,RUE DE LA PROMENADE,
356000919,04033,35600091904033,O,1991-01-01,NN,,,2009-10-17T13:38:32,false,4,,,,,SIRAN,34210,SIRAN,,,34302,,,,,,,,,,,,,,,,,,,2009-03-18,F,BUREAU DE POSTE,,,,53.10Z,NAFRev2,O,2.675079,43.329594,0.93,municipality,Siran,34302,G,SIRAN,
379450661,00028,37945066100028,O,2001-02-27,NN,,,2006-10-28T00:27:51,false,5,CLOSERAIE CROIX MARTELLE,,,,,34210,SIRAN,,,34302,,,,,,,,,,,,,,,,,,,2005-06-24,F,,,,,70.2C,NAFRev1,N,2.681241,43.323785,0.41,locality,La Martelle 34210 Siran,34302_ga7yhj,D,LA MARTELLE,
383530342,00013,38353034200013,O,1991-11-01,NN,,4312AZ,2016-04-26T02:18:05,true,4,,,,RUE,DU PETIT SOLEIL,34210,SIRAN,,,34302,,,,,,,,,,,,,,,,,,,2010-12-31,A,,,,,43.12A,NAFRev2,O,2.658597,43.31339,0.85,street,Avenue du Petit Soleil 34210 Siran,34302_0188,G,AVENUE DU PETIT SOLEIL,
383530342,00021,38353034200021,O,1988-11-01,,,,2017-05-04T02:40:55,false,3,,,,,,34210,SIRAN,,,34302,,,,,,,,,,,,,,,,,,,2008-01-01,A,,,,,01.21Z,NAFRev2,N,,,0,,,,,,
387654460,00014,38765446000014,O,1992-04-01,NN,,,2015-05-14T05:22:20,true,5,,15,,AV,DU MIDI,34210,SIRAN,,,34302,,,,,,,,,,,,,,,,,,,2010-03-07,A,LABOIRE FRERES,,,,43.32A,NAFRev2,O,2.660871,43.311097,0.81,housenumber,15 Avenue du Midi 34210 Siran,34302_0155_00015,G,15 AVENUE DU MIDI,
387654486,00019,38765448600019,O,1992-04-01,NN,,4332AA,2021-02-23T11:13:41,true,4,,15,,AV,DU MIDI,34210,SIRAN,,,34302,,,,,,,,,,,,,,,,,,,2010-03-07,A,LABOIRE FRERES,,,,43.32A,NAFRev2,N,2.660871,43.311097,0.81,housenumber,15 Avenue du Midi 34210 Siran,34302_0155_00015,G,15 AVENUE DU MIDI,
387654502,00013,38765450200013,O,1992-04-01,NN,,4332AA,2023-07-11T15:27:17,true,6,,15,,AV,DU MIDI,34210,SIRAN,,,34302,,,,,,,,,,,,,,,,,,,2014-12-25,F,LABOIRE FRERES,,,,43.32A,NAFRev2,O,2.660871,43.311097,0.81,housenumber,15 Avenue du Midi 34210 Siran,34302_0155_00015,G,15 AVENUE DU MIDI,
387974587,00033,38797458700033,O,,NN,,,,true,1,,2,,LOT,DU STADE,34210,SIRAN,,,34302,,,,,,,,,,,,,,,,,,,1995-08-30,F,,,,,52.6D,NAF1993,N,2.661943,43.315249,0.63,housenumber,2 Avenue du Stade 34210 Siran,34302_0220_00002,G,2 AVENUE DU STADE,
389382672,00019,38938267200019,O,1987-05-01,NN,,,,true,4,,,,,DOMAINE DE FONTBERTIERE,34210,SIRAN,,,34302,,,,,,,,,,,,,,,,,,,2002-08-31,F,,,,,15.9G,NAF1993,N,2.668222,43.331236,0.57,locality,Fontbertière 34210 Siran,34302_zs9qwt,G,FONTBERTIERE,
389729732,00013,38972973200013,O,1992-12-24,01,2020,,2022-08-29T09:14:18,true,5,,,,,CLOS DES CENTEILLES,34210,SIRAN,,,34302,,,,,,,,,,,,,,,,,,,2021-04-30,F,,,,,01.21Z,NAFRev2,O,2.653107,43.329177,0.59,locality,Centeilles 34210 Siran,34302_m7msie,G,CENTEILLES,
390809853,00026,39080985300026,O,1995-12-31,NN,,,2008-01-04T23:44:53,true,3,PRESBYTERE,,,AV,DU MINERVOIS,34210,SIRAN,,,34302,,,,,,,,,,,,,,,,,,,2008-01-01,A,,,,,94.91Z,NAFRev2,N,2.66003,43.310743,0.83,street,Avenue du Minervois 34210 Siran,34302_0157,G,AVENUE DU MINERVOIS,
391241593,00014,39124159300014,O,1993-04-26,NN,,,2008-01-04T23:50:28,true,3,,,,,,34210,SIRAN,,,34302,,,,,,,,,,,,,,,,,,,2008-01-01,A,,,,,68.20B,NAFRev2,N,,,0,,,,,,
391439445,00019,39143944500019,O,1992-01-01,NN,,,2012-07-28T13:31:11,true,4,,,,,,34210,SIRAN,,,34302,,,,,,,,,,,,,,,,,,,2008-01-01,F,,,,,01.21Z,NAFRev2,N,,,0,,,,,,
391453214,00010,39145321400010,O,1993-05-15,NN,,,2017-01-18T10:37:57,false,3,,,,AV,DU MIOLI,34210,SIRAN,,,34302,,,,,,,,,,,,,,,,,,,2002-11-01,F,,,,,01.1G,NAF1993,N,2.66003,43.310743,0.49,street,Avenue du Minervois 34210 Siran,34302_0157,G,AVENUE DU MINERVOIS,
391453214,00028,39145321400028,O,2002-11-01,,,,2019-02-20T12:30:02,true,2,,6,,AV,DU CHATEAU D'EAU,34210,SIRAN,,,34302,,,,,,,,,,,,,,,,,,,2018-03-31,F,,,,,01.21Z,NAFRev2,N,2.664007,43.31715,0.85,housenumber,6 Avenue du Château d’Eau 34210 Siran,34302_0061_00006,G,6 AVENUE DU CHATEAU D EAU,
391453214,00036,39145321400036,O,2015-12-11,,,,2019-02-20T12:30:02,false,2,,6,,AV,DU CHATEAU D'EAU,34210,SIRAN,,,34302,,,,,,,,,,,,,,,,,,,2018-03-31,F,,,,,68.20B,NAFRev2,N,2.664007,43.31715,0.85,housenumber,6 Avenue du Château d’Eau 34210 Siran,34302_0061_00006,G,6 AVENUE DU CHATEAU D EAU,
391469350,00048,39146935000048,O,2008-02-15,,,,2019-02-07T08:38:25,false,2,,4,,RUE,NEUVE DES GARRIGUES,34210,SIRAN,,,34302,,,,,,,,,,,,,,,,,,,2019-02-04,F,,,,,90.01Z,NAFRev2,N,2.658716,43.313948,0.95,housenumber,4 Rue Neuve des Garrigues 34210 Siran,34302_0180_00004,G,4 RUE NEUVE DES GARRIGUES,
391507027,00012,39150702700012,P,1993-06-15,,,,2022-10-14T17:37:11,false,5,[ND],[ND],[ND],[ND],[ND],[ND],SIRAN,,[ND],34302,[ND],[ND],,,[ND],[ND],[ND],[ND],[ND],[ND],,,[ND],,[ND],[ND],,,2008-01-01,F,[ND],[ND],[ND],[ND],96.02A,NAFRev2,N,,,0,,,,,,
393649686,01364,39364968601364,O,1993-12-13,NN,,,2016-05-18T09:47:37,false,4,,,,RUE,DE LA MAIRIE,34210,SIRAN,,,34302,,,,,,,,,,,,,,,,,,,2008-01-01,F,,,,,64.19Z,NAFRev2,N,2.660147,43.313424,0.78,street,Rue de l'Ancienne Mairie 34210 Siran,34302_0150,G,RUE DE L ANCIENNE MAIRIE,
393957048,00035,39395704800035,O,2002-09-19,NN,,,2006-11-25T12:20:56,false,3,,,,CHE,DES AIRES,34210,SIRAN,,,34302,,,,,,,,,,,,,,,,,,,2003-12-31,F,,,,,51.3J,NAFRev1,N,2.659129,43.314792,0.8,street,Chemin des Aires 34210 Siran,34302_0030,G,CHEMIN DES AIRES,
394225304,00010,39422530400010,O,1994-03-01,NN,,,2014-02-25T03:56:07,true,3,,,,AV,DE LA MAIRIE,34210,SIRAN,,,34302,,,,,,,,,,,,,,,,,,,2008-01-01,A,,,,,01.21Z,NAFRev2,N,2.660147,43.313424,0.6,street,Rue de l'Ancienne Mairie 34210 Siran,34302_0150,G,RUE DE L ANCIENNE MAIRIE,
394262133,00017,39426213300017,O,1994-03-07,NN,,,2006-10-28T02:08:05,true,3,,,,AV,DU CAUSSE,34210,SIRAN,,,34302,,,,,,,,,,,,,,,,,,,2004-02-01,F,,,,,01.1G,NAFRev1,N,2.663041,43.314484,0.8,street,Avenue du Causse 34210 Siran,34302_0057,G,AVENUE DU CAUSSE,
394604433,00018,39460443300018,O,1994-03-15,NN,,,2016-07-01T13:02:43,false,4,,,,,LES COMBELLES,34210,SIRAN,,,34302,,,,,,,,,,,,,,,,,,,2015-04-02,F,,,,,01.21Z,NAFRev2,N,2.658721,43.32462,0.94,locality,Les Combelles 34210 Siran,34302_jwt29r,G,LES COMBELLES,
394604433,00026,39460443300026,O,2006-02-01,,,,2011-10-19T11:04:01,false,3,LES COMBELLES,,,,,34210,SIRAN,,,34302,,,,,,,,,,,,,,,,,,,2010-12-31,F,,,,,01.61Z,NAFRev2,N,2.658721,43.32462,0.94,locality,Les Combelles 34210 Siran,34302_jwt29r,D,LES COMBELLES,
394604433,00042,39460443300042,O,2023-01-01,,,,2023-02-04T13:22:00,true,1,,7,,AV,DU PETIT SOLEIL,34210,SIRAN,,,34302,,,,,,,,,,,,,,,,,,,2023-01-01,A,,,,,01.21Z,NAFRev2,N,2.658762,43.313283,0.86,housenumber,7 Avenue du Petit Soleil 34210 Siran,34302_0188_00007,G,7 AVENUE DU PETIT SOLEIL,