siren,nic,siret,statutDiffusionEtablissement,dateCreationEtablissement,trancheEffectifsEtablissement,anneeEffectifsEtablissement,activitePrincipaleRegistreMetiersEtablissement,dateDernierTraitementEtablissement,etablissementSiege,nombrePeriodesEtablissement,complementAdresseEtablissement,numeroVoieEtablissement,indiceRepetitionEtablissement,typeVoieEtablissement,libelleVoieEtablissement,codePostalEtablissement,libelleCommuneEtablissement,libelleCommuneEtrangerEtablissement,distributionSpecialeEtablissement,codeCommuneEtablissement,codeCedexEtablissement,libelleCedexEtablissement,codePaysEtrangerEtablissement,libellePaysEtrangerEtablissement,complementAdresse2Etablissement,numeroVoie2Etablissement,indiceRepetition2Etablissement,typeVoie2Etablissement,libelleVoie2Etablissement,codePostal2Etablissement,libelleCommune2Etablissement,libelleCommuneEtranger2Etablissement,distributionSpeciale2Etablissement,codeCommune2Etablissement,codeCedex2Etablissement,libelleCedex2Etablissement,codePaysEtranger2Etablissement,libellePaysEtranger2Etablissement,dateDebut,etatAdministratifEtablissement,enseigne1Etablissement,enseigne2Etablissement,enseigne3Etablissement,denominationUsuelleEtablissement,activitePrincipaleEtablissement,nomenclatureActivitePrincipaleEtablissement,caractereEmployeurEtablissement,longitude,latitude,geo_score,geo_type,geo_adresse,geo_id,geo_ligne,geo_l4,geo_l5
005876768,00028,00587676800028,O,,NN,,,,true,1,,,,PL,DU GENERAL CHARRETTE,44650,LEGE,,,44081,,,,,,,,,,,,,,,,,,,1988-06-17,F,,,,,81.21,NAP,N,-1.598404,46.885387,0.64,street,Pl du Gal Charette de la Contrie 44650 Legé,44081_u9y1tg,G,PL DU GAL CHARETTE DE LA CONTRIE,
064200793,01655,06420079301655,O,1988-04-22,NN,,,,false,3,,3,,RUE,DES VISITANDINES,44650,LEGE,,,44081,,,,,,,,,,,,,,,,,,,1995-03-11,F,SUPER DISCOUNT,,,,52.4E,NAF1993,N,-1.599179,46.888314,0.52,housenumber,3 Rue des Frenes 44650 Legé,44081_0473_00003,G,3 RUE DES FRENES,
174402115,00342,17440211500342,O,1983-03-16,,,,2012-07-27T15:17:43,false,4,,10,,RUE,DE LA CHAUSSEE,44650,LEGE,,,44081,,,,,,,,,,,,,,,,,,,2010-11-01,F,TRESORERIE DE LEGE,,,,84.11Z,NAFRev2,N,-1.595937,46.885173,0.96,housenumber,10 Rue de la Chaussée 44650 Legé,44081_0280_00010,G,10 RUE DE LA CHAUSSEE,
194416129,00014,19441612900014,O,1983-03-01,12,2020,,2022-08-29T09:04:28,true,4,,1,,RUE,PIERRE DE COUBERTIN,44650,LEGE,,,44081,,,,,,,,,,,,,,,,,,,2016-12-25,A,,,,,85.31Z,NAFRev2,O,-1.593386,46.886595,0.95,housenumber,1 Rue Pierre de Coubertin 44650 Legé,44081_0830_00001,G,1 RUE PIERRE DE COUBERTIN,
214400814,00015,21440081400015,O,1983-03-01,21,2020,,2022-08-29T09:07:17,true,4,,11,,RUE,DE LA CHAUSSEE,44650,LEGE,,,44081,,,,,,,,,,,,,,,,,,,2008-01-01,A,MAIRIE,,,,84.11Z,NAFRev2,O,-1.596055,46.885181,0.96,housenumber,11 Rue de la Chaussée 44650 Legé,44081_0280_00011,G,11 RUE DE LA CHAUSSEE,
214400814,00031,21440081400031,O,1983-12-21,11,2020,,2022-08-29T09:07:17,false,4,,,,RUE,BEAUSEJOUR,44650,LEGE,,,44081,,,,,,,,,,,,,,,,,,,2010-11-23,A,ECOLE ELEMENTAIRE PUBLIQUE LE CHAMBORD,,,,85.20Z,NAFRev2,N,-1.590108,46.885986,0.95,street,Rue Beausejour 44650 Legé,44081_0034,G,RUE BEAUSEJOUR,
214400814,00049,21440081400049,O,1983-12-21,02,2020,,2022-08-29T09:07:17,false,3,,,,RUE,BEAUSEJOUR,44650,LEGE,,,44081,,,,,,,,,,,,,,,,,,,2008-01-01,A,ECOLE MATERNELLE PUBLIQUE LE CHAMBORD,,,,85.10Z,NAFRev2,N,-1.590108,46.885986,0.95,street,Rue Beausejour 44650 Legé,44081_0034,G,RUE BEAUSEJOUR,
214400814,00064,21440081400064,O,1996-12-01,NN,,,2013-07-20T12:01:48,false,4,MAIRIE,11,,RUE,DE LA CHAUSSEE,44650,LEGE,,,44081,,,,,,,,,,,,,,,,,,,2008-01-01,F,LOTISSEMENT LES SAULES 2,,,,42.99Z,NAFRev2,N,-1.596055,46.885181,0.96,housenumber,11 Rue de la Chaussée 44650 Legé,44081_0280_00011,G,11 RUE DE LA CHAUSSEE,
214400814,00072,21440081400072,O,1995-12-25,NN,,,2011-04-23T04:14:23,false,2,MAIRIE,11,,RUE,DE LA CHAUSSEE,44650,LEGE,,,44081,,,,,,,,,,,,,,,,,,,2008-01-01,A,SCE ASSAINISSEMENT DE LEGE,,,,37.00Z,NAFRev2,N,-1.596055,46.885181,0.96,housenumber,11 Rue de la Chaussée 44650 Legé,44081_0280_00011,G,11 RUE DE LA CHAUSSEE,
214400814,00080,21440081400080,O,2001-12-25,NN,,,2013-07-20T12:01:47,false,3,MAIRIE,11,,RUE,DE LA CHAUSSEE,44650,LEGE,,,44081,,,,,,,,,,,,,,,,,,,2008-01-01,F,LOTISSEMENT LES SPORTS 2,,,,42.99Z,NAFRev2,N,-1.596055,46.885181,0.96,housenumber,11 Rue de la Chaussée 44650 Legé,44081_0280_00011,G,11 RUE DE LA CHAUSSEE,
214400814,00098,21440081400098,O,2006-01-01,NN,,,2021-10-27T08:08:27,false,2,,8,,RUE,JULES FERRY,44650,LEGE,,,44081,,,,,,,,,,,,,,,,,,,2008-01-01,A,HALTE GARDERIE LA RECRE,,,,88.91A,NAFRev2,N,-1.595888,46.88507,0.86,street,Rue Jules Ferry 44650 Legé,44081_0622,G,RUE JULES FERRY,
214400814,00106,21440081400106,O,2012-06-13,,,,2023-06-27T15:08:18,false,1,,11,,RUE,DE LA CHAUSSEE,44650,LEGE,,,44081,,,,,,,,,,,,,,,,,,,2012-06-13,A,ZAC DE LA BASSE PARNIERE,,,,42.99Z,NAFRev2,N,-1.596055,46.885181,0.96,housenumber,11 Rue de la Chaussée 44650 Legé,44081_0280_00011,G,11 RUE DE LA CHAUSSEE,
214400814,00130,21440081400130,O,2022-12-13,,,,2023-04-01T13:34:06,false,1,MAIRIE,11,,RUE,DE LA CHAUSSEE,44650,LEGE,,,44081,,,,,,,,,,,,,,,,,,,2022-12-13,A,AS NEVES,,,,42.99Z,NAFRev2,N,-1.596055,46.885181,0.96,housenumber,11 Rue de la Chaussée 44650 Legé,44081_0280_00011,G,11 RUE DE LA CHAUSSEE,
224400028,02108,22440002802108,O,1987-12-16,NN,,,,false,4,MAIRIE,11,,RUE,DE LA CHAUSSEE,44650,LEGE,,,44081,,,,,,,,,,,,,,,,,,,1999-03-25,F,CTRE MEDICO SOCIAL DEPART,,,,85.3K,NAF1993,N,-1.596055,46.885181,0.96,housenumber,11 Rue de la Chaussée 44650 Legé,44081_0280_00011,G,11 RUE DE LA CHAUSSEE,
244400032,00011,24440003200011,O,,,,,,true,1,,11,,RUE,DE LA CHAUSSEE,44650,LEGE,,,44081,,,,,,,,,,,,,,,,,,,1995-01-01,F,,,,,75.1A,NAF1993,N,-1.596055,46.885181,0.96,housenumber,11 Rue de la Chaussée 44650 Legé,44081_0280_00011,G,11 RUE DE LA CHAUSSEE,
244400529,00016,24440052900016,O,1995-01-01,NN,,,2007-05-19T08:22:21,false,4,MAIRIE   PORTE A,11,,RUE,DE LA CHAUSSEE,44650,LEGE,,,44081,,,,,,,,,,,,,,,,,,,2006-08-04,F,,,,,75.1A,NAFRev1,O,-1.596055,46.885181,0.96,housenumber,11 Rue de la Chaussée 44650 Legé,44081_0280_00011,G,11 RUE DE LA CHAUSSEE,
244400529,00024,24440052900024,O,1999-10-07,NN,,,2017-01-30T10:23:00,false,4,,,,,ZI SAINTE MARIE,44650,LEGE,,,44081,,,,,,,,,,,,,,,,,,,2017-01-01,F,COLLECTE ORDURES MENAGERES,,,,38.11Z,NAFRev2,N,-0.6172027,43.1932066,0.73,poi.industrial,Lindt (Zone industrielle) Oloron-Sainte-Marie,https://osm.org/way/50415737,G,,
244400529,00099,24440052900099,O,2006-08-04,NN,,,2019-06-24T13:13:12,true,3,,,,,ZI SAINTE MARIE,44650,LEGE,,,44081,,,,,,,,,,,,,,,,,,,2017-01-01,F,,,,,84.11Z,NAFRev2,O,-0.6172027,43.1932066,0.73,poi.industrial,Lindt (Zone industrielle) Oloron-Sainte-Marie,https://osm.org/way/50415737,G,,
254400260,00017,25440026000017,O,1983-03-01,NN,,,,true,1,,11,,RUE,DE LA CHAUSSEE,44650,LEGE,,,44081,,,,,,,,,,,,,,,,,,,2000-12-30,F,,,,,41.0Z,NAF1993,N,-1.596055,46.885181,0.96,housenumber,11 Rue de la Chaussée 44650 Legé,44081_0280_00011,G,11 RUE DE LA CHAUSSEE,
254400278,00019,25440027800019,O,1983-03-01,NN,,,2010-04-18T03:16:45,true,4,MAIRIE,11,,RUE,DE LA CHAUSSEE,44650,LEGE,,,44081,,,,,,,,,,,,,,,,,,,2008-05-31,F,,,,,84.13Z,NAFRev2,N,-1.596055,46.885181,0.96,housenumber,11 Rue de la Chaussée 44650 Legé,44081_0280_00011,G,11 RUE DE LA CHAUSSEE,
264400128,00189,26440012800189,O,1992-12-25,NN,,,,false,2,MAIRIE,11,,RUE,DE LA CHAUSSEE,44650,LEGE,,,44081,,,,,,,,,,,,,,,,,,,1994-06-15,F,CTRE MEDICO PSYCHOLOGIQUE ADULTES,,,,85.1C,NAF1993,N,-1.596055,46.885181,0.96,housenumber,11 Rue de la Chaussée 44650 Legé,44081_0280_00011,G,11 RUE DE LA CHAUSSEE,
264402116,00018,26440211600018,O,1983-03-01,NN,,,2010-06-26T03:10:03,true,4,MAIRIE,11,,RUE,DE LA CHAUSSEE,44650,LEGE,,,44081,,,,,,,,,,,,,,,,,,,2008-01-01,A,,,,,88.99B,NAFRev2,N,-1.596055,46.885181,0.96,housenumber,11 Rue de la Chaussée 44650 Legé,44081_0280_00011,G,11 RUE DE LA CHAUSSEE,
294400163,00019,29440016300019,O,1983-08-10,NN,,,2008-01-04T19:06:45,true,3,MAIRIE,11,,RUE,DE LA CHAUSSEE,44650,LEGE,,,44081,,,,,,,,,,,,,,,,,,,2008-01-01,A,,,,,42.99Z,NAFRev2,N,-1.596055,46.885181,0.96,housenumber,11 Rue de la Chaussée 44650 Legé,44081_0280_00011,G,11 RUE DE LA CHAUSSEE,
300389475,00017,30038947500017,O,,,,,,true,1,,,,LD,L'HILAIRIERE,44650,LEGE,,,44081,,,,,,,,,,,,,,,,,,,1984-12-25,F,,,,,87.09,NAP,N,-1.571799,46.885411,0.95,street,l'Hilairière 44650 Legé,44081_kgpl0c,G,L HILAIRIERE,
300389541,00016,30038954100016,O,1973-01-01,NN,,,2008-11-07T00:16:42,true,3,,,,LD,DRONNIERES,44650,LEGE,,,44081,,,,,,,,,,,,,,,,,,,2007-06-30,F,,,,,45.1A,NAFRev1,N,-1.621706,46.902721,0.93,street,les Petites Dronnieres 44650 Legé,44081_C760,G,LES PETITES DRONNIERES,
300587607,00023,30058760700023,O,2002-04-04,NN,,,2012-12-30T04:37:06,true,6,,1,,RUE,DE LA CHAPELLE,44650,LEGE,,,44081,,,,,,,,,,,,,,,,,,,2012-12-31,F,,,,,47.79Z,NAFRev2,N,-1.597391,46.884834,0.96,housenumber,1 Rue de la Chapelle 44650 Legé,44081_0240_00001,G,1 RUE DE LA CHAPELLE,
300857448,00017,30085744800017,O,,NN,,,,true,1,,,,,PLAISANCE,44650,LEGE,,,44081,,,,,,,,,,,,,,,,,,,2001-10-01,F,,,,,70.1A,NAF1993,N,-1.587158,46.882219,0.95,street,Plaisance 44650 Legé,44081_ibgu2q,G,PLAISANCE,
300906492,00016,30090649200016,O,,NN,,,,true,1,,,,,LOTISSEMENT,44650,LEGE,,,44081,,,,,,,,,,,,,,,,,,,1987-12-25,F,,,,,00.10,NAP,N,-1.599371,46.893286,0.48,street,Impasse Clément Ader 44650 Legé,44081_0329,G,IMPASSE CLEMENT ADER,
301176871,00012,30117687100012,O,,,,,,true,1,,27,,RUE,DE L'ATLANTIQUE,44650,LEGE,,,44081,,,,,,,,,,,,,,,,,,,,F,,,,,64.11,NAP,N,-1.600376,46.884748,0.96,housenumber,27 Rue de l'Atlantique 44650 Legé,44081_0017_00027,G,27 RUE DE L ATLANTIQUE,
301283792,00010,30128379200010,O,1995-04-01,NN,,,2008-11-07T00:17:20,true,3,,22,,RUE,DU PUITS NEUF,44650,LEGE,,,44081,,,,,,,,,,,,,,,,,,,2004-04-13,F,,,,,45.3E,NAFRev1,N,-1.593693,46.882355,0.96,housenumber,22 Rue du Puits Neuf 44650 Legé,44081_0920_00022,G,22 RUE DU PUITS NEUF,
301537163,00018,30153716300018,O,,NN,,,,true,1,,,,RTE,DE CHALLANS,44650,LEGE,,,44081,,,,,,,,,,,,,,,,,,,,F,,,,,21.01,NAP,N,-1.598404,46.885387,0.44,street,Pl du Gal Charette de la Contrie 44650 Legé,44081_u9y1tg,G,PL DU GAL CHARETTE DE LA CONTRIE,
301766531,00026,30176653100026,O,1979-08-01,,,,2007-03-28T15:07:22,true,4,,,,RTE,DE ROCHESERVIERE,44650,LEGE,,,44081,,,,,,,,,,,,,,,,,,,2006-11-21,F,,,,,74.1A,NAFRev1,N,-1.592435,46.887206,0.31,street,Rue Pierre de Coubertin 44650 Legé,44081_0830,G,RUE PIERRE DE COUBERTIN,
301766531,00034,30176653100034,O,1986-09-17,NN,,,2008-04-26T08:36:14,false,4,,1,,PL,JULES VERNE,44650,LEGE,,,44081,,,,,,,,,,,,,,,,,,,2006-11-21,F,,,,,74.1A,NAFRev1,N,-1.592219,46.887611,0.84,housenumber,1 Place Jules Verne 44650 Legé,44081_0625_00001,G,1 PLACE JULES VERNE,
301905329,00027,30190532900027,O,1900-01-01,NN,,,2008-11-07T00:17:56,true,3,,,,PL,DU CHAMP DE FOIRE,44650,LEGE,,,44081,,,,,,,,,,,,,,,,,,,2005-12-31,F,,,,,52.4W,NAFRev1,N,-1.597505,46.885974,0.87,street,Place du Champ de Foire 44650 Legé,44081_0180,G,PLACE DU CHAMP DE FOIRE,
302322516,00022,30232251600022,O,,NN,,,,true,1,,,,,LA GROSSE ROCHE,44650,LEGE,,,44081,,,,,,,,,,,,,,,,,,,,F,,,,,55.60,NAP,N,-1.569369,46.90174,0.95,street,la Grosse Roche 44650 Legé,44081_C054,G,LA GROSSE ROCHE,
302561485,00012,30256148500012,O,,NN,,,,true,1,,,,CHE,DU MILIEU,44650,LEGE,,,44081,,,,,,,,,,,,,,,,,,,1993-12-31,F,,,,,51.2E,NAF1993,N,-1.544755,46.923384,0.42,street,l'Ouche du Four 44650 Legé,44081_C512,G,L OUCHE DU FOUR,
302695218,00024,30269521800024,O,1988-11-01,NN,,,2006-10-26T23:58:16,false,3,RTE DES SABLES,,,RUE,LOUIS COUVREUR,44650,LEGE,,,44081,,,,,,,,,,,,,,,,,,,2004-10-01,F,,,,,63.1E,NAFRev1,N,-1.596378,46.883888,0.95,street,Rue Louis Couvreur 44650 Legé,44081_0130,G,RUE LOUIS COUVREUR,
302695218,00040,30269521800040,O,2004-10-01,NN,,,2018-09-29T12:10:10,false,5,ZIA DU ROUSSIGNON,,,RUE,DU BOIS FLEURI,44650,LEGE,,,44081,,,,,,,,,,,,,,,,,,,2016-12-31,F,P.P.R.V.,,,,43.34Z,NAFRev2,N,-1.602526,46.892361,0.95,street,Rue du Bois Fleuri 44650 Legé,44081_0061,G,RUE DU BOIS FLEURI,
302853908,00010,30285390800010,O,,,,,,true,1,,,,RUE,DES SABLES,44650,LEGE,,,44081,,,,,,,,,,,,,,,,,,,1987-04-16,F,,,,,67.08,NAP,N,-1.597582,46.883464,0.96,street,Rue des Sables 44650 Legé,44081_1040,G,RUE DES SABLES,
302853916,00013,30285391600013,O,,,,,,true,1,,,,RUE,LA CHAPELLE,44650,LEGE,,,44081,,,,,,,,,,,,,,,,,,,1987-12-25,F,,,,,67.07,NAP,N,-1.597631,46.884994,0.95,street,Rue de la Chapelle 44650 Legé,44081_0240,G,RUE DE LA CHAPELLE,
302853924,00017,30285392400017,O,,,,,,true,1,,,,,,44650,LEGE,,,44081,,,,,,,,,,,,,,,,,,,1985-12-25,F,,,,,79.01,NAP,N,,,0,,,,,,
303634638,00033,30363463800033,O,2002-01-15,NN,,,2006-11-25T09:16:18,true,3,,13,,RUE,HECTOR BERLIOZ,44650,LEGE,,,44081,,,,,,,,,,,,,,,,,,,2003-12-31,F,,,,,52.6E,NAFRev1,N,-1.599736,46.883295,0.96,housenumber,13 Rue Hector Berlioz 44650 Legé,44081_0590_00013,G,13 RUE HECTOR BERLIOZ,
304234016,00018,30423401600018,O,1900-01-01,NN,,,,false,3,,1,,BD,DE LA CROIX BLANCHE,44650,LEGE,,,44081,,,,,,,,,,,,,,,,,,,2003-12-09,F,,,,,15.1A,NAFRev1,N,-1.603229,46.886824,0.88,housenumber,1 Boulevard de la Croix Blanche 44650 Legé,44081_0372_00001,G,1 BOULEVARD DE LA CROIX BLANCHE,
304234016,00083,30423401600083,O,1987-12-31,NN,,,2008-01-04T19:29:07,false,3,,,,,LA CROIX BLANCHE,44650,LEGE,,,44081,,,,,,,,,,,,,,,,,,,2008-01-01,A,,,,,01.41Z,NAFRev2,N,-1.60208,46.886988,0.94,street,Boulevard de la Croix Blanche 44650 Legé,44081_0372,G,BOULEVARD DE LA CROIX BLANCHE,
304417124,00019,30441712400019,O,,,,,,true,1,,,,RTE,DE CHALLANS,44650,LEGE,,,44081,,,,,,,,,,,,,,,,,,,1987-03-18,F,,,,,67.01,NAP,N,-1.598404,46.885387,0.44,street,Pl du Gal Charette de la Contrie 44650 Legé,44081_u9y1tg,G,PL DU GAL CHARETTE DE LA CONTRIE,
304611189,00016,30461118900016,O,,NN,,,,true,1,,7,,RUE,DE LA CHAUSSEE,44650,LEGE,,,44081,,,,,,,,,,,,,,,,,,,,F,,,,,81.21,NAP,N,-1.596385,46.884931,0.96,housenumber,7 Rue de la Chaussée 44650 Legé,44081_0280_00007,G,7 RUE DE LA CHAUSSEE,
304970841,00041,30497084100041,O,2001-09-01,NN,,,,false,4,,,,,ZA DU ROUSSIGNON,44650,LEGE,,,44081,,,,,,,,,,,,,,,,,,,2003-12-25,F,,,,,20.3Z,NAFRev1,N,2.8857843,49.5696367,0.74,poi.track,Chemin du Roussignon Thiescourt,https://osm.org/way/161067485,G,,
305074205,00025,30507420500025,O,,,,,,true,1,,7,,PL,DU GENERAL CHARRETTE,44650,LEGE,,,44081,,,,,,,,,,,,,,,,,,,1998-05-31,F,,,,,93.0H,NAF1993,N,-1.598703,46.885535,0.66,housenumber,7 Pl du Gal Charette de la Contrie 44650 Legé,44081_u9y1tg_00007,G,7 PL GAL CHARETTE DE LA CONTRIE,
305188419,00041,30518841900041,O,1992-09-30,NN,,,,false,3,,,,RUE,DE LA COLONNE LA BLINIERE,44650,LEGE,,,44081,,,,,,,,,,,,,,,,,,,2003-09-29,F,,,,,15.7A,NAFRev1,,-1.593974,46.889126,0.69,street,Rue de la Colonne 44650 Legé,44081_0360,G,RUE DE LA COLONNE,
305188419,00066,30518841900066,O,1992-09-30,NN,,,,false,4,,1,,BD,DE LA GARE,44650,LEGE,,,44081,,,,,,,,,,,,,,,,,,,2003-09-29,F,,,,,51.3J,NAFRev1,N,-1.603738,46.884265,0.84,housenumber,1 Boulevard de la Gare 44650 Legé,44081_0480_00001,G,1 BOULEVARD DE LA GARE,
305380610,00025,30538061000025,O,2001-07-01,NN,,,2008-04-26T08:43:30,false,3,LA FUYE,,,RTE,DES SABLES,44650,LEGE,,,44081,,,,,,,,,,,,,,,,,,,2006-12-31,F,,,,,50.2Z,NAFRev1,O,-1.597582,46.883464,0.76,street,Rue des Sables 44650 Legé,44081_1040,G,RUE DES SABLES,
305966301,00015,30596630100015,O,1964-01-01,NN,,,2013-02-02T12:22:51,true,5,,,,,LE MOULIN GUERIN,44650,LEGE,,,44081,,,,,,,,,,,,,,,,,,,2008-01-01,F,,,,,68.20B,NAFRev2,N,-1.60076,46.921668,0.96,street,le Moulin Guerin 44650 Legé,44081_C390,G,LE MOULIN GUERIN,
305966301,00023,30596630100023,O,1985-01-01,,,,2013-02-02T12:22:51,false,4,,,,,LA CROIX VERTE,44650,LEGE,,,44081,,,,,,,,,,,,,,,,,,,2012-12-25,F,,,,,01.11Z,NAFRev2,N,-1.602864,46.938477,0.95,street,la Croix Verte 44650 Legé,44081_B508,G,LA CROIX VERTE,
306076753,00020,30607675300020,O,1976-05-01,NN,,,2021-02-09T09:45:05,true,4,,5,,LD,LA GAILLARDIERE,44650,LEGE,,,44081,,,,,,,,,,,,,,,,,,,2020-12-31,F,,,,,46.11Z,NAFRev2,N,-1.572967,46.906777,0.96,housenumber,5 la Gaillardiere 44650 Legé,44081_bj7cmg_00005,G,5 LA GAILLARDIERE,
306917436,00033,30691743600033,O,1984-07-03,NN,,,,true,1,,3,,RUE,DES VISITANDINES,44650,LEGE,,,44081,,,,,,,,,,,,,,,,,,,1998-07-06,F,,,,,70.2C,NAF1993,N,-1.599179,46.888314,0.52,housenumber,3 Rue des Frenes 44650 Legé,44081_0473_00003,G,3 RUE DES FRENES,
307327270,00020,30732727000020,O,1900-01-01,NN,,,2018-03-07T08:34:10,true,4,,,,,ZI SAINTE MARIE,44650,LEGE,,,44081,,,,,,,,,,,,,,,,,,,2017-12-08,F,,,,,68.20B,NAFRev2,N,-0.6172027,43.1932066,0.73,poi.industrial,Lindt (Zone industrielle) Oloron-Sainte-Marie,https://osm.org/way/50415737,G,,
308530344,00024,30853034400024,O,1983-01-01,02,2020,,2022-08-29T09:12:52,true,4,,3,,RUE,STE ANNE,44650,LEGE,,,44081,,,,,,,,,,,,,,,,,,,2008-01-01,A,,,,,85.31Z,NAFRev2,O,-1.60041,46.885469,0.83,housenumber,3 Rue Sainte Anne 44650 Legé,44081_1088_00003,G,3 RUE SAINTE ANNE,
308530344,00032,30853034400032,O,1987-05-19,11,2020,,2022-08-29T09:12:52,false,4,,7,,RUE,DU PUITS NEUF,44650,LEGE,,,44081,,,,,,,,,,,,,,,,,,,2008-01-01,A,ECOLE NOTRE DAME DDEC,,,,85.20Z,NAFRev2,O,-1.595124,46.883357,0.96,housenumber,7 Rue du Puits Neuf 44650 Legé,44081_0920_00007,G,7 RUE DU PUITS NEUF,
308530344,00040,30853034400040,O,1987-05-19,12,2020,,2022-08-29T09:12:52,false,4,,3,,RUE,SAINTE ANNE,44650,LEGE,,,44081,,,,,,,,,,,,,,,,,,,2008-01-01,A,COLLEGE PRIVE SAINTE ANNE,,,,85.31Z,NAFRev2,O,-1.60041,46.885469,0.96,housenumber,3 Rue Sainte Anne 44650 Legé,44081_1088_00003,G,3 RUE SAINTE ANNE,
308530344,00057,30853034400057,O,1987-05-19,01,2020,,2022-08-29T09:12:52,false,4,,3,,RUE,SAINTE ANNE,44650,LEGE,,,44081,,,,,,,,,,,,,,,,,,,2008-01-01,A,CANTINE SCOLAIRE,,,,56.29B,NAFRev2,O,-1.60041,46.885469,0.96,housenumber,3 Rue Sainte Anne 44650 Legé,44081_1088_00003,G,3 RUE SAINTE ANNE,
308530344,00065,30853034400065,O,1993-10-07,02,2020,,2022-08-29T09:12:52,false,3,,7,,RUE,DU PUITS NEUF,44650,LEGE,,,44081,,,,,,,,,,,,,,,,,,,2008-01-01,A,CANTINE ECOLE NOTRE DAME,,,,56.29B,NAFRev2,O,-1.595124,46.883357,0.96,housenumber,7 Rue du Puits Neuf 44650 Legé,44081_0920_00007,G,7 RUE DU PUITS NEUF,
308640648,00017,30864064800017,O,,,,,,true,1,,,,,LA COLONNE,44650,LEGE,,,44081,,,,,,,,,,,,,,,,,,,1984-12-25,F,,,,,82.06,NAP,N,-1.593974,46.889126,0.94,street,Rue de la Colonne 44650 Legé,44081_0360,G,RUE DE LA COLONNE,
308829555,00017,30882955500017,O,1900-01-01,NN,,,2008-01-04T19:51:36,true,3,,,,PL,DE L EGLISE,44650,LEGE,,,44081,,,,,,,,,,,,,,,,,,,2008-01-01,A,,,,,75.00Z,NAFRev2,N,-1.596537,46.883938,0.83,street,Place de l'Eglise 44650 Legé,44081_0460,G,PLACE DE L EGLISE,
308866094,00011,30886609400011,O,1976-01-01,NN,,,2009-06-27T03:49:12,true,4,,4,,RUE,STE ANNE,44650,LEGE,,,44081,,,,,,,,,,,,,,,,,,,2007-02-28,F,,,,,93.0D,NAFRev1,O,-1.600424,46.885554,0.83,housenumber,4 Rue Sainte Anne 44650 Legé,44081_1088_00004,G,4 RUE SAINTE ANNE,
308897024,00011,30889702400011,O,1900-01-01,NN,,,2006-11-25T09:23:42,true,2,MAIRIE,11,,RUE,DE LA CHAUSSEE,44650,LEGE,,,44081,,,,,,,,,,,,,,,,,,,2003-08-31,F,,,,,,,N,-1.596055,46.885181,0.96,housenumber,11 Rue de la Chaussée 44650 Legé,44081_0280_00011,G,11 RUE DE LA CHAUSSEE,
308921782,00014,30892178200014,O,1976-06-21,NN,,,,false,4,,,,RUE,ARISTIDE BRIAND,44650,LEGE,,,44081,,,,,,,,,,,,,,,,,,,1994-09-28,F,,,,,70.2C,NAF1993,N,-1.591551,46.887969,0.95,street,Rue Aristide Briand 44650 Legé,44081_0016,G,RUE ARISTIDE BRIAND,
308994003,00108,30899400300108,O,2002-02-01,NN,,,2013-07-05T08:20:53,true,4,,11,,RUE,DE LA CHAUSSEE,44650,LEGE,,,44081,,,,,,,,,,,,,,,,,,,2013-06-30,F,,,,,86.90D,NAFRev2,N,-1.596055,46.885181,0.96,housenumber,11 Rue de la Chaussée 44650 Legé,44081_0280_00011,G,11 RUE DE LA CHAUSSEE,
309197226,00033,30919722600033,O,1995-01-01,NN,,,2016-09-08T04:03:24,true,3,,20,,RUE,DU PUITS NEUF,44650,LEGE,,,44081,,,,,,,,,,,,,,,,,,,2004-11-25,F,,,,,70.2C,NAFRev1,N,-1.594396,46.882658,0.96,housenumber,20 Rue du Puits Neuf 44650 Legé,44081_0920_00020,G,20 RUE DU PUITS NEUF,
309469484,00021,30946948400021,O,1980-10-01,12,2020,,2022-08-29T09:13:07,true,3,,,,,MAIRIE,44650,LEGE,,,44081,,,,,,,,,,,,,,,,,,,2008-01-01,A,,,,,88.10A,NAFRev2,O,-1.571799,46.885411,0.52,street,l'Hilairière 44650 Legé,44081_kgpl0c,G,L HILAIRIERE,
309469484,00039,30946948400039,O,1987-12-25,NN,,,2006-11-25T09:24:43,false,4,,,,,MAIRIE,44650,LEGE,,,44081,,,,,,,,,,,,,,,,,,,1996-06-24,F,,,,,74.1J,NAF1993,N,-1.571799,46.885411,0.52,street,l'Hilairière 44650 Legé,44081_kgpl0c,G,L HILAIRIERE,
309469484,00047,30946948400047,O,1987-12-25,NN,,,2006-11-25T09:24:43,false,3,,,,,MAIRIE,44650,LEGE,,,44081,,,,,,,,,,,,,,,,,,,1996-12-31,F,SERVICE AIDE MENAGERE AUX FAMILLES,,,,85.3J,NAF1993,O,-1.571799,46.885411,0.52,street,l'Hilairière 44650 Legé,44081_kgpl0c,G,L HILAIRIERE,
309469484,00054,30946948400054,O,1989-02-01,NN,,,2006-11-25T09:24:43,false,3,,,,,MAIRIE,44650,LEGE,,,44081,,,,,,,,,,,,,,,,,,,1996-12-31,F,SERVICE AUXILIAIRE DE VIE,,,,85.3J,NAF1993,O,-1.571799,46.885411,0.52,street,l'Hilairière 44650 Legé,44081_kgpl0c,G,L HILAIRIERE,
309469484,00062,30946948400062,O,1990-11-13,NN,,,2006-11-25T09:24:43,false,3,,,,,MAIRIE,44650,LEGE,,,44081,,,,,,,,,,,,,,,,,,,1996-12-31,F,SERVICE AIDE FAMILIALE,,,,85.3J,NAF1993,O,-1.571799,46.885411,0.52,street,l'Hilairière 44650 Legé,44081_kgpl0c,G,L HILAIRIERE,
309469484,00070,30946948400070,O,1994-01-01,NN,,,2006-11-25T09:24:43,false,3,,,,,MAIRIE,44650,LEGE,,,44081,,,,,,,,,,,,,,,,,,,1996-12-31,F,AIDE MENAGERE DE CORCOUE SUR LOGNE,,,,85.3J,NAF1993,O,-1.571799,46.885411,0.52,street,l'Hilairière 44650 Legé,44081_kgpl0c,G,L HILAIRIERE,
309469484,00088,30946948400088,O,1994-01-01,NN,,,2006-11-25T09:24:43,false,3,,,,,MAIRIE,44650,LEGE,,,44081,,,,,,,,,,,,,,,,,,,1996-12-31,F,AIDE MENAGERE DE TOUVOIS,,,,85.3J,NAF1993,O,-1.571799,46.885411,0.52,street,l'Hilairière 44650 Legé,44081_kgpl0c,G,L HILAIRIERE,
309545531,00019,30954553100019,O,1977-01-01,NN,,,,true,1,,,,,CENTRE COMMERCIAL,44650,LEGE,,,44081,,,,,,,,,,,,,,,,,,,2001-03-31,F,,,,,70.2C,NAF1993,N,6.1860165,48.6405315,0.66,poi.mall,(Galerie marchande) Houdemont,https://osm.org/way/115500752,G,,
309618049,00022,30961804900022,O,,NN,,,,true,1,,,,LD,LA PARNIERE,44650,LEGE,,,44081,,,,,,,,,,,,,,,,,,,,F,,,,,55.40,NAP,N,-1.579943,46.895254,0.93,street,les Moulins de la Parniere 44650 Legé,44081_C397,G,LES MOULINS DE LA PARNIERE,
310177647,00016,31017764700016,O,,NN,,,,true,1,,,,LD,RICHEBONNEMAISON JARDINIER,44650,LEGE,,,44081,,,,,,,,,,,,,,,,,,,1987-05-27,F,,,,,15.12,NAP,N,-1.613945,46.917839,0.31,street,la Maisonneuve 44650 Legé,44081_1pmztw,G,LA MAISONNEUVE,
310248158,00076,31024815800076,O,1997-02-05,NN,,,2010-10-17T05:09:10,true,10,,,,LD,LES PETITES DRONNIERES,44650,LEGE,,,44081,,,,,,,,,,,,,,,,,,,2010-09-30,F,SARDINES DU SOIR,,,,47.81Z,NAFRev2,N,-1.621706,46.902721,0.95,street,les Petites Dronnieres 44650 Legé,44081_C760,G,LES PETITES DRONNIERES,
310997879,00021,31099787900021,O,,NN,,,2006-11-25T09:27:38,true,1,,,,,MAIRIE,44650,LEGE,,,44081,,,,,,,,,,,,,,,,,,,1988-12-31,F,,,,,95.11,NAP,N,-1.571799,46.885411,0.52,street,l'Hilairière 44650 Legé,44081_kgpl0c,G,L HILAIRIERE,
311888754,00026,31188875400026,O,,,,,,true,1,,,,RTE,DE NANTES ZI STE MARIE,44650,LEGE,,,44081,,,,,,,,,,,,,,,,,,,1989-12-25,F,,,,,47.02,NAP,N,,,0,,,,,,
312660301,00028,31266030100028,O,1982-07-05,NN,,,2008-11-07T00:27:49,false,4,,,,,LA GARRELIERE,44650,LEGE,,,44081,,,,,,,,,,,,,,,,,,,2001-01-01,F,,,,,45.4A,NAF1993,O,-1.567204,46.900298,0.95,street,la Garreliere 44650 Legé,44081_www7p9,G,LA GARRELIERE,
313059321,00015,31305932100015,O,1978-01-01,NN,,,2014-07-08T00:17:11,true,4,,,,RUE,DU PAPIN,44650,LEGE,,,44081,,,,,,,,,,,,,,,,,,,2013-01-31,F,,,,,45.40Z,NAFRev2,N,-1.597163,46.883298,0.96,street,Rue du Papin 44650 Legé,44081_0760,G,RUE DU PAPIN,
313309080,00064,31330908000064,O,2007-01-01,,,,2016-08-30T13:40:44,false,1,LES VISITANDINES,,,AV,DES CLARISSES,44650,LEGE,,,44081,,,,,,,,,,,,,,,,,,,2007-01-01,A,,,,,65.12Z,NAFRev2,N,-1.593348,46.888806,0.83,street,Avenue des Clarisses 44650 Legé,44081_0328,G,AVENUE DES CLARISSES,